[dpdk-test-report] |FAILURE| pw32331 [PATCH RFC v3 1/1] lib: add compressdev API

sys_stv at intel.com sys_stv at intel.com
Tue Dec 26 12:38:12 CET 2017


Test-Label: Intel-compilation
Test-Status: FAILURE

http://dpdk.org/patch/32331

_Compilation issues_

Submitter: Fiona Trahe <fiona.trahe at intel.com>
Date: Fri, 15 Dec 2017 17:49:13 +0000
DPDK git baseline: Repo:dpdk, Branch:master, CommitID:91a0eabf00cbd78a8630ff1b9279af1b2db92122

Patch32331-32331 --> compile error
Build Summary: 16 Builds Done, 13 Successful, 3 Failures

Test environment and configuration as below:
OS: RHEL7.3_64
    Kernel Version:3.10.0-514.16.1.el7.x86_64
    CPU info:Intel(R) Xeon(R) CPU E5-2699 v4 @ 2.20GHz
    GCC Version:gcc (GCC) 4.8.5 20150623 (Red Hat 4.8.5-11)
    Clang Version:NA
    x86_64-native-linuxapp-icc
OS: FreeBSD10.3_64
    Kernel Version:10.3-RELEASE
    CPU info: Intel(R) Xeon(R) CPU E5-2699 v4 @ 2.20GHz (2194.97-MHz K8-class CPU)
    GCC Version:gcc (FreeBSD Ports Collection) 4.8.5
    Clang Version:3.4.1
    x86_64-native-bsdapp-clang
    x86_64-native-bsdapp-gcc
OS: FC24_64
    Kernel Version:4.9.13-100.fc24.x86_64
    CPU info:Intel(R) Xeon(R) CPU E5-2699 v3 @ 2.30GHz
    GCC Version:gcc (GCC) 6.2.1 20160916 (Red Hat 6.2.1-2)
    Clang Version:3.8.0
    x86_64-native-linuxapp-clang
    i686-native-linuxapp-gcc
    x86_64-native-linuxapp-gcc
    x86_64-native-linuxapp-gcc-shared
    x86_64-native-linuxapp-gcc-debug
OS: UB1604_64
    Kernel Version:4.4.0-78-generic
    CPU info:Intel(R) Xeon(R) CPU E5-2699 v3 @ 2.30GHz
    GCC Version:gcc (Ubuntu 5.4.0-6ubuntu1~16.04.4) 5.4.0 20160609
    Clang Version:3.8.0
    i686-native-linuxapp-gcc
    x86_64-native-linuxapp-clang
    x86_64-native-linuxapp-gcc-shared
    x86_64-native-linuxapp-gcc
OS: CentOS7_64
    Kernel Version:3.10.0-514.10.2.el7.x86_64
    CPU info:Intel(R) Xeon(R) CPU E5-2699 v3 @ 2.30GHz
    GCC Version:gcc (GCC) 4.8.5 20150623 (Red Hat 4.8.5-4)
    Clang Version:3.4.2
    i686-native-linuxapp-gcc
    x86_64-native-linuxapp-clang
    x86_64-native-linuxapp-gcc-shared
    x86_64-native-linuxapp-gcc

Failed Build #1:
OS: FC24_64
Target: x86_64-native-linuxapp-gcc-shared

SYMLINK-FILE include/rte_comp.h
  SYMLINK-FILE include/rte_compressdev.h
  SYMLINK-FILE include/rte_compressdev_pmd.h  LD librte_compressdev.so.1.1
rte_compressdev.o: In function `rte_comp_op_init':
rte_compressdev.c:(.text+0x21): undefined reference to `rte_mem_virt2iova'
rte_compressdev.o: In function `rte_compressdev_pmd_allocate':
rte_compressdev.c:(.text+0x49b): undefined reference to `rte_log'
rte_compressdev.c:(.text+0x4c3): undefined reference to `rte_eal_process_type'
rte_compressdev.c:(.text+0x4cf): undefined reference to `rte_memzone_lookup'
rte_compressdev.c:(.text+0x4e1): undefined reference to `rte_eal_process_type'
rte_compressdev.c:(.text+0x54a): undefined reference to `rte_memzone_reserve'
rte_compressdev.c:(.text+0x59a): undefined reference to `rte_log'
rte_compressdev.o: In function `rte_compressdev_queue_pair_start':
rte_compressdev.c:(.text+0x66b): undefined reference to `rte_log'
rte_compressdev.o: In function `rte_compressdev_queue_pair_stop':
rte_compressdev.c:(.text+0x73b): undefined reference to `rte_log'
rte_compressdev.o: In function `rte_compressdev_configure':
rte_compressdev.c:(.text+0x8c6): undefined reference to `rte_log'
rte_compressdev.c:(.text+0x8fb): undefined reference to `rte_realloc'
rte_compressdev.c:(.text+0x994): undefined reference to `rte_zmalloc_socket'
rte_compressdev.c:(.text+0x9e9): undefined reference to `rte_log'
rte_compressdev.c:(.text+0xa45): undefined reference to `rte_log'
rte_compressdev.c:(.text+0xa8a): undefined reference to `rte_log'
rte_compressdev.c:(.text+0xad2): undefined reference to `rte_log'
rte_compressdev.c:(.text+0xb17): undefined reference to `rte_log'
rte_compressdev.o:rte_compressdev.c:(.text+0xbf7): more undefined references to `rte_log' follow
rte_compressdev.o: In function `rte_compressdev_callback_register':
rte_compressdev.c:(.text+0x1247): undefined reference to `rte_zmalloc'
rte_compressdev.c:(.text+0x12b2): undefined reference to `rte_log'
rte_compressdev.o: In function `rte_compressdev_callback_unregister':
rte_compressdev.c:(.text+0x1386): undefined reference to `rte_free'
rte_compressdev.c:(.text+0x13e9): undefined reference to `rte_log'
rte_compressdev.o: In function `rte_compressdev_session_init':
rte_compressdev.c:(.text+0x155a): undefined reference to `rte_log'
rte_compressdev.o: In function `rte_compressdev_session_create':
rte_compressdev.c:(.text+0x1581): undefined reference to `per_lcore__lcore_id'
rte_compressdev.c:(.text+0x15e5): undefined reference to `rte_mempool_ops_table'
rte_compressdev.c:(.text+0x164e): undefined reference to `rte_mempool_ops_table'
rte_compressdev.c:(.text+0x1684): undefined reference to `__rte_panic'
rte_compressdev.c:(.text+0x16b0): undefined reference to `rte_log'
rte_compressdev.o: In function `rte_compressdev_queue_pair_attach_session':
rte_compressdev.c:(.text+0x1760): undefined reference to `rte_log'
rte_compressdev.c:(.text+0x179b): undefined reference to `rte_log'
rte_compressdev.o: In function `rte_compressdev_queue_pair_detach_session':
rte_compressdev.c:(.text+0x1853): undefined reference to `rte_log'
rte_compressdev.c:(.text+0x188e): undefined reference to `rte_log'
rte_compressdev.o: In function `rte_compressdev_session_terminate':
rte_compressdev.c:(.text+0x1937): undefined reference to `per_lcore__lcore_id'
rte_compressdev.c:(.text+0x19bd): undefined reference to `rte_mempool_ops_table'
rte_compressdev.c:(.text+0x19eb): undefined reference to `rte_mempool_ops_table'
rte_compressdev.c:(.text+0x1a2a): undefined reference to `__rte_panic'
rte_compressdev.o: In function `rte_comp_op_pool_create':
rte_compressdev.c:(.text+0x1ab6): undefined reference to `rte_mempool_lookup'
rte_compressdev.c:(.text+0x1b39): undefined reference to `rte_mempool_create'
rte_compressdev.c:(.text+0x1b93): undefined reference to `rte_log'
rte_compressdev.c:(.text+0x1bce): undefined reference to `rte_log'
rte_compressdev.o: In function `rte_compressdev_driver_id_get':
rte_compressdev.c:(.text+0x1ce6): undefined reference to `rte_log'
rte_compressdev_pmd.o: In function `rte_compressdev_pmd_parse_input_args':
rte_compressdev_pmd.c:(.text+0xc4): undefined reference to `rte_kvargs_parse'
rte_compressdev_pmd.c:(.text+0xea): undefined reference to `rte_kvargs_process'
rte_compressdev_pmd.c:(.text+0x10b): undefined reference to `rte_kvargs_process'
rte_compressdev_pmd.c:(.text+0x12b): undefined reference to `rte_kvargs_process'
rte_compressdev_pmd.c:(.text+0x136): undefined reference to `rte_kvargs_free'
rte_compressdev_pmd.o: In function `rte_compressdev_pmd_create':
rte_compressdev_pmd.c:(.text+0x1ad): undefined reference to `rte_log'
rte_compressdev_pmd.c:(.text+0x1da): undefined reference to `rte_log'
rte_compressdev_pmd.c:(.text+0x1f9): undefined reference to `rte_eal_process_type'
rte_compressdev_pmd.c:(.text+0x248): undefined reference to `rte_zmalloc_socket'
rte_compressdev_pmd.c:(.text+0x288): undefined reference to `rte_log'
rte_compressdev_pmd.c:(.text+0x2ca): undefined reference to `rte_log'
rte_compressdev_pmd.c:(.text+0x2fe): undefined reference to `rte_log'
rte_compressdev_pmd.o: In function `rte_compressdev_pmd_destroy':
rte_compressdev_pmd.c:(.text+0x344): undefined reference to `rte_log'
rte_compressdev_pmd.c:(.text+0x361): undefined reference to `rte_eal_process_type'
rte_compressdev_pmd.c:(.text+0x391): undefined reference to `rte_free'
collect2: error: ld returned 1 exit status
/home/patchWorkOrg/compilation/mk/rte.lib.mk:126: recipe for target 'librte_compressdev.so.1.1' failed
/home/patchWorkOrg/compilation/mk/rte.subdir.mk:63: recipe for target 'librte_compressdev' failed
/home/patchWorkOrg/compilation/mk/rte.sdkbuild.mk:76: recipe for target 'lib' failed
/home/patchWorkOrg/compilation/mk/rte.sdkroot.mk:128: recipe for target 'all' failed
/home/patchWorkOrg/compilation/mk/rte.sdkinstall.mk:85: recipe for target 'pre_install' failed
/home/patchWorkOrg/compilation/mk/rte.sdkroot.mk:107: recipe for target 'install' failed


Failed Build #2:
OS: UB1604_64
Target: x86_64-native-linuxapp-gcc-shared

SYMLINK-FILE include/rte_comp.h
  SYMLINK-FILE include/rte_compressdev.h
  SYMLINK-FILE include/rte_compressdev_pmd.h  LD librte_compressdev.so.1.1
rte_compressdev.o: In function `rte_comp_op_init':
rte_compressdev.c:(.text+0x21): undefined reference to `rte_mem_virt2iova'
rte_compressdev.o: In function `rte_compressdev_pmd_allocate':
rte_compressdev.c:(.text+0x4c0): undefined reference to `rte_log'
rte_compressdev.c:(.text+0x500): undefined reference to `rte_eal_process_type'
rte_compressdev.c:(.text+0x50e): undefined reference to `rte_memzone_lookup'
rte_compressdev.c:(.text+0x520): undefined reference to `rte_eal_process_type'
rte_compressdev.c:(.text+0x595): undefined reference to `rte_memzone_reserve'
rte_compressdev.c:(.text+0x5e0): undefined reference to `rte_log'
rte_compressdev.o: In function `rte_compressdev_queue_pair_start':
rte_compressdev.c:(.text+0x69a): undefined reference to `rte_log'
rte_compressdev.o: In function `rte_compressdev_queue_pair_stop':
rte_compressdev.c:(.text+0x75a): undefined reference to `rte_log'
rte_compressdev.o: In function `rte_compressdev_configure':
rte_compressdev.c:(.text+0x8e7): undefined reference to `rte_log'
rte_compressdev.c:(.text+0x92b): undefined reference to `rte_realloc'
rte_compressdev.c:(.text+0x9c6): undefined reference to `rte_zmalloc_socket'
rte_compressdev.c:(.text+0xa56): undefined reference to `rte_log'
rte_compressdev.c:(.text+0xaa6): undefined reference to `rte_log'
rte_compressdev.c:(.text+0xae6): undefined reference to `rte_log'
rte_compressdev.c:(.text+0xb25): undefined reference to `rte_log'
rte_compressdev.c:(.text+0xb6c): undefined reference to `rte_log'
rte_compressdev.o:rte_compressdev.c:(.text+0xc06): more undefined references to `rte_log' follow
rte_compressdev.o: In function `rte_compressdev_callback_register':
rte_compressdev.c:(.text+0x11d7): undefined reference to `rte_zmalloc'
rte_compressdev.c:(.text+0x1246): undefined reference to `rte_log'
rte_compressdev.o: In function `rte_compressdev_callback_unregister':
rte_compressdev.c:(.text+0x1315): undefined reference to `rte_free'
rte_compressdev.c:(.text+0x1382): undefined reference to `rte_log'
rte_compressdev.o: In function `rte_compressdev_session_init':
rte_compressdev.c:(.text+0x14e7): undefined reference to `rte_log'
rte_compressdev.o: In function `rte_compressdev_session_create':
rte_compressdev.c:(.text+0x1521): undefined reference to `per_lcore__lcore_id'
rte_compressdev.c:(.text+0x15b9): undefined reference to `rte_mempool_ops_table'
rte_compressdev.c:(.text+0x15ec): undefined reference to `rte_mempool_ops_table'
rte_compressdev.c:(.text+0x1634): undefined reference to `__rte_panic'
rte_compressdev.c:(.text+0x1660): undefined reference to `rte_log'
rte_compressdev.o: In function `rte_compressdev_queue_pair_attach_session':
rte_compressdev.c:(.text+0x16ea): undefined reference to `rte_log'
rte_compressdev.c:(.text+0x1722): undefined reference to `rte_log'
rte_compressdev.o: In function `rte_compressdev_queue_pair_detach_session':
rte_compressdev.c:(.text+0x17ad): undefined reference to `rte_log'
rte_compressdev.c:(.text+0x17e5): undefined reference to `rte_log'
rte_compressdev.o: In function `rte_compressdev_session_terminate':
rte_compressdev.c:(.text+0x18ab): undefined reference to `per_lcore__lcore_id'
rte_compressdev.c:(.text+0x1931): undefined reference to `rte_mempool_ops_table'
rte_compressdev.c:(.text+0x196b): undefined reference to `rte_mempool_ops_table'
rte_compressdev.c:(.text+0x19a4): undefined reference to `__rte_panic'
rte_compressdev.o: In function `rte_comp_op_pool_create':
rte_compressdev.c:(.text+0x1a33): undefined reference to `rte_mempool_lookup'
rte_compressdev.c:(.text+0x1aa9): undefined reference to `rte_mempool_create'
rte_compressdev.c:(.text+0x1afe): undefined reference to `rte_log'
rte_compressdev.o: In function `rte_compressdev_driver_id_get':
rte_compressdev.c:(.text+0x1c26): undefined reference to `rte_log'
rte_compressdev_pmd.o: In function `rte_compressdev_pmd_parse_input_args':
rte_compressdev_pmd.c:(.text+0xf7): undefined reference to `rte_kvargs_parse'
rte_compressdev_pmd.c:(.text+0x119): undefined reference to `rte_kvargs_process'
rte_compressdev_pmd.c:(.text+0x139): undefined reference to `rte_kvargs_process'
rte_compressdev_pmd.c:(.text+0x158): undefined reference to `rte_kvargs_process'
rte_compressdev_pmd.c:(.text+0x162): undefined reference to `rte_kvargs_free'
rte_compressdev_pmd.o: In function `rte_compressdev_pmd_create':
rte_compressdev_pmd.c:(.text+0x1d0): undefined reference to `rte_log'
rte_compressdev_pmd.c:(.text+0x203): undefined reference to `rte_log'
rte_compressdev_pmd.c:(.text+0x222): undefined reference to `rte_eal_process_type'
rte_compressdev_pmd.c:(.text+0x268): undefined reference to `rte_zmalloc_socket'
rte_compressdev_pmd.c:(.text+0x2ae): undefined reference to `rte_log'
rte_compressdev_pmd.c:(.text+0x2f3): undefined reference to `rte_log'
rte_compressdev_pmd.c:(.text+0x329): undefined reference to `rte_log'
rte_compressdev_pmd.o: In function `rte_compressdev_pmd_destroy':
rte_compressdev_pmd.c:(.text+0x36f): undefined reference to `rte_log'
rte_compressdev_pmd.c:(.text+0x389): undefined reference to `rte_eal_process_type'
rte_compressdev_pmd.c:(.text+0x3b1): undefined reference to `rte_free'
collect2: error: ld returned 1 exit status
/home/patchWorkOrg/compilation/mk/rte.lib.mk:126: recipe for target 'librte_compressdev.so.1.1' failed
/home/patchWorkOrg/compilation/mk/rte.subdir.mk:63: recipe for target 'librte_compressdev' failed
/home/patchWorkOrg/compilation/mk/rte.sdkbuild.mk:76: recipe for target 'lib' failed
/home/patchWorkOrg/compilation/mk/rte.sdkroot.mk:128: recipe for target 'all' failed
/home/patchWorkOrg/compilation/mk/rte.sdkinstall.mk:85: recipe for target 'pre_install' failed
/home/patchWorkOrg/compilation/mk/rte.sdkroot.mk:107: recipe for target 'install' failed


Failed Build #3:
OS: CentOS7_64
Target: x86_64-native-linuxapp-gcc-shared

SYMLINK-FILE include/rte_comp.h
  SYMLINK-FILE include/rte_compressdev.h
  SYMLINK-FILE include/rte_compressdev_pmd.h  LD librte_compressdev.so.1.1
rte_compressdev.o: In function `rte_comp_op_init':
rte_compressdev.c:(.text+0x21): undefined reference to `rte_mem_virt2iova'
rte_compressdev.o: In function `rte_compressdev_pmd_allocate':
rte_compressdev.c:(.text+0x4a8): undefined reference to `rte_log'
rte_compressdev.c:(.text+0x4d6): undefined reference to `rte_eal_process_type'
rte_compressdev.c:(.text+0x4e4): undefined reference to `rte_memzone_lookup'
rte_compressdev.c:(.text+0x4f2): undefined reference to `rte_eal_process_type'
rte_compressdev.c:(.text+0x56c): undefined reference to `rte_memzone_reserve'
rte_compressdev.c:(.text+0x61f): undefined reference to `rte_log'
rte_compressdev.o: In function `rte_compressdev_queue_pair_start':
rte_compressdev.c:(.text+0x6dc): undefined reference to `rte_log'
rte_compressdev.o: In function `rte_compressdev_queue_pair_stop':
rte_compressdev.c:(.text+0x79c): undefined reference to `rte_log'
rte_compressdev.o: In function `rte_compressdev_configure':
rte_compressdev.c:(.text+0x905): undefined reference to `rte_log'
rte_compressdev.c:(.text+0x933): undefined reference to `rte_realloc'
rte_compressdev.c:(.text+0x9a6): undefined reference to `rte_zmalloc_socket'
rte_compressdev.c:(.text+0x9ee): undefined reference to `rte_log'
rte_compressdev.c:(.text+0xa50): undefined reference to `rte_log'
rte_compressdev.c:(.text+0xa8a): undefined reference to `rte_log'
rte_compressdev.c:(.text+0xad7): undefined reference to `rte_log'
rte_compressdev.c:(.text+0xb11): undefined reference to `rte_log'
rte_compressdev.o:rte_compressdev.c:(.text+0xbd8): more undefined references to `rte_log' follow
rte_compressdev.o: In function `rte_compressdev_callback_register':
rte_compressdev.c:(.text+0x1287): undefined reference to `rte_zmalloc'
rte_compressdev.c:(.text+0x12ea): undefined reference to `rte_log'
rte_compressdev.o: In function `rte_compressdev_callback_unregister':
rte_compressdev.c:(.text+0x13b2): undefined reference to `rte_free'
rte_compressdev.c:(.text+0x141f): undefined reference to `rte_log'
rte_compressdev.o: In function `rte_compressdev_session_init':
rte_compressdev.c:(.text+0x1589): undefined reference to `rte_log'
rte_compressdev.o: In function `rte_compressdev_session_create':
rte_compressdev.c:(.text+0x15ba): undefined reference to `per_lcore__lcore_id'
rte_compressdev.c:(.text+0x1641): undefined reference to `rte_mempool_ops_table'
rte_compressdev.c:(.text+0x1688): undefined reference to `rte_log'
rte_compressdev.c:(.text+0x16a1): undefined reference to `rte_mempool_ops_table'
rte_compressdev.o: In function `rte_compressdev_queue_pair_attach_session':
rte_compressdev.c:(.text+0x175d): undefined reference to `rte_log'
rte_compressdev.c:(.text+0x1795): undefined reference to `rte_log'
rte_compressdev.o: In function `rte_compressdev_queue_pair_detach_session':
rte_compressdev.c:(.text+0x1830): undefined reference to `rte_log'
rte_compressdev.c:(.text+0x1868): undefined reference to `rte_log'
rte_compressdev.o: In function `rte_compressdev_session_terminate':
rte_compressdev.c:(.text+0x1920): undefined reference to `per_lcore__lcore_id'
rte_compressdev.c:(.text+0x1948): undefined reference to `rte_mempool_ops_table'
rte_compressdev.c:(.text+0x19a9): undefined reference to `rte_mempool_ops_table'
rte_compressdev.o: In function `rte_comp_op_pool_create':
rte_compressdev.c:(.text+0x1a65): undefined reference to `rte_mempool_lookup'
rte_compressdev.c:(.text+0x1af0): undefined reference to `rte_mempool_create'
rte_compressdev.c:(.text+0x1b40): undefined reference to `rte_log'
rte_compressdev.o: In function `rte_compressdev_driver_id_get':
rte_compressdev.c:(.text+0x1c66): undefined reference to `rte_log'
rte_compressdev.o: In function `rte_mempool_get_ops.part.1':
rte_compressdev.c:(.text.unlikely+0x25): undefined reference to `__rte_panic'
rte_compressdev_pmd.o: In function `rte_compressdev_pmd_parse_input_args':
rte_compressdev_pmd.c:(.text+0xd4): undefined reference to `rte_kvargs_parse'
rte_compressdev_pmd.c:(.text+0xfb): undefined reference to `rte_kvargs_process'
rte_compressdev_pmd.c:(.text+0x11c): undefined reference to `rte_kvargs_process'
rte_compressdev_pmd.c:(.text+0x13b): undefined reference to `rte_kvargs_process'
rte_compressdev_pmd.c:(.text+0x145): undefined reference to `rte_kvargs_free'
rte_compressdev_pmd.o: In function `rte_compressdev_pmd_create':
rte_compressdev_pmd.c:(.text+0x1b4): undefined reference to `rte_log'
rte_compressdev_pmd.c:(.text+0x1ed): undefined reference to `rte_log'
rte_compressdev_pmd.c:(.text+0x209): undefined reference to `rte_eal_process_type'
rte_compressdev_pmd.c:(.text+0x250): undefined reference to `rte_zmalloc_socket'
rte_compressdev_pmd.c:(.text+0x29c): undefined reference to `rte_log'
rte_compressdev_pmd.c:(.text+0x2e8): undefined reference to `rte_log'
rte_compressdev_pmd.c:(.text+0x31c): undefined reference to `rte_log'
rte_compressdev_pmd.o: In function `rte_compressdev_pmd_destroy':
rte_compressdev_pmd.c:(.text+0x35f): undefined reference to `rte_log'
rte_compressdev_pmd.c:(.text+0x379): undefined reference to `rte_eal_process_type'
rte_compressdev_pmd.c:(.text+0x3a9): undefined reference to `rte_free'
collect2: error: ld returned 1 exit status


DPDK STV team


More information about the test-report mailing list