[dpdk-test-report] |FAILURE| pw18811 [PATCH v2] Scheduler: add driver for scheduler crypto pmd

sys_stv at intel.com sys_stv at intel.com
Tue Jan 3 19:04:39 CET 2017


Test-Label: Intel compilation
Test-Status: FAILURE

http://dpdk.org/patch/18811

_Compilation issues_

Submitter: Fan Zhang <roy.fan.zhang at intel.com>
Date: Tue,  3 Jan 2017 17:08:00 +0000
DPDK git baseline: Repo:dpdk, Branch:master, CommitID:eac901ce29be559b1bb5c5da33fe2bf5c0b4bfd6

Patch18811-18811 --> compile error
Build Summary: 18 Builds Done, 0 Successful, 18 Failures

Test environment and configuration as below:
OS: RHEL7.2_64
    Kernel Version:3.10.0-327.el7.x86_64
    CPU info:Intel(R) Xeon(R) CPU E5-2699 v4 @ 2.20GHz
    GCC Version:gcc (GCC) 4.8.5 20150623 (Red Hat 4.8.5-4)
    Clang Version:3.4.2
    i686-native-linuxapp-gcc
    x86_64-native-linuxapp-gcc
    x86_64-native-linuxapp-gcc-shared
OS: FreeBSD10.3_64
    Kernel Version:10.3-RELEASE
    CPU info: Intel(R) Xeon(R) CPU E5-2699 v4 @ 2.20GHz (2194.97-MHz K8-class CPU)
    GCC Version:gcc (FreeBSD Ports Collection) 4.8.5
    Clang Version:3.4.1
    x86_64-native-bsdapp-clang
    x86_64-native-bsdapp-gcc
OS: FC24_64
    Kernel Version:4.8.6-201.fc24.x86_64
    CPU info:Intel(R) Xeon(R) CPU E5-2699 v3 @ 2.30GHz
    GCC Version:gcc (GCC) 6.2.1 20160916 (Red Hat 6.2.1-2)
    Clang Version:3.8.0
    x86_64-native-linuxapp-gcc-debug
    i686-native-linuxapp-gcc
    x86_64-native-linuxapp-clang
    x86_64-native-linuxapp-gcc-shared
    x86_64-native-linuxapp-gcc
OS: UB1604_64
    Kernel Version:4.4.0-53-generic
    CPU info:Intel(R) Xeon(R) CPU E5-2699 v3 @ 2.30GHz
    GCC Version:gcc (Ubuntu 5.4.0-6ubuntu1~16.04.4) 5.4.0 20160609
    Clang Version:3.8.0
    i686-native-linuxapp-gcc
    x86_64-native-linuxapp-gcc
    x86_64-native-linuxapp-gcc-shared
    x86_64-native-linuxapp-clang
OS: CentOS7_64
    Kernel Version:3.10.0-327.el7.x86_64
    CPU info:Intel(R) Xeon(R) CPU E5-2699 v3 @ 2.30GHz
    GCC Version:gcc (GCC) 4.8.5 20150623 (Red Hat 4.8.5-4)
    Clang Version:3.4.2
    i686-native-linuxapp-gcc
    x86_64-native-linuxapp-clang
    x86_64-native-linuxapp-gcc-shared
    x86_64-native-linuxapp-gcc

Failed Build #1:
OS: RHEL7.2_64
Target: i686-native-linuxapp-gcc
/home/patchWorkOrg/compilation/drivers/crypto/qat/qat_adf/qat_algs_build_desc.c:59:70: fatal error: openssl/sha.h: No such file or directory
 #include <openssl/sha.h> /* Needed to calculate pre-compute values */
                                                                      ^
compilation terminated.


Failed Build #2:
OS: RHEL7.2_64
Target: x86_64-native-linuxapp-gcc
/home/patchWorkOrg/compilation/drivers/crypto/aesni_mb/Makefile:35: *** "Please define AESNI_MULTI_BUFFER_LIB_PATH environment variable".  Stop.


Failed Build #3:
OS: RHEL7.2_64
Target: x86_64-native-linuxapp-gcc-shared

/home/patchWorkOrg/compilation/drivers/crypto/aesni_mb/Makefile:35: *** "Please define AESNI_MULTI_BUFFER_LIB_PATH environment variable".  Stop.


Failed Build #4:
OS: FreeBSD10.3_64
Target: x86_64-native-bsdapp-clang
/home/patchWorkOrg/compilation/drivers/crypto/aesni_mb/Makefile:35: *** "Please define AESNI_MULTI_BUFFER_LIB_PATH environment variable".  Stop.
/home/patchWorkOrg/compilation/mk/rte.subdir.mk:61: recipe for target 'aesni_mb' failed
/home/patchWorkOrg/compilation/mk/rte.subdir.mk:61: recipe for target 'crypto' failed
/home/patchWorkOrg/compilation/mk/rte.sdkbuild.mk:78: recipe for target 'drivers' failed
/home/patchWorkOrg/compilation/mk/rte.sdkroot.mk:126: recipe for target 'all' failed
/home/patchWorkOrg/compilation/mk/rte.sdkinstall.mk:85: recipe for target 'pre_install' failed
/home/patchWorkOrg/compilation/mk/rte.sdkroot.mk:101: recipe for target 'install' failed


Failed Build #5:
OS: FreeBSD10.3_64
Target: x86_64-native-bsdapp-gcc
/home/patchWorkOrg/compilation/drivers/crypto/aesni_mb/Makefile:35: *** "Please define AESNI_MULTI_BUFFER_LIB_PATH environment variable".  Stop.
/home/patchWorkOrg/compilation/mk/rte.subdir.mk:61: recipe for target 'aesni_mb' failed
/home/patchWorkOrg/compilation/mk/rte.subdir.mk:61: recipe for target 'crypto' failed
/home/patchWorkOrg/compilation/mk/rte.sdkbuild.mk:78: recipe for target 'drivers' failed
/home/patchWorkOrg/compilation/mk/rte.sdkroot.mk:126: recipe for target 'all' failed
/home/patchWorkOrg/compilation/mk/rte.sdkinstall.mk:85: recipe for target 'pre_install' failed
/home/patchWorkOrg/compilation/mk/rte.sdkroot.mk:101: recipe for target 'install' failed


Failed Build #6:
OS: FC24_64
Target: x86_64-native-linuxapp-gcc-debug

/home/patchWorkOrg/compilation/drivers/crypto/aesni_mb/Makefile:35: *** "Please define AESNI_MULTI_BUFFER_LIB_PATH environment variable".  Stop.
/home/patchWorkOrg/compilation/mk/rte.subdir.mk:61: recipe for target 'aesni_mb' failed
/home/patchWorkOrg/compilation/mk/rte.subdir.mk:61: recipe for target 'crypto' failed
/home/patchWorkOrg/compilation/mk/rte.sdkbuild.mk:78: recipe for target 'drivers' failed
/home/patchWorkOrg/compilation/mk/rte.sdkroot.mk:126: recipe for target 'all' failed
/home/patchWorkOrg/compilation/mk/rte.sdkinstall.mk:85: recipe for target 'pre_install' failed
/home/patchWorkOrg/compilation/mk/rte.sdkroot.mk:101: recipe for target 'install' failed


Failed Build #7:
OS: FC24_64
Target: i686-native-linuxapp-gcc
/home/patchWorkOrg/compilation/drivers/crypto/qat/qat_adf/qat_algs_build_desc.c:59:70: fatal error: openssl/sha.h: No such file or directory
 #include <openssl/sha.h> /* Needed to calculate pre-compute values */
                                                                      ^
compilation terminated.
/home/patchWorkOrg/compilation/mk/internal/rte.compile-pre.mk:138: recipe for target 'qat_adf/qat_algs_build_desc.o' failed
/home/patchWorkOrg/compilation/mk/rte.subdir.mk:61: recipe for target 'qat' failed
/home/patchWorkOrg/compilation/mk/rte.subdir.mk:61: recipe for target 'crypto' failed
/home/patchWorkOrg/compilation/mk/rte.sdkbuild.mk:78: recipe for target 'drivers' failed
/home/patchWorkOrg/compilation/mk/rte.sdkroot.mk:126: recipe for target 'all' failed
/home/patchWorkOrg/compilation/mk/rte.sdkinstall.mk:85: recipe for target 'pre_install' failed
/home/patchWorkOrg/compilation/mk/rte.sdkroot.mk:101: recipe for target 'install' failed


Failed Build #8:
OS: FC24_64
Target: x86_64-native-linuxapp-clang
/home/patchWorkOrg/compilation/drivers/crypto/aesni_mb/Makefile:35: *** "Please define AESNI_MULTI_BUFFER_LIB_PATH environment variable".  Stop.
/home/patchWorkOrg/compilation/mk/rte.subdir.mk:61: recipe for target 'aesni_mb' failed
/home/patchWorkOrg/compilation/mk/rte.subdir.mk:61: recipe for target 'crypto' failed
/home/patchWorkOrg/compilation/mk/rte.sdkbuild.mk:78: recipe for target 'drivers' failed
/home/patchWorkOrg/compilation/mk/rte.sdkroot.mk:126: recipe for target 'all' failed
/home/patchWorkOrg/compilation/mk/rte.sdkinstall.mk:85: recipe for target 'pre_install' failed
/home/patchWorkOrg/compilation/mk/rte.sdkroot.mk:101: recipe for target 'install' failed


Failed Build #9:
OS: FC24_64
Target: x86_64-native-linuxapp-gcc-shared

/home/patchWorkOrg/compilation/drivers/crypto/aesni_mb/Makefile:35: *** "Please define AESNI_MULTI_BUFFER_LIB_PATH environment variable".  Stop.
/home/patchWorkOrg/compilation/mk/rte.subdir.mk:61: recipe for target 'aesni_mb' failed
/home/patchWorkOrg/compilation/mk/rte.subdir.mk:61: recipe for target 'crypto' failed
/home/patchWorkOrg/compilation/mk/rte.sdkbuild.mk:78: recipe for target 'drivers' failed
/home/patchWorkOrg/compilation/mk/rte.sdkroot.mk:126: recipe for target 'all' failed
/home/patchWorkOrg/compilation/mk/rte.sdkinstall.mk:85: recipe for target 'pre_install' failed
/home/patchWorkOrg/compilation/mk/rte.sdkroot.mk:101: recipe for target 'install' failed


Failed Build #10:
OS: FC24_64
Target: x86_64-native-linuxapp-gcc
/home/patchWorkOrg/compilation/drivers/crypto/aesni_mb/Makefile:35: *** "Please define AESNI_MULTI_BUFFER_LIB_PATH environment variable".  Stop.
/home/patchWorkOrg/compilation/mk/rte.subdir.mk:61: recipe for target 'aesni_mb' failed
/home/patchWorkOrg/compilation/mk/rte.subdir.mk:61: recipe for target 'crypto' failed
/home/patchWorkOrg/compilation/mk/rte.sdkbuild.mk:78: recipe for target 'drivers' failed
/home/patchWorkOrg/compilation/mk/rte.sdkroot.mk:126: recipe for target 'all' failed
/home/patchWorkOrg/compilation/mk/rte.sdkinstall.mk:85: recipe for target 'pre_install' failed
/home/patchWorkOrg/compilation/mk/rte.sdkroot.mk:101: recipe for target 'install' failed


Failed Build #11:
OS: UB1604_64
Target: i686-native-linuxapp-gcc
/home/patchWorkOrg/compilation/drivers/crypto/qat/qat_adf/qat_algs_build_desc.c:59:70: fatal error: openssl/sha.h: No such file or directory
compilation terminated.
/home/patchWorkOrg/compilation/mk/internal/rte.compile-pre.mk:138: recipe for target 'qat_adf/qat_algs_build_desc.o' failed
/home/patchWorkOrg/compilation/mk/rte.subdir.mk:61: recipe for target 'qat' failed
/home/patchWorkOrg/compilation/mk/rte.subdir.mk:61: recipe for target 'crypto' failed
/home/patchWorkOrg/compilation/mk/rte.sdkbuild.mk:78: recipe for target 'drivers' failed
/home/patchWorkOrg/compilation/mk/rte.sdkroot.mk:126: recipe for target 'all' failed
/home/patchWorkOrg/compilation/mk/rte.sdkinstall.mk:85: recipe for target 'pre_install' failed
/home/patchWorkOrg/compilation/mk/rte.sdkroot.mk:101: recipe for target 'install' failed


Failed Build #12:
OS: UB1604_64
Target: x86_64-native-linuxapp-gcc
/home/patchWorkOrg/compilation/drivers/crypto/aesni_mb/Makefile:35: *** "Please define AESNI_MULTI_BUFFER_LIB_PATH environment variable".  Stop.
/home/patchWorkOrg/compilation/mk/rte.subdir.mk:61: recipe for target 'aesni_mb' failed
/home/patchWorkOrg/compilation/mk/rte.subdir.mk:61: recipe for target 'crypto' failed
/home/patchWorkOrg/compilation/mk/rte.sdkbuild.mk:78: recipe for target 'drivers' failed
/home/patchWorkOrg/compilation/mk/rte.sdkroot.mk:126: recipe for target 'all' failed
/home/patchWorkOrg/compilation/mk/rte.sdkinstall.mk:85: recipe for target 'pre_install' failed
/home/patchWorkOrg/compilation/mk/rte.sdkroot.mk:101: recipe for target 'install' failed


Failed Build #13:
OS: UB1604_64
Target: x86_64-native-linuxapp-gcc-shared

/home/patchWorkOrg/compilation/drivers/crypto/aesni_mb/Makefile:35: *** "Please define AESNI_MULTI_BUFFER_LIB_PATH environment variable".  Stop.
/home/patchWorkOrg/compilation/mk/rte.subdir.mk:61: recipe for target 'aesni_mb' failed
/home/patchWorkOrg/compilation/mk/rte.subdir.mk:61: recipe for target 'crypto' failed
/home/patchWorkOrg/compilation/mk/rte.sdkbuild.mk:78: recipe for target 'drivers' failed
/home/patchWorkOrg/compilation/mk/rte.sdkroot.mk:126: recipe for target 'all' failed
/home/patchWorkOrg/compilation/mk/rte.sdkinstall.mk:85: recipe for target 'pre_install' failed
/home/patchWorkOrg/compilation/mk/rte.sdkroot.mk:101: recipe for target 'install' failed


Failed Build #14:
OS: UB1604_64
Target: x86_64-native-linuxapp-clang
/home/patchWorkOrg/compilation/drivers/crypto/aesni_mb/Makefile:35: *** "Please define AESNI_MULTI_BUFFER_LIB_PATH environment variable".  Stop.
/home/patchWorkOrg/compilation/mk/rte.subdir.mk:61: recipe for target 'aesni_mb' failed
/home/patchWorkOrg/compilation/mk/rte.subdir.mk:61: recipe for target 'crypto' failed
/home/patchWorkOrg/compilation/mk/rte.sdkbuild.mk:78: recipe for target 'drivers' failed
/home/patchWorkOrg/compilation/mk/rte.sdkroot.mk:126: recipe for target 'all' failed
/home/patchWorkOrg/compilation/mk/rte.sdkinstall.mk:85: recipe for target 'pre_install' failed
/home/patchWorkOrg/compilation/mk/rte.sdkroot.mk:101: recipe for target 'install' failed


Failed Build #15:
OS: CentOS7_64
Target: i686-native-linuxapp-gcc
/home/patchWorkOrg/compilation/drivers/crypto/qat/qat_adf/qat_algs_build_desc.c:59:70: fatal error: openssl/sha.h: No such file or directory
 #include <openssl/sha.h> /* Needed to calculate pre-compute values */
                                                                      ^
compilation terminated.


Failed Build #16:
OS: CentOS7_64
Target: x86_64-native-linuxapp-clang
/home/patchWorkOrg/compilation/drivers/crypto/aesni_mb/Makefile:35: *** "Please define AESNI_MULTI_BUFFER_LIB_PATH environment variable".  Stop.


Failed Build #17:
OS: CentOS7_64
Target: x86_64-native-linuxapp-gcc-shared

/home/patchWorkOrg/compilation/drivers/crypto/aesni_mb/Makefile:35: *** "Please define AESNI_MULTI_BUFFER_LIB_PATH environment variable".  Stop.


Failed Build #18:
OS: CentOS7_64
Target: x86_64-native-linuxapp-gcc
/home/patchWorkOrg/compilation/drivers/crypto/aesni_mb/Makefile:35: *** "Please define AESNI_MULTI_BUFFER_LIB_PATH environment variable".  Stop.


DPDK STV team


More information about the test-report mailing list