[dpdk-test-report] |FAILURE| pw19267 [PATCH v2 1/7] net/ixgbe/base: support XFI backplane for X550

sys_stv at intel.com sys_stv at intel.com
Fri Jan 13 06:35:26 CET 2017


Test-Label: Intel compilation
Test-Status: FAILURE

http://dpdk.org/patch/19267

_Compilation issues_

Submitter: wei dai <wei.dai at intel.com>
Date: Thu, 12 Jan 2017 22:53:27 +0800
DPDK git baseline: Repo:dpdk-next-net, Branch:master, CommitID:7f3ebc8c7418f6028262e828caa9d16c2bcfa298

Patch19267-19267 --> compile error
Build Summary: 18 Builds Done, 16 Successful, 2 Failures

Test environment and configuration as below:
OS: RHEL7.2_64
    Kernel Version:3.10.0-327.el7.x86_64
    CPU info:Intel(R) Xeon(R) CPU E5-2699 v4 @ 2.20GHz
    GCC Version:gcc (GCC) 4.8.5 20150623 (Red Hat 4.8.5-4)
    Clang Version:3.4.2
    i686-native-linuxapp-gcc
    x86_64-native-linuxapp-gcc
    x86_64-native-linuxapp-gcc-shared
OS: FreeBSD10.3_64
    Kernel Version:10.3-RELEASE
    CPU info: Intel(R) Xeon(R) CPU E5-2699 v4 @ 2.20GHz (2194.97-MHz K8-class CPU)
    GCC Version:gcc (FreeBSD Ports Collection) 4.8.5
    Clang Version:3.4.1
    x86_64-native-bsdapp-clang
    x86_64-native-bsdapp-gcc
OS: FC24_64
    Kernel Version:4.8.6-201.fc24.x86_64
    CPU info:Intel(R) Xeon(R) CPU E5-2699 v3 @ 2.30GHz
    GCC Version:gcc (GCC) 6.2.1 20160916 (Red Hat 6.2.1-2)
    Clang Version:3.8.0
    x86_64-native-linuxapp-clang
    i686-native-linuxapp-gcc
    x86_64-native-linuxapp-gcc
    x86_64-native-linuxapp-gcc-shared
    x86_64-native-linuxapp-gcc-debug
OS: UB1604_64
    Kernel Version:4.4.0-53-generic
    CPU info:Intel(R) Xeon(R) CPU E5-2699 v3 @ 2.30GHz
    GCC Version:gcc (Ubuntu 5.4.0-6ubuntu1~16.04.4) 5.4.0 20160609
    Clang Version:3.8.0
    i686-native-linuxapp-gcc
    x86_64-native-linuxapp-gcc
    x86_64-native-linuxapp-gcc-shared
    x86_64-native-linuxapp-clang
OS: CentOS7_64
    Kernel Version:3.10.0-327.el7.x86_64
    CPU info:Intel(R) Xeon(R) CPU E5-2699 v3 @ 2.30GHz
    GCC Version:gcc (GCC) 4.8.5 20150623 (Red Hat 4.8.5-4)
    Clang Version:3.4.2
    i686-native-linuxapp-gcc
    x86_64-native-linuxapp-clang
    x86_64-native-linuxapp-gcc-shared
    x86_64-native-linuxapp-gcc

Failed Build #1:
OS: FreeBSD10.3_64
Target: x86_64-native-bsdapp-clang
MKRES test_resource_c.res.o  /home/patchWorkOrg/compilation/x86_64-native-bsdapp-clang/lib/librte_pmd_virtio.a(virtio_ethdev.o): In function `virtio_init_device':
/home/patchWorkOrg/compilation/drivers/net/virtio/virtio_ethdev.c:(.text+0x217): undefined reference to `virtio_user_driver'
clang: error: linker command failed with exit code 1 (use -v to see invocation)
/home/patchWorkOrg/compilation/mk/rte.app.mk:233: recipe for target 'test' failed
/home/patchWorkOrg/compilation/mk/rte.subdir.mk:61: recipe for target 'test' failed
/home/patchWorkOrg/compilation/mk/rte.sdkbuild.mk:78: recipe for target 'app' failed
/home/patchWorkOrg/compilation/mk/rte.sdkroot.mk:126: recipe for target 'all' failed
/home/patchWorkOrg/compilation/mk/rte.sdkinstall.mk:85: recipe for target 'pre_install' failed
/home/patchWorkOrg/compilation/mk/rte.sdkroot.mk:101: recipe for target 'install' failed


Failed Build #2:
OS: FreeBSD10.3_64
Target: x86_64-native-bsdapp-gcc
MKRES test_resource_c.res.o  /home/patchWorkOrg/compilation/x86_64-native-bsdapp-gcc/lib/librte_pmd_virtio.a(virtio_ethdev.o): In function `virtio_init_device':
virtio_ethdev.c:(.text+0x1064): undefined reference to `virtio_user_driver'
collect2: error: ld returned 1 exit status
/home/patchWorkOrg/compilation/mk/rte.app.mk:233: recipe for target 'test' failed
/home/patchWorkOrg/compilation/mk/rte.subdir.mk:61: recipe for target 'test' failed
/home/patchWorkOrg/compilation/mk/rte.sdkbuild.mk:78: recipe for target 'app' failed
/home/patchWorkOrg/compilation/mk/rte.sdkroot.mk:126: recipe for target 'all' failed
/home/patchWorkOrg/compilation/mk/rte.sdkinstall.mk:85: recipe for target 'pre_install' failed
/home/patchWorkOrg/compilation/mk/rte.sdkroot.mk:101: recipe for target 'install' failed


DPDK STV team


More information about the test-report mailing list