[dpdk-test-report] |FAILURE| pw19610 [PATCH v8 5/9] eal/bus: introduce support for bus probing

sys_stv at intel.com sys_stv at intel.com
Tue Jan 17 23:36:17 CET 2017


Test-Label: Intel compilation
Test-Status: FAILURE

http://dpdk.org/patch/19610

_Compilation issues_

Submitter: Shreyansh Jain <shreyansh.jain at nxp.com>
Date: Tue, 17 Jan 2017 19:07:38 +0530
DPDK git baseline: Repo:dpdk, Branch:master, CommitID:c1e55ed3f7735dcb64cc4530bb94dd2a7c3c0a82

Patch19606-19610 --> compile error
Build Summary: 18 Builds Done, 16 Successful, 2 Failures

Test environment and configuration as below:
OS: RHEL7.2_64
    Kernel Version:3.10.0-327.el7.x86_64
    CPU info:Intel(R) Xeon(R) CPU E5-2699 v4 @ 2.20GHz
    GCC Version:gcc (GCC) 4.8.5 20150623 (Red Hat 4.8.5-4)
    Clang Version:3.4.2
    i686-native-linuxapp-gcc
    x86_64-native-linuxapp-gcc
    x86_64-native-linuxapp-gcc-shared
OS: FreeBSD10.3_64
    Kernel Version:10.3-RELEASE
    CPU info: Intel(R) Xeon(R) CPU E5-2699 v4 @ 2.20GHz (2194.97-MHz K8-class CPU)
    GCC Version:gcc (FreeBSD Ports Collection) 4.8.5
    Clang Version:3.4.1
    x86_64-native-bsdapp-clang
    x86_64-native-bsdapp-gcc
OS: FC24_64
    Kernel Version:4.8.6-201.fc24.x86_64
    CPU info:Intel(R) Xeon(R) CPU E5-2699 v3 @ 2.30GHz
    GCC Version:gcc (GCC) 6.2.1 20160916 (Red Hat 6.2.1-2)
    Clang Version:3.8.0
    x86_64-native-linuxapp-gcc-debug
    i686-native-linuxapp-gcc
    x86_64-native-linuxapp-gcc
    x86_64-native-linuxapp-gcc-shared
    x86_64-native-linuxapp-clang
OS: UB1604_64
    Kernel Version:4.4.0-53-generic
    CPU info:Intel(R) Xeon(R) CPU E5-2699 v3 @ 2.30GHz
    GCC Version:gcc (Ubuntu 5.4.0-6ubuntu1~16.04.4) 5.4.0 20160609
    Clang Version:3.8.0
    i686-native-linuxapp-gcc
    x86_64-native-linuxapp-gcc
    x86_64-native-linuxapp-gcc-shared
    x86_64-native-linuxapp-clang
OS: CentOS7_64
    Kernel Version:3.10.0-327.el7.x86_64
    CPU info:Intel(R) Xeon(R) CPU E5-2699 v3 @ 2.30GHz
    GCC Version:gcc (GCC) 4.8.5 20150623 (Red Hat 4.8.5-4)
    Clang Version:3.4.2
    i686-native-linuxapp-gcc
    x86_64-native-linuxapp-clang
    x86_64-native-linuxapp-gcc-shared
    x86_64-native-linuxapp-gcc

Failed Build #1:
OS: FreeBSD10.3_64
Target: x86_64-native-bsdapp-clang
MKRES test_resource_c.res.o  /home/patchWorkOrg/compilation/x86_64-native-bsdapp-clang/lib/librte_pmd_virtio.a(virtio_ethdev.o): In function `eth_virtio_dev_init':
(.text+0x14f): undefined reference to `virtio_user_ops'
clang: error: linker command failed with exit code 1 (use -v to see invocation)
/home/patchWorkOrg/compilation/mk/rte.app.mk:231: recipe for target 'test' failed
/home/patchWorkOrg/compilation/mk/rte.subdir.mk:61: recipe for target 'test' failed
/home/patchWorkOrg/compilation/mk/rte.sdkbuild.mk:78: recipe for target 'app' failed
/home/patchWorkOrg/compilation/mk/rte.sdkroot.mk:126: recipe for target 'all' failed
/home/patchWorkOrg/compilation/mk/rte.sdkinstall.mk:85: recipe for target 'pre_install' failed
/home/patchWorkOrg/compilation/mk/rte.sdkroot.mk:101: recipe for target 'install' failed


Failed Build #2:
OS: FreeBSD10.3_64
Target: x86_64-native-bsdapp-gcc
MKRES test_resource_c.res.o  /home/patchWorkOrg/compilation/x86_64-native-bsdapp-gcc/lib/librte_pmd_virtio.a(virtio_ethdev.o): In function `eth_virtio_dev_init':
(.text+0x173d): undefined reference to `virtio_user_ops'
collect2: error: ld returned 1 exit status
/home/patchWorkOrg/compilation/mk/rte.app.mk:231: recipe for target 'test' failed
/home/patchWorkOrg/compilation/mk/rte.subdir.mk:61: recipe for target 'test' failed
/home/patchWorkOrg/compilation/mk/rte.sdkbuild.mk:78: recipe for target 'app' failed
/home/patchWorkOrg/compilation/mk/rte.sdkroot.mk:126: recipe for target 'all' failed
/home/patchWorkOrg/compilation/mk/rte.sdkinstall.mk:85: recipe for target 'pre_install' failed
/home/patchWorkOrg/compilation/mk/rte.sdkroot.mk:101: recipe for target 'install' failed


DPDK STV team


More information about the test-report mailing list