[dpdk-test-report] |FAILURE| pw19651 [PATCH v8 3/7] lib: add bitrate statistics library

sys_stv at intel.com sys_stv at intel.com
Wed Jan 18 06:44:31 CET 2017


Test-Label: Intel compilation
Test-Status: FAILURE

http://dpdk.org/patch/19651

_Compilation issues_

Submitter: Remy Horton <remy.horton at intel.com>
Date: Tue, 17 Jan 2017 23:24:30 +0000
DPDK git baseline: Repo:dpdk, Branch:master, CommitID:e754c959fca3f15263920789cf69148b9edd646e

Patch19649-19651 --> compile error
Build Summary: 18 Builds Done, 14 Successful, 4 Failures

Test environment and configuration as below:
OS: RHEL7.2_64
    Kernel Version:3.10.0-327.el7.x86_64
    CPU info:Intel(R) Xeon(R) CPU E5-2699 v4 @ 2.20GHz
    GCC Version:gcc (GCC) 4.8.5 20150623 (Red Hat 4.8.5-4)
    Clang Version:3.4.2
    i686-native-linuxapp-gcc
    x86_64-native-linuxapp-gcc
    x86_64-native-linuxapp-gcc-shared
OS: FreeBSD10.3_64
    Kernel Version:10.3-RELEASE
    CPU info: Intel(R) Xeon(R) CPU E5-2699 v4 @ 2.20GHz (2194.97-MHz K8-class CPU)
    GCC Version:gcc (FreeBSD Ports Collection) 4.8.5
    Clang Version:3.4.1
    x86_64-native-bsdapp-clang
    x86_64-native-bsdapp-gcc
OS: FC24_64
    Kernel Version:4.8.6-201.fc24.x86_64
    CPU info:Intel(R) Xeon(R) CPU E5-2699 v3 @ 2.30GHz
    GCC Version:gcc (GCC) 6.2.1 20160916 (Red Hat 6.2.1-2)
    Clang Version:3.8.0
    x86_64-native-linuxapp-clang
    i686-native-linuxapp-gcc
    x86_64-native-linuxapp-gcc
    x86_64-native-linuxapp-gcc-shared
    x86_64-native-linuxapp-gcc-debug
OS: UB1604_64
    Kernel Version:4.4.0-53-generic
    CPU info:Intel(R) Xeon(R) CPU E5-2699 v3 @ 2.30GHz
    GCC Version:gcc (Ubuntu 5.4.0-6ubuntu1~16.04.4) 5.4.0 20160609
    Clang Version:3.8.0
    i686-native-linuxapp-gcc
    x86_64-native-linuxapp-gcc
    x86_64-native-linuxapp-gcc-shared
    x86_64-native-linuxapp-clang
OS: CentOS7_64
    Kernel Version:3.10.0-327.el7.x86_64
    CPU info:Intel(R) Xeon(R) CPU E5-2699 v3 @ 2.30GHz
    GCC Version:gcc (GCC) 4.8.5 20150623 (Red Hat 4.8.5-4)
    Clang Version:3.4.2
    i686-native-linuxapp-gcc
    x86_64-native-linuxapp-clang
    x86_64-native-linuxapp-gcc-shared
    x86_64-native-linuxapp-gcc

Failed Build #1:
OS: RHEL7.2_64
Target: x86_64-native-linuxapp-gcc-shared

LD librte_bitratestats.so.1.1
rte_bitrate.o: In function `rte_stats_bitrate_reg':
rte_bitrate.c:(.text+0x5f): undefined reference to `rte_metrics_reg_names'
rte_bitrate.o: In function `rte_stats_bitrate_calc':
rte_bitrate.c:(.text+0x2fc): undefined reference to `rte_metrics_update_values'
collect2: error: ld returned 1 exit status


Failed Build #2:
OS: FC24_64
Target: x86_64-native-linuxapp-gcc-shared

LD librte_bitratestats.so.1.1
rte_bitrate.o: In function `rte_stats_bitrate_reg':
rte_bitrate.c:(.text+0x5f): undefined reference to `rte_metrics_reg_names'
rte_bitrate.o: In function `rte_stats_bitrate_calc':
rte_bitrate.c:(.text+0x2fc): undefined reference to `rte_metrics_update_values'
collect2: error: ld returned 1 exit status
/home/patchWorkOrg/compilation/mk/rte.lib.mk:120: recipe for target 'librte_bitratestats.so.1.1' failed
/home/patchWorkOrg/compilation/mk/rte.subdir.mk:61: recipe for target 'librte_bitratestats' failed
/home/patchWorkOrg/compilation/mk/rte.sdkbuild.mk:78: recipe for target 'lib' failed
/home/patchWorkOrg/compilation/mk/rte.sdkroot.mk:126: recipe for target 'all' failed
/home/patchWorkOrg/compilation/mk/rte.sdkinstall.mk:85: recipe for target 'pre_install' failed
/home/patchWorkOrg/compilation/mk/rte.sdkroot.mk:101: recipe for target 'install' failed


Failed Build #3:
OS: UB1604_64
Target: x86_64-native-linuxapp-gcc-shared

LD librte_bitratestats.so.1.1
rte_bitrate.o: In function `rte_stats_bitrate_reg':
rte_bitrate.c:(.text+0x6e): undefined reference to `rte_metrics_reg_names'
rte_bitrate.o: In function `rte_stats_bitrate_calc':
rte_bitrate.c:(.text+0x3c1): undefined reference to `rte_metrics_update_values'
collect2: error: ld returned 1 exit status
/home/patchWorkOrg/compilation/mk/rte.lib.mk:120: recipe for target 'librte_bitratestats.so.1.1' failed
/home/patchWorkOrg/compilation/mk/rte.subdir.mk:61: recipe for target 'librte_bitratestats' failed
/home/patchWorkOrg/compilation/mk/rte.sdkbuild.mk:78: recipe for target 'lib' failed
/home/patchWorkOrg/compilation/mk/rte.sdkroot.mk:126: recipe for target 'all' failed
/home/patchWorkOrg/compilation/mk/rte.sdkinstall.mk:85: recipe for target 'pre_install' failed
/home/patchWorkOrg/compilation/mk/rte.sdkroot.mk:101: recipe for target 'install' failed


Failed Build #4:
OS: CentOS7_64
Target: x86_64-native-linuxapp-gcc-shared

LD librte_bitratestats.so.1.1
rte_bitrate.o: In function `rte_stats_bitrate_reg':
rte_bitrate.c:(.text+0x5f): undefined reference to `rte_metrics_reg_names'
rte_bitrate.o: In function `rte_stats_bitrate_calc':
rte_bitrate.c:(.text+0x2fc): undefined reference to `rte_metrics_update_values'
collect2: error: ld returned 1 exit status


DPDK STV team


More information about the test-report mailing list