[dpdk-test-report] |FAILURE| pw48718[v2, 1/9] vhost: provide helper for host notifier ctrl

sys_stv at intel.com sys_stv at intel.com
Thu Dec 13 02:33:14 CET 2018


Test-Label: Intel-compilation
Test-Status: FAILURE
http://dpdk.org/patch/48718

_Compilation issues_

Submitter: Xiao Wang <xiao.w.wang at intel.com>
Date: 2018-12-13 01:10:06
DPDK git baseline: Repo:dpdk-master, CommitID: b0aa225b45e102a1eba2215e3a75b5683d8435f2

Build Summary: 15 Builds Done, 12 Successful, 3 Failures

Test environment and configuration as below:

OS: FC25
	Kernel Version: 4.5.5-300.fc24.x86_64
	CPU info: Intel(R) Xeon(R) CPU E5-2699 v3 @ 2.30GHz
	GCC Version: gcc (GCC) 6.1.1 20160510 (Red Hat 6.1.1-2)
	Clang Version: 3.8.0 (tags/RELEASE_380/final)
	x86_64-native-linuxapp-gcc
	x86_64-native-linuxapp-gcc-debug

OS: FC24
	Kernel Version: 4.9.13-100.fc24.x86_64
	CPU info: Intel(R) Xeon(R) CPU E5-2699 v3 @ 2.30GHz
	GCC Version: gcc (GCC) 6.3.1 20161221 (Red Hat 6.3.1-1)
	Clang Version: 3.8.1 (tags/RELEASE_381/final)
	x86_64-native-linuxapp-gcc-shared
	x86_64-native-linuxapp-clang
	i686-native-linuxapp-gcc

OS: CENTOS
	Kernel Version: 3.10.0-514.10.2.el7.x86_64
	CPU info: Intel(R) Xeon(R) CPU E5-2699 v3 @ 2.30GHz
	GCC Version: gcc (GCC) 4.8.5 20150623 (Red Hat 4.8.5-4)
	Clang Version: 3.4.2 (tags/RELEASE_34/dot2-final)
	x86_64-native-linuxapp-clang
	x86_64-native-linuxapp-gcc-shared
	i686-native-linuxapp-gcc
	x86_64-native-linuxapp-gcc

OS: UB1604
	Kernel Version: 4.4.0-47-generic
	CPU info: Intel(R) Xeon(R) CPU E5-2699 v3 @ 2.30GHz
	GCC Version: gcc (Ubuntu 5.4.0-6ubuntu1~16.04.10) 5.4.0 20160609
	Clang Version: 3.8.0-2ubuntu4 (tags/RELEASE_380/final)
	x86_64-native-linuxapp-gcc
	x86_64-native-linuxapp-gcc-shared
	i686-native-linuxapp-gcc
	x86_64-native-linuxapp-clang

OS: FreeBSD
	Kernel Version: 10.3-RELEASE
	CPU info: Intel(R) Xeon(R) CPU E5-2699 v3 @ 2.30GHz (2294.75-MHz K8-class CPU)
	GCC Version: gcc (FreeBSD Ports Collection) 7.3.0
	Clang Version: 3.4.1 (tags/RELEASE_34/dot1-final 208032) 20140512
	x86_64-native-bsdapp-clang
	x86_64-native-bsdapp-gcc

*Failed Build #1:
OS: CENTOS
Target: x86_64-native-linuxapp-gcc-shared
ifcvf_vdpa.c:(.text+0x1e75): undefined reference to `rte_kvargs_free'
ifcvf_vdpa.c:(.text+0x20f2): undefined reference to `rte_kvargs_count'
ifcvf_vdpa.c:(.text+0x2178): undefined reference to `rte_kvargs_free'
ifcvf_vdpa.c:(.text+0x219f): undefined reference to `rte_kvargs_process'
ifcvf_vdpa.c:(.text+0x21b4): undefined reference to `rte_kvargs_free'
collect2: error: ld returned 1 exit status
make[6]: *** [librte_pmd_ifc.so.1.1] Error 1
make[5]: *** [ifc] Error 2
make[4]: *** [net] Error 2
make[3]: *** [drivers] Error 2
make[2]: *** [all] Error 2

*Failed Build #2:
OS: UB1604
Target: x86_64-native-linuxapp-gcc-shared
ifcvf_vdpa.c:(.text+0x1df1): undefined reference to `rte_kvargs_free'
ifcvf_vdpa.c:(.text+0x2046): undefined reference to `rte_kvargs_count'
ifcvf_vdpa.c:(.text+0x20c6): undefined reference to `rte_kvargs_free'
ifcvf_vdpa.c:(.text+0x20e7): undefined reference to `rte_kvargs_process'
ifcvf_vdpa.c:(.text+0x20fc): undefined reference to `rte_kvargs_free'
collect2: error: ld returned 1 exit status
/tmp/UB1604_K4.4.0_GCC5.4.0/x86_64-native-linuxapp-gcc-shared/942d6a53be3848bdac42b2261ae44d1d/dpdk/mk/rte.lib.mk:98: recipe for target 'librte_pmd_ifc.so.1.1' failed
make[6]: *** [librte_pmd_ifc.so.1.1] Error 1
/tmp/UB1604_K4.4.0_GCC5.4.0/x86_64-native-linuxapp-gcc-shared/942d6a53be3848bdac42b2261ae44d1d/dpdk/mk/rte.subdir.mk:35: recipe for target 'ifc' failed
make[5]: *** [ifc] Error 2
make[5]: *** Waiting for unfinished jobs....
  CC rte_eth_softnic_thread.o
  CC rte_eth_softnic_cli.o
  CC rte_eth_softnic_flow.o
--
  CC rte_eth_softnic_cryptodev.o
  CC parser.o
  CC conn.o
  LD librte_pmd_softnic.so.1.1
  INSTALL-LIB librte_pmd_softnic.so.1.1
/tmp/UB1604_K4.4.0_GCC5.4.0/x86_64-native-linuxapp-gcc-shared/942d6a53be3848bdac42b2261ae44d1d/dpdk/mk/rte.subdir.mk:35: recipe for target 'net' failed
make[4]: *** [net] Error 2
/tmp/UB1604_K4.4.0_GCC5.4.0/x86_64-native-linuxapp-gcc-shared/942d6a53be3848bdac42b2261ae44d1d/dpdk/mk/rte.sdkbuild.mk:49: recipe for target 'drivers' failed
make[3]: *** [drivers] Error 2
/tmp/UB1604_K4.4.0_GCC5.4.0/x86_64-native-linuxapp-gcc-shared/942d6a53be3848bdac42b2261ae44d1d/dpdk/mk/rte.sdkroot.mk:100: recipe for target 'all' failed
make[2]: *** [all] Error 2
/tmp/UB1604_K4.4.0_GCC5.4.0/x86_64-native-linuxapp-gcc-shared/942d6a53be3848bdac42b2261ae44d1d/dpdk/mk/rte.sdkinstall.mk:57: recipe for target 'pre_install' failed
make[1]: *** [pre_install] Error 2
/tmp/UB1604_K4.4.0_GCC5.4.0/x86_64-native-linuxapp-gcc-shared/942d6a53be3848bdac42b2261ae44d1d/dpdk/mk/rte.sdkroot.mk:79: recipe for target 'install' failed
make: *** [install] Error 2

*Failed Build #3:
OS: FC24
Target: x86_64-native-linuxapp-gcc-shared
ifcvf_vdpa.c:(.text+0x1d49): undefined reference to `rte_kvargs_free'
ifcvf_vdpa.c:(.text+0x1f59): undefined reference to `rte_kvargs_count'
ifcvf_vdpa.c:(.text+0x1fd5): undefined reference to `rte_kvargs_free'
ifcvf_vdpa.c:(.text+0x1ff7): undefined reference to `rte_kvargs_process'
ifcvf_vdpa.c:(.text+0x200c): undefined reference to `rte_kvargs_free'
collect2: error: ld returned 1 exit status
/tmp/FC24_K4.9.13_GCC6.2.1/x86_64-native-linuxapp-gcc-shared/942d6a53be3848bdac42b2261ae44d1d/dpdk/mk/rte.lib.mk:98: recipe for target 'librte_pmd_ifc.so.1.1' failed
make[6]: *** [librte_pmd_ifc.so.1.1] Error 1
/tmp/FC24_K4.9.13_GCC6.2.1/x86_64-native-linuxapp-gcc-shared/942d6a53be3848bdac42b2261ae44d1d/dpdk/mk/rte.subdir.mk:35: recipe for target 'ifc' failed
make[5]: *** [ifc] Error 2
make[5]: *** Waiting for unfinished jobs....
  CC rte_eth_softnic_cli.o
  CC rte_eth_softnic_flow.o
  CC rte_eth_softnic_meter.o
  CC rte_eth_softnic_cryptodev.o
  CC parser.o
  CC conn.o
  LD librte_pmd_softnic.so.1.1
  INSTALL-LIB librte_pmd_softnic.so.1.1
/tmp/FC24_K4.9.13_GCC6.2.1/x86_64-native-linuxapp-gcc-shared/942d6a53be3848bdac42b2261ae44d1d/dpdk/mk/rte.subdir.mk:35: recipe for target 'net' failed
make[4]: *** [net] Error 2
/tmp/FC24_K4.9.13_GCC6.2.1/x86_64-native-linuxapp-gcc-shared/942d6a53be3848bdac42b2261ae44d1d/dpdk/mk/rte.sdkbuild.mk:49: recipe for target 'drivers' failed
make[3]: *** [drivers] Error 2
/tmp/FC24_K4.9.13_GCC6.2.1/x86_64-native-linuxapp-gcc-shared/942d6a53be3848bdac42b2261ae44d1d/dpdk/mk/rte.sdkroot.mk:100: recipe for target 'all' failed
make[2]: *** [all] Error 2
/tmp/FC24_K4.9.13_GCC6.2.1/x86_64-native-linuxapp-gcc-shared/942d6a53be3848bdac42b2261ae44d1d/dpdk/mk/rte.sdkinstall.mk:57: recipe for target 'pre_install' failed
make[1]: *** [pre_install] Error 2
/tmp/FC24_K4.9.13_GCC6.2.1/x86_64-native-linuxapp-gcc-shared/942d6a53be3848bdac42b2261ae44d1d/dpdk/mk/rte.sdkroot.mk:79: recipe for target 'install' failed
make: *** [install] Error 2

DPDK STV team


More information about the test-report mailing list