[dpdk-test-report] |FAILURE| pw48950[2/4] eal: turn off getopt_long error messages

sys_stv at intel.com sys_stv at intel.com
Sun Dec 16 17:38:21 CET 2018


Test-Label: Intel-compilation
Test-Status: FAILURE
http://dpdk.org/patch/48950

_Compilation issues_

Submitter: Keith Wiles <keith.wiles at intel.com>
Date: 2018-12-16 16:32:37
DPDK git baseline: Repo:dpdk-master, CommitID: ef8b7c505f10897621c0801d8ef3e961385246f8

Build Summary: 15 Builds Done, 0 Successful, 15 Failures

Test environment and configuration as below:

OS: FC25
	Kernel Version: 4.5.5-300.fc24.x86_64
	CPU info: Intel(R) Xeon(R) CPU E5-2699 v3 @ 2.30GHz
	GCC Version: gcc (GCC) 6.1.1 20160510 (Red Hat 6.1.1-2)
	Clang Version: 3.8.0 (tags/RELEASE_380/final)
	x86_64-native-linuxapp-gcc
	x86_64-native-linuxapp-gcc-debug

OS: FC24
	Kernel Version: 4.11.12-100.fc24.x86_64
	CPU info: Intel(R) Xeon(R) CPU E5-2699 v3 @ 2.30GHz
	GCC Version: gcc (GCC) 6.3.1 20161221 (Red Hat 6.3.1-1)
	Clang Version: 3.8.1 (tags/RELEASE_381/final)
	i686-native-linuxapp-gcc
	x86_64-native-linuxapp-clang
	x86_64-native-linuxapp-gcc-shared

OS: CENTOS
	Kernel Version: 3.10.0-514.10.2.el7.x86_64
	CPU info: Intel(R) Xeon(R) CPU E5-2699 v3 @ 2.30GHz
	GCC Version: gcc (GCC) 4.8.5 20150623 (Red Hat 4.8.5-4)
	Clang Version: 3.4.2 (tags/RELEASE_34/dot2-final)
	x86_64-native-linuxapp-clang
	i686-native-linuxapp-gcc
	x86_64-native-linuxapp-gcc-shared
	x86_64-native-linuxapp-gcc

OS: UB1604
	Kernel Version: 4.4.0-137-generic
	CPU info: Intel(R) Xeon(R) CPU E5-2699 v3 @ 2.30GHz
	GCC Version: gcc (Ubuntu 5.4.0-6ubuntu1~16.04.10) 5.4.0 20160609
	Clang Version: 3.8.0-2ubuntu4 (tags/RELEASE_380/final)
	x86_64-native-linuxapp-gcc
	x86_64-native-linuxapp-clang
	i686-native-linuxapp-gcc
	x86_64-native-linuxapp-gcc-shared

OS: FreeBSD
	Kernel Version: 10.3-RELEASE
	CPU info: Intel(R) Xeon(R) CPU E5-2699 v3 @ 2.30GHz (2294.75-MHz K8-class CPU)
	GCC Version: gcc (FreeBSD Ports Collection) 7.3.0
	Clang Version: 3.4.1 (tags/RELEASE_34/dot1-final 208032) 20140512
	x86_64-native-bsdapp-clang
	x86_64-native-bsdapp-gcc

*Failed Build #1:
OS: FC25
Target: x86_64-native-linuxapp-gcc
  SYMLINK-FILE include/rte_security.h
  SYMLINK-FILE include/rte_security_driver.h
  CC dfs_noop.o
  CC rte_security.o
In file included from /tmp/FC25_K4.8.6_GCC6.3.1/x86_64-native-linuxapp-gcc/805e7f4e2d7d4deabd9b0edf6a6d50b2/dpdk/lib/librte_dfs/dfs_noop.c:18:0:
/tmp/FC25_K4.8.6_GCC6.3.1/x86_64-native-linuxapp-gcc/805e7f4e2d7d4deabd9b0edf6a6d50b2/dpdk/lib/librte_dfs/dfs.h:28:21: fatal error: jansson.h: No such file or directory
 #include <jansson.h>
                     ^
compilation terminated.
/tmp/FC25_K4.8.6_GCC6.3.1/x86_64-native-linuxapp-gcc/805e7f4e2d7d4deabd9b0edf6a6d50b2/dpdk/mk/internal/rte.compile-pre.mk:114: recipe for target 'dfs_noop.o' failed
make[5]: *** [dfs_noop.o] Error 1
/tmp/FC25_K4.8.6_GCC6.3.1/x86_64-native-linuxapp-gcc/805e7f4e2d7d4deabd9b0edf6a6d50b2/dpdk/mk/rte.subdir.mk:35: recipe for target 'librte_dfs' failed
make[4]: *** [librte_dfs] Error 2
make[4]: *** Waiting for unfinished jobs....
  AR librte_security.a
  INSTALL-LIB librte_security.a
/tmp/FC25_K4.8.6_GCC6.3.1/x86_64-native-linuxapp-gcc/805e7f4e2d7d4deabd9b0edf6a6d50b2/dpdk/mk/rte.sdkbuild.mk:49: recipe for target 'lib' failed
make[3]: *** [lib] Error 2
/tmp/FC25_K4.8.6_GCC6.3.1/x86_64-native-linuxapp-gcc/805e7f4e2d7d4deabd9b0edf6a6d50b2/dpdk/mk/rte.sdkroot.mk:100: recipe for target 'all' failed
make[2]: *** [all] Error 2
/tmp/FC25_K4.8.6_GCC6.3.1/x86_64-native-linuxapp-gcc/805e7f4e2d7d4deabd9b0edf6a6d50b2/dpdk/mk/rte.sdkinstall.mk:57: recipe for target 'pre_install' failed
make[1]: *** [pre_install] Error 2
/tmp/FC25_K4.8.6_GCC6.3.1/x86_64-native-linuxapp-gcc/805e7f4e2d7d4deabd9b0edf6a6d50b2/dpdk/mk/rte.sdkroot.mk:79: recipe for target 'install' failed
make: *** [install] Error 2

*Failed Build #2:
OS: UB1604
Target: x86_64-native-linuxapp-gcc
  SYMLINK-FILE include/rte_security.h
  CC dfs_noop.o
  SYMLINK-FILE include/rte_security_driver.h
  CC rte_security.o
In file included from /tmp/UB1604_K4.8.0_GCC6.2.0/x86_64-native-linuxapp-gcc/805e7f4e2d7d4deabd9b0edf6a6d50b2/dpdk/lib/librte_dfs/dfs_noop.c:18:0:
/tmp/UB1604_K4.8.0_GCC6.2.0/x86_64-native-linuxapp-gcc/805e7f4e2d7d4deabd9b0edf6a6d50b2/dpdk/lib/librte_dfs/dfs.h:28:21: fatal error: jansson.h: No such file or directory
 #include <jansson.h>
                     ^
compilation terminated.
/tmp/UB1604_K4.8.0_GCC6.2.0/x86_64-native-linuxapp-gcc/805e7f4e2d7d4deabd9b0edf6a6d50b2/dpdk/mk/internal/rte.compile-pre.mk:114: recipe for target 'dfs_noop.o' failed
make[5]: *** [dfs_noop.o] Error 1
/tmp/UB1604_K4.8.0_GCC6.2.0/x86_64-native-linuxapp-gcc/805e7f4e2d7d4deabd9b0edf6a6d50b2/dpdk/mk/rte.subdir.mk:35: recipe for target 'librte_dfs' failed
make[4]: *** [librte_dfs] Error 2
make[4]: *** Waiting for unfinished jobs....
  AR librte_security.a
  INSTALL-LIB librte_security.a
/tmp/UB1604_K4.8.0_GCC6.2.0/x86_64-native-linuxapp-gcc/805e7f4e2d7d4deabd9b0edf6a6d50b2/dpdk/mk/rte.sdkbuild.mk:49: recipe for target 'lib' failed
make[3]: *** [lib] Error 2
/tmp/UB1604_K4.8.0_GCC6.2.0/x86_64-native-linuxapp-gcc/805e7f4e2d7d4deabd9b0edf6a6d50b2/dpdk/mk/rte.sdkroot.mk:100: recipe for target 'all' failed
make[2]: *** [all] Error 2
/tmp/UB1604_K4.8.0_GCC6.2.0/x86_64-native-linuxapp-gcc/805e7f4e2d7d4deabd9b0edf6a6d50b2/dpdk/mk/rte.sdkinstall.mk:57: recipe for target 'pre_install' failed
make[1]: *** [pre_install] Error 2
/tmp/UB1604_K4.8.0_GCC6.2.0/x86_64-native-linuxapp-gcc/805e7f4e2d7d4deabd9b0edf6a6d50b2/dpdk/mk/rte.sdkroot.mk:79: recipe for target 'install' failed
make: *** [install] Error 2

*Failed Build #3:
OS: CENTOS
Target: x86_64-native-linuxapp-clang
  SYMLINK-FILE include/dfs.h
  SYMLINK-FILE include/rte_security_driver.h
  CC dfs_noop.o
  CC rte_security.o
In file included from /tmp/CENTOS_K3.10.0_GCC4.8.5/x86_64-native-linuxapp-clang/805e7f4e2d7d4deabd9b0edf6a6d50b2/dpdk/lib/librte_dfs/dfs_noop.c:18:
/tmp/CENTOS_K3.10.0_GCC4.8.5/x86_64-native-linuxapp-clang/805e7f4e2d7d4deabd9b0edf6a6d50b2/dpdk/lib/librte_dfs/dfs.h:28:10: fatal error: 'jansson.h' file not found
#include <jansson.h>
         ^
1 error generated.
make[5]: *** [dfs_noop.o] Error 1
make[4]: *** [librte_dfs] Error 2
make[4]: *** Waiting for unfinished jobs....
  AR librte_security.a
  INSTALL-LIB librte_security.a

*Failed Build #4:
OS: CENTOS
Target: i686-native-linuxapp-gcc
  CC dfs_noop.o
  SYMLINK-FILE include/rte_security.h
  SYMLINK-FILE include/rte_security_driver.h
  CC rte_security.o
In file included from /tmp/CENTOS_K3.10.0_GCC4.8.5/i686-native-linuxapp-gcc/805e7f4e2d7d4deabd9b0edf6a6d50b2/dpdk/lib/librte_dfs/dfs_noop.c:18:0:
/tmp/CENTOS_K3.10.0_GCC4.8.5/i686-native-linuxapp-gcc/805e7f4e2d7d4deabd9b0edf6a6d50b2/dpdk/lib/librte_dfs/dfs.h:28:21: fatal error: jansson.h: No such file or directory
 #include <jansson.h>
                     ^
compilation terminated.
  AR librte_security.a
make[5]: *** [dfs_noop.o] Error 1

*Failed Build #5:
OS: CENTOS
Target: x86_64-native-linuxapp-gcc-shared
  SYMLINK-FILE include/dfs.h
  SYMLINK-FILE include/rte_security_driver.h
  CC dfs_noop.o
  CC rte_security.o
In file included from /tmp/CENTOS_K3.10.0_GCC4.8.5/x86_64-native-linuxapp-gcc-shared/805e7f4e2d7d4deabd9b0edf6a6d50b2/dpdk/lib/librte_dfs/dfs_noop.c:18:0:
/tmp/CENTOS_K3.10.0_GCC4.8.5/x86_64-native-linuxapp-gcc-shared/805e7f4e2d7d4deabd9b0edf6a6d50b2/dpdk/lib/librte_dfs/dfs.h:28:21: fatal error: jansson.h: No such file or directory
 #include <jansson.h>
                     ^
compilation terminated.
  LD librte_security.so.1.1
  INSTALL-LIB librte_security.so.1.1

*Failed Build #6:
OS: UB1604
Target: x86_64-native-linuxapp-clang
  SYMLINK-FILE include/rte_security.h
  SYMLINK-FILE include/rte_security_driver.h
  CC dfs_noop.o
  CC rte_security.o
In file included from /tmp/UB1604_K4.4.0_GCC5.4.0/x86_64-native-linuxapp-clang/805e7f4e2d7d4deabd9b0edf6a6d50b2/dpdk/lib/librte_dfs/dfs_noop.c:18:
/tmp/UB1604_K4.4.0_GCC5.4.0/x86_64-native-linuxapp-clang/805e7f4e2d7d4deabd9b0edf6a6d50b2/dpdk/lib/librte_dfs/dfs.h:28:10: fatal error: 'jansson.h' file not found
#include <jansson.h>
         ^
1 error generated.
/tmp/UB1604_K4.4.0_GCC5.4.0/x86_64-native-linuxapp-clang/805e7f4e2d7d4deabd9b0edf6a6d50b2/dpdk/mk/internal/rte.compile-pre.mk:114: recipe for target 'dfs_noop.o' failed
make[5]: *** [dfs_noop.o] Error 1
/tmp/UB1604_K4.4.0_GCC5.4.0/x86_64-native-linuxapp-clang/805e7f4e2d7d4deabd9b0edf6a6d50b2/dpdk/mk/rte.subdir.mk:35: recipe for target 'librte_dfs' failed
make[4]: *** [librte_dfs] Error 2
make[4]: *** Waiting for unfinished jobs....
  AR librte_security.a
  INSTALL-LIB librte_security.a
/tmp/UB1604_K4.4.0_GCC5.4.0/x86_64-native-linuxapp-clang/805e7f4e2d7d4deabd9b0edf6a6d50b2/dpdk/mk/rte.sdkbuild.mk:49: recipe for target 'lib' failed
make[3]: *** [lib] Error 2
/tmp/UB1604_K4.4.0_GCC5.4.0/x86_64-native-linuxapp-clang/805e7f4e2d7d4deabd9b0edf6a6d50b2/dpdk/mk/rte.sdkroot.mk:100: recipe for target 'all' failed
make[2]: *** [all] Error 2
/tmp/UB1604_K4.4.0_GCC5.4.0/x86_64-native-linuxapp-clang/805e7f4e2d7d4deabd9b0edf6a6d50b2/dpdk/mk/rte.sdkinstall.mk:57: recipe for target 'pre_install' failed
make[1]: *** [pre_install] Error 2
/tmp/UB1604_K4.4.0_GCC5.4.0/x86_64-native-linuxapp-clang/805e7f4e2d7d4deabd9b0edf6a6d50b2/dpdk/mk/rte.sdkroot.mk:79: recipe for target 'install' failed
make: *** [install] Error 2

*Failed Build #7:
OS: UB1604
Target: i686-native-linuxapp-gcc
  SYMLINK-FILE include/rte_security.h
  CC dfs_noop.o
  SYMLINK-FILE include/rte_security_driver.h
  CC rte_security.o
In file included from /tmp/UB1604_K4.4.0_GCC5.4.0/i686-native-linuxapp-gcc/805e7f4e2d7d4deabd9b0edf6a6d50b2/dpdk/lib/librte_dfs/dfs_noop.c:18:0:
/tmp/UB1604_K4.4.0_GCC5.4.0/i686-native-linuxapp-gcc/805e7f4e2d7d4deabd9b0edf6a6d50b2/dpdk/lib/librte_dfs/dfs.h:28:21: fatal error: jansson.h: No such file or directory
compilation terminated.
/tmp/UB1604_K4.4.0_GCC5.4.0/i686-native-linuxapp-gcc/805e7f4e2d7d4deabd9b0edf6a6d50b2/dpdk/mk/internal/rte.compile-pre.mk:114: recipe for target 'dfs_noop.o' failed
make[5]: *** [dfs_noop.o] Error 1
/tmp/UB1604_K4.4.0_GCC5.4.0/i686-native-linuxapp-gcc/805e7f4e2d7d4deabd9b0edf6a6d50b2/dpdk/mk/rte.subdir.mk:35: recipe for target 'librte_dfs' failed
make[4]: *** [librte_dfs] Error 2
make[4]: *** Waiting for unfinished jobs....
  AR librte_security.a
  INSTALL-LIB librte_security.a
/tmp/UB1604_K4.4.0_GCC5.4.0/i686-native-linuxapp-gcc/805e7f4e2d7d4deabd9b0edf6a6d50b2/dpdk/mk/rte.sdkbuild.mk:49: recipe for target 'lib' failed
make[3]: *** [lib] Error 2
/tmp/UB1604_K4.4.0_GCC5.4.0/i686-native-linuxapp-gcc/805e7f4e2d7d4deabd9b0edf6a6d50b2/dpdk/mk/rte.sdkroot.mk:100: recipe for target 'all' failed
make[2]: *** [all] Error 2
/tmp/UB1604_K4.4.0_GCC5.4.0/i686-native-linuxapp-gcc/805e7f4e2d7d4deabd9b0edf6a6d50b2/dpdk/mk/rte.sdkinstall.mk:57: recipe for target 'pre_install' failed
make[1]: *** [pre_install] Error 2
/tmp/UB1604_K4.4.0_GCC5.4.0/i686-native-linuxapp-gcc/805e7f4e2d7d4deabd9b0edf6a6d50b2/dpdk/mk/rte.sdkroot.mk:79: recipe for target 'install' failed
make: *** [install] Error 2

*Failed Build #8:
OS: CENTOS
Target: x86_64-native-linuxapp-gcc
  SYMLINK-FILE include/dfs.h
  SYMLINK-FILE include/rte_security_driver.h
  CC dfs_noop.o
  CC rte_security.o
In file included from /tmp/CENTOS_K3.10.0_GCC4.8.5/x86_64-native-linuxapp-gcc/805e7f4e2d7d4deabd9b0edf6a6d50b2/dpdk/lib/librte_dfs/dfs_noop.c:18:0:
/tmp/CENTOS_K3.10.0_GCC4.8.5/x86_64-native-linuxapp-gcc/805e7f4e2d7d4deabd9b0edf6a6d50b2/dpdk/lib/librte_dfs/dfs.h:28:21: fatal error: jansson.h: No such file or directory
 #include <jansson.h>
                     ^
compilation terminated.
  AR librte_security.a
  INSTALL-LIB librte_security.a

*Failed Build #9:
OS: UB1604
Target: x86_64-native-linuxapp-gcc-shared
  CC dfs_noop.o
  SYMLINK-FILE include/rte_security.h
  SYMLINK-FILE include/rte_security_driver.h
  CC rte_security.o
In file included from /tmp/UB1604_K4.4.0_GCC5.4.0/x86_64-native-linuxapp-gcc-shared/805e7f4e2d7d4deabd9b0edf6a6d50b2/dpdk/lib/librte_dfs/dfs_noop.c:18:0:
/tmp/UB1604_K4.4.0_GCC5.4.0/x86_64-native-linuxapp-gcc-shared/805e7f4e2d7d4deabd9b0edf6a6d50b2/dpdk/lib/librte_dfs/dfs.h:28:21: fatal error: jansson.h: No such file or directory
compilation terminated.
/tmp/UB1604_K4.4.0_GCC5.4.0/x86_64-native-linuxapp-gcc-shared/805e7f4e2d7d4deabd9b0edf6a6d50b2/dpdk/mk/internal/rte.compile-pre.mk:114: recipe for target 'dfs_noop.o' failed
make[5]: *** [dfs_noop.o] Error 1
/tmp/UB1604_K4.4.0_GCC5.4.0/x86_64-native-linuxapp-gcc-shared/805e7f4e2d7d4deabd9b0edf6a6d50b2/dpdk/mk/rte.subdir.mk:35: recipe for target 'librte_dfs' failed
make[4]: *** [librte_dfs] Error 2
make[4]: *** Waiting for unfinished jobs....
  LD librte_security.so.1.1
  INSTALL-LIB librte_security.so.1.1
/tmp/UB1604_K4.4.0_GCC5.4.0/x86_64-native-linuxapp-gcc-shared/805e7f4e2d7d4deabd9b0edf6a6d50b2/dpdk/mk/rte.sdkbuild.mk:49: recipe for target 'lib' failed
make[3]: *** [lib] Error 2
/tmp/UB1604_K4.4.0_GCC5.4.0/x86_64-native-linuxapp-gcc-shared/805e7f4e2d7d4deabd9b0edf6a6d50b2/dpdk/mk/rte.sdkroot.mk:100: recipe for target 'all' failed
make[2]: *** [all] Error 2
/tmp/UB1604_K4.4.0_GCC5.4.0/x86_64-native-linuxapp-gcc-shared/805e7f4e2d7d4deabd9b0edf6a6d50b2/dpdk/mk/rte.sdkinstall.mk:57: recipe for target 'pre_install' failed
make[1]: *** [pre_install] Error 2
/tmp/UB1604_K4.4.0_GCC5.4.0/x86_64-native-linuxapp-gcc-shared/805e7f4e2d7d4deabd9b0edf6a6d50b2/dpdk/mk/rte.sdkroot.mk:79: recipe for target 'install' failed
make: *** [install] Error 2

*Failed Build #10:
OS: FC24
Target: i686-native-linuxapp-gcc
  SYMLINK-FILE include/rte_security.h
  CC dfs_noop.o
  SYMLINK-FILE include/rte_security_driver.h
  CC rte_security.o
In file included from /tmp/FC24_K4.5.5_GCC6.1.1/i686-native-linuxapp-gcc/805e7f4e2d7d4deabd9b0edf6a6d50b2/dpdk/lib/librte_dfs/dfs_noop.c:18:0:
/tmp/FC24_K4.5.5_GCC6.1.1/i686-native-linuxapp-gcc/805e7f4e2d7d4deabd9b0edf6a6d50b2/dpdk/lib/librte_dfs/dfs.h:28:21: fatal error: jansson.h: No such file or directory
 #include <jansson.h>
                     ^
compilation terminated.
/tmp/FC24_K4.5.5_GCC6.1.1/i686-native-linuxapp-gcc/805e7f4e2d7d4deabd9b0edf6a6d50b2/dpdk/mk/internal/rte.compile-pre.mk:114: recipe for target 'dfs_noop.o' failed
make[5]: *** [dfs_noop.o] Error 1
/tmp/FC24_K4.5.5_GCC6.1.1/i686-native-linuxapp-gcc/805e7f4e2d7d4deabd9b0edf6a6d50b2/dpdk/mk/rte.subdir.mk:35: recipe for target 'librte_dfs' failed
make[4]: *** [librte_dfs] Error 2
make[4]: *** Waiting for unfinished jobs....
  AR librte_security.a
  INSTALL-LIB librte_security.a
/tmp/FC24_K4.5.5_GCC6.1.1/i686-native-linuxapp-gcc/805e7f4e2d7d4deabd9b0edf6a6d50b2/dpdk/mk/rte.sdkbuild.mk:49: recipe for target 'lib' failed
make[3]: *** [lib] Error 2
/tmp/FC24_K4.5.5_GCC6.1.1/i686-native-linuxapp-gcc/805e7f4e2d7d4deabd9b0edf6a6d50b2/dpdk/mk/rte.sdkroot.mk:100: recipe for target 'all' failed
make[2]: *** [all] Error 2
/tmp/FC24_K4.5.5_GCC6.1.1/i686-native-linuxapp-gcc/805e7f4e2d7d4deabd9b0edf6a6d50b2/dpdk/mk/rte.sdkinstall.mk:57: recipe for target 'pre_install' failed
make[1]: *** [pre_install] Error 2
/tmp/FC24_K4.5.5_GCC6.1.1/i686-native-linuxapp-gcc/805e7f4e2d7d4deabd9b0edf6a6d50b2/dpdk/mk/rte.sdkroot.mk:79: recipe for target 'install' failed
make: *** [install] Error 2

*Failed Build #11:
OS: FreeBSD
Target: x86_64-native-bsdapp-clang
  SYMLINK-FILE include/dfs.h
  SYMLINK-FILE include/rte_security_driver.h
  CC dfs_noop.o
  CC rte_security.o
In file included from /tmp/FreeBSD_K10.3_GCC4.8.5/x86_64-native-bsdapp-clang/805e7f4e2d7d4deabd9b0edf6a6d50b2/dpdk/lib/librte_dfs/dfs_noop.c:18:
/tmp/FreeBSD_K10.3_GCC4.8.5/x86_64-native-bsdapp-clang/805e7f4e2d7d4deabd9b0edf6a6d50b2/dpdk/lib/librte_dfs/dfs.h:28:10: fatal error: 'jansson.h' file not found
#include <jansson.h>
         ^
1 error generated.
gmake[5]: *** [/tmp/FreeBSD_K10.3_GCC4.8.5/x86_64-native-bsdapp-clang/805e7f4e2d7d4deabd9b0edf6a6d50b2/dpdk/mk/internal/rte.compile-pre.mk:116: dfs_noop.o] Error 1
gmake[4]: *** [/tmp/FreeBSD_K10.3_GCC4.8.5/x86_64-native-bsdapp-clang/805e7f4e2d7d4deabd9b0edf6a6d50b2/dpdk/mk/rte.subdir.mk:37: librte_dfs] Error 2
gmake[4]: *** Waiting for unfinished jobs....
  AR librte_security.a
  INSTALL-LIB librte_security.a

*Failed Build #12:
OS: FreeBSD
Target: x86_64-native-bsdapp-gcc
  CC rte_security.o
  AR librte_security.a
  INSTALL-LIB librte_security.a
== Build lib/librte_eventdev
In file included from /tmp/FreeBSD_K10.3_GCC4.8.5/x86_64-native-bsdapp-gcc/805e7f4e2d7d4deabd9b0edf6a6d50b2/dpdk/lib/librte_dfs/dfs_noop.c:18:0:
/tmp/FreeBSD_K10.3_GCC4.8.5/x86_64-native-bsdapp-gcc/805e7f4e2d7d4deabd9b0edf6a6d50b2/dpdk/lib/librte_dfs/dfs.h:28:10: fatal error: jansson.h: No such file or directory
 #include <jansson.h>
          ^~~~~~~~~~~
compilation terminated.
gmake[5]: *** [/tmp/FreeBSD_K10.3_GCC4.8.5/x86_64-native-bsdapp-gcc/805e7f4e2d7d4deabd9b0edf6a6d50b2/dpdk/mk/internal/rte.compile-pre.mk:116: dfs_noop.o] Error 1
gmake[4]: *** [/tmp/FreeBSD_K10.3_GCC4.8.5/x86_64-native-bsdapp-gcc/805e7f4e2d7d4deabd9b0edf6a6d50b2/dpdk/mk/rte.subdir.mk:37: librte_dfs] Error 2

*Failed Build #13:
OS: FC25
Target: x86_64-native-linuxapp-gcc-debug
  SYMLINK-FILE include/dfs.h
  SYMLINK-FILE include/rte_security_driver.h
  CC dfs_noop.o
  CC rte_security.o
In file included from /tmp/FC25_K4.8.6_GCC6.3.1/x86_64-native-linuxapp-gcc-debug/805e7f4e2d7d4deabd9b0edf6a6d50b2/dpdk/lib/librte_dfs/dfs_noop.c:18:0:
/tmp/FC25_K4.8.6_GCC6.3.1/x86_64-native-linuxapp-gcc-debug/805e7f4e2d7d4deabd9b0edf6a6d50b2/dpdk/lib/librte_dfs/dfs.h:28:21: fatal error: jansson.h: No such file or directory
 #include <jansson.h>
                     ^
compilation terminated.
/tmp/FC25_K4.8.6_GCC6.3.1/x86_64-native-linuxapp-gcc-debug/805e7f4e2d7d4deabd9b0edf6a6d50b2/dpdk/mk/internal/rte.compile-pre.mk:114: recipe for target 'dfs_noop.o' failed
make[5]: *** [dfs_noop.o] Error 1
/tmp/FC25_K4.8.6_GCC6.3.1/x86_64-native-linuxapp-gcc-debug/805e7f4e2d7d4deabd9b0edf6a6d50b2/dpdk/mk/rte.subdir.mk:35: recipe for target 'librte_dfs' failed
make[4]: *** [librte_dfs] Error 2
make[4]: *** Waiting for unfinished jobs....
  AR librte_security.a
  INSTALL-LIB librte_security.a
/tmp/FC25_K4.8.6_GCC6.3.1/x86_64-native-linuxapp-gcc-debug/805e7f4e2d7d4deabd9b0edf6a6d50b2/dpdk/mk/rte.sdkbuild.mk:49: recipe for target 'lib' failed
make[3]: *** [lib] Error 2
/tmp/FC25_K4.8.6_GCC6.3.1/x86_64-native-linuxapp-gcc-debug/805e7f4e2d7d4deabd9b0edf6a6d50b2/dpdk/mk/rte.sdkroot.mk:100: recipe for target 'all' failed
make[2]: *** [all] Error 2
/tmp/FC25_K4.8.6_GCC6.3.1/x86_64-native-linuxapp-gcc-debug/805e7f4e2d7d4deabd9b0edf6a6d50b2/dpdk/mk/rte.sdkinstall.mk:57: recipe for target 'pre_install' failed
make[1]: *** [pre_install] Error 2
/tmp/FC25_K4.8.6_GCC6.3.1/x86_64-native-linuxapp-gcc-debug/805e7f4e2d7d4deabd9b0edf6a6d50b2/dpdk/mk/rte.sdkroot.mk:79: recipe for target 'install' failed
make: *** [install] Error 2

*Failed Build #14:
OS: FC24
Target: x86_64-native-linuxapp-clang
  SYMLINK-FILE include/rte_security.h
  CC dfs_noop.o
  SYMLINK-FILE include/rte_security_driver.h
  CC rte_security.o
In file included from /tmp/FC24_K4.9.13_GCC6.2.1/x86_64-native-linuxapp-clang/805e7f4e2d7d4deabd9b0edf6a6d50b2/dpdk/lib/librte_dfs/dfs_noop.c:18:
/tmp/FC24_K4.9.13_GCC6.2.1/x86_64-native-linuxapp-clang/805e7f4e2d7d4deabd9b0edf6a6d50b2/dpdk/lib/librte_dfs/dfs.h:28:10: fatal error: 'jansson.h' file not found
#include <jansson.h>
         ^
1 error generated.
/tmp/FC24_K4.9.13_GCC6.2.1/x86_64-native-linuxapp-clang/805e7f4e2d7d4deabd9b0edf6a6d50b2/dpdk/mk/internal/rte.compile-pre.mk:114: recipe for target 'dfs_noop.o' failed
make[5]: *** [dfs_noop.o] Error 1
/tmp/FC24_K4.9.13_GCC6.2.1/x86_64-native-linuxapp-clang/805e7f4e2d7d4deabd9b0edf6a6d50b2/dpdk/mk/rte.subdir.mk:35: recipe for target 'librte_dfs' failed
make[4]: *** [librte_dfs] Error 2
make[4]: *** Waiting for unfinished jobs....
  AR librte_security.a
  INSTALL-LIB librte_security.a
/tmp/FC24_K4.9.13_GCC6.2.1/x86_64-native-linuxapp-clang/805e7f4e2d7d4deabd9b0edf6a6d50b2/dpdk/mk/rte.sdkbuild.mk:49: recipe for target 'lib' failed
make[3]: *** [lib] Error 2
/tmp/FC24_K4.9.13_GCC6.2.1/x86_64-native-linuxapp-clang/805e7f4e2d7d4deabd9b0edf6a6d50b2/dpdk/mk/rte.sdkroot.mk:100: recipe for target 'all' failed
make[2]: *** [all] Error 2
/tmp/FC24_K4.9.13_GCC6.2.1/x86_64-native-linuxapp-clang/805e7f4e2d7d4deabd9b0edf6a6d50b2/dpdk/mk/rte.sdkinstall.mk:57: recipe for target 'pre_install' failed
make[1]: *** [pre_install] Error 2
/tmp/FC24_K4.9.13_GCC6.2.1/x86_64-native-linuxapp-clang/805e7f4e2d7d4deabd9b0edf6a6d50b2/dpdk/mk/rte.sdkroot.mk:79: recipe for target 'install' failed
make: *** [install] Error 2

*Failed Build #15:
OS: FC24
Target: x86_64-native-linuxapp-gcc-shared
  SYMLINK-FILE include/rte_security.h
  CC dfs_noop.o
  SYMLINK-FILE include/rte_security_driver.h
  CC rte_security.o
In file included from /tmp/FC24_K4.9.13_GCC6.2.1/x86_64-native-linuxapp-gcc-shared/805e7f4e2d7d4deabd9b0edf6a6d50b2/dpdk/lib/librte_dfs/dfs_noop.c:18:0:
/tmp/FC24_K4.9.13_GCC6.2.1/x86_64-native-linuxapp-gcc-shared/805e7f4e2d7d4deabd9b0edf6a6d50b2/dpdk/lib/librte_dfs/dfs.h:28:21: fatal error: jansson.h: No such file or directory
 #include <jansson.h>
                     ^
compilation terminated.
/tmp/FC24_K4.9.13_GCC6.2.1/x86_64-native-linuxapp-gcc-shared/805e7f4e2d7d4deabd9b0edf6a6d50b2/dpdk/mk/internal/rte.compile-pre.mk:114: recipe for target 'dfs_noop.o' failed
make[5]: *** [dfs_noop.o] Error 1
/tmp/FC24_K4.9.13_GCC6.2.1/x86_64-native-linuxapp-gcc-shared/805e7f4e2d7d4deabd9b0edf6a6d50b2/dpdk/mk/rte.subdir.mk:35: recipe for target 'librte_dfs' failed
make[4]: *** [librte_dfs] Error 2
make[4]: *** Waiting for unfinished jobs....
  LD librte_security.so.1.1
  INSTALL-LIB librte_security.so.1.1
/tmp/FC24_K4.9.13_GCC6.2.1/x86_64-native-linuxapp-gcc-shared/805e7f4e2d7d4deabd9b0edf6a6d50b2/dpdk/mk/rte.sdkbuild.mk:49: recipe for target 'lib' failed
make[3]: *** [lib] Error 2
/tmp/FC24_K4.9.13_GCC6.2.1/x86_64-native-linuxapp-gcc-shared/805e7f4e2d7d4deabd9b0edf6a6d50b2/dpdk/mk/rte.sdkroot.mk:100: recipe for target 'all' failed
make[2]: *** [all] Error 2
/tmp/FC24_K4.9.13_GCC6.2.1/x86_64-native-linuxapp-gcc-shared/805e7f4e2d7d4deabd9b0edf6a6d50b2/dpdk/mk/rte.sdkinstall.mk:57: recipe for target 'pre_install' failed
make[1]: *** [pre_install] Error 2
/tmp/FC24_K4.9.13_GCC6.2.1/x86_64-native-linuxapp-gcc-shared/805e7f4e2d7d4deabd9b0edf6a6d50b2/dpdk/mk/rte.sdkroot.mk:79: recipe for target 'install' failed
make: *** [install] Error 2

DPDK STV team


More information about the test-report mailing list