[dpdk-test-report] |FAILURE| pw49006[v6] eal_interrupts: add option for pending callback unregister

sys_stv at intel.com sys_stv at intel.com
Mon Dec 17 13:08:20 CET 2018


Test-Label: Intel-compilation
Test-Status: FAILURE
http://dpdk.org/patch/49006

_Compilation issues_

Submitter: Jakub Grajciar <jgrajcia at cisco.com>
Date: 2018-12-17 12:02:36
DPDK git baseline: Repo:dpdk-master, CommitID: ef8b7c505f10897621c0801d8ef3e961385246f8

Build Summary: 15 Builds Done, 0 Successful, 15 Failures

Test environment and configuration as below:

OS: FC25
	Kernel Version: 4.5.5-300.fc24.x86_64
	CPU info: Intel(R) Xeon(R) CPU E5-2699 v3 @ 2.30GHz
	GCC Version: gcc (GCC) 6.1.1 20160510 (Red Hat 6.1.1-2)
	Clang Version: 3.8.0 (tags/RELEASE_380/final)
	x86_64-native-linuxapp-gcc
	x86_64-native-linuxapp-gcc-debug

OS: FC24
	Kernel Version: 4.11.12-100.fc24.x86_64
	CPU info: Intel(R) Xeon(R) CPU E5-2699 v3 @ 2.30GHz
	GCC Version: gcc (GCC) 6.3.1 20161221 (Red Hat 6.3.1-1)
	Clang Version: 3.8.1 (tags/RELEASE_381/final)
	i686-native-linuxapp-gcc
	x86_64-native-linuxapp-clang
	x86_64-native-linuxapp-gcc-shared

OS: CENTOS
	Kernel Version: 3.10.0-514.10.2.el7.x86_64
	CPU info: Intel(R) Xeon(R) CPU E5-2699 v3 @ 2.30GHz
	GCC Version: gcc (GCC) 4.8.5 20150623 (Red Hat 4.8.5-28)
	Clang Version: 3.4.2 (tags/RELEASE_34/dot2-final)
	i686-native-linuxapp-gcc
	x86_64-native-linuxapp-clang
	x86_64-native-linuxapp-gcc
	x86_64-native-linuxapp-gcc-shared

OS: UB1604
	Kernel Version: 4.4.0-47-generic
	CPU info: Intel(R) Xeon(R) CPU E5-2699 v3 @ 2.30GHz
	GCC Version: gcc (Ubuntu 5.4.0-6ubuntu1~16.04.10) 5.4.0 20160609
	Clang Version: 3.8.0-2ubuntu4 (tags/RELEASE_380/final)
	x86_64-native-linuxapp-gcc
	x86_64-native-linuxapp-gcc-shared
	i686-native-linuxapp-gcc
	x86_64-native-linuxapp-clang

OS: FreeBSD
	Kernel Version: 10.3-RELEASE
	CPU info: Intel(R) Xeon(R) CPU E5-2699 v3 @ 2.30GHz (2294.75-MHz K8-class CPU)
	GCC Version: gcc: not found
	Clang Version: 3.4.1 (tags/RELEASE_34/dot1-final 208032) 20140512
	x86_64-native-bsdapp-gcc
	x86_64-native-bsdapp-clang

*Failed Build #1:
OS: FC25
Target: x86_64-native-linuxapp-gcc
  CC eal_debug.o
  CC eal_lcore.o
  CC eal_timer.o
  CC eal_interrupts.o
In file included from /tmp/FC25_K4.8.6_GCC6.3.1/x86_64-native-linuxapp-gcc/191ea688df054cf7ae31564337a9fe39/dpdk/lib/librte_eal/linuxapp/eal/eal_interrupts.c:23:0:
/tmp/FC25_K4.8.6_GCC6.3.1/x86_64-native-linuxapp-gcc/191ea688df054cf7ae31564337a9fe39/dpdk/x86_64-native-linuxapp-gcc/include/rte_interrupts.h:91:1: error: expected ‘=’, ‘,’, ‘;’, ‘asm’ or ‘__attribute__’ before ‘int’
 int rte_intr_callback_unregister_pending(const struct rte_intr_handle *intr_handle,
 ^~~
/tmp/FC25_K4.8.6_GCC6.3.1/x86_64-native-linuxapp-gcc/191ea688df054cf7ae31564337a9fe39/dpdk/lib/librte_eal/linuxapp/eal/eal_interrupts.c:527:1: warning: no previous prototype for ‘rte_intr_callback_unregister_pending’ [-Wmissing-prototypes]
 rte_intr_callback_unregister_pending(const struct rte_intr_handle *intr_handle,
 ^~~~~~~~~~~~~~~~~~~~~~~~~~~~~~~~~~~~
/tmp/FC25_K4.8.6_GCC6.3.1/x86_64-native-linuxapp-gcc/191ea688df054cf7ae31564337a9fe39/dpdk/mk/internal/rte.compile-pre.mk:114: recipe for target 'eal_interrupts.o' failed
make[7]: *** [eal_interrupts.o] Error 1
make[7]: *** Waiting for unfinished jobs....
/tmp/FC25_K4.8.6_GCC6.3.1/x86_64-native-linuxapp-gcc/191ea688df054cf7ae31564337a9fe39/dpdk/mk/rte.subdir.mk:35: recipe for target 'eal' failed
make[6]: *** [eal] Error 2
/tmp/FC25_K4.8.6_GCC6.3.1/x86_64-native-linuxapp-gcc/191ea688df054cf7ae31564337a9fe39/dpdk/mk/rte.subdir.mk:35: recipe for target 'linuxapp' failed
make[5]: *** [linuxapp] Error 2
/tmp/FC25_K4.8.6_GCC6.3.1/x86_64-native-linuxapp-gcc/191ea688df054cf7ae31564337a9fe39/dpdk/mk/rte.subdir.mk:35: recipe for target 'librte_eal' failed
make[4]: *** [librte_eal] Error 2
/tmp/FC25_K4.8.6_GCC6.3.1/x86_64-native-linuxapp-gcc/191ea688df054cf7ae31564337a9fe39/dpdk/mk/rte.sdkbuild.mk:49: recipe for target 'lib' failed
make[3]: *** [lib] Error 2
/tmp/FC25_K4.8.6_GCC6.3.1/x86_64-native-linuxapp-gcc/191ea688df054cf7ae31564337a9fe39/dpdk/mk/rte.sdkroot.mk:100: recipe for target 'all' failed
make[2]: *** [all] Error 2
/tmp/FC25_K4.8.6_GCC6.3.1/x86_64-native-linuxapp-gcc/191ea688df054cf7ae31564337a9fe39/dpdk/mk/rte.sdkinstall.mk:57: recipe for target 'pre_install' failed
make[1]: *** [pre_install] Error 2
/tmp/FC25_K4.8.6_GCC6.3.1/x86_64-native-linuxapp-gcc/191ea688df054cf7ae31564337a9fe39/dpdk/mk/rte.sdkroot.mk:79: recipe for target 'install' failed
make: *** [install] Error 2

*Failed Build #2:
OS: UB1604
Target: x86_64-native-linuxapp-gcc
  CC eal_debug.o
  CC eal_lcore.o
  CC eal_timer.o
  CC eal_interrupts.o
In file included from /tmp/UB1604_K4.8.0_GCC6.2.0/x86_64-native-linuxapp-gcc/191ea688df054cf7ae31564337a9fe39/dpdk/lib/librte_eal/linuxapp/eal/eal_interrupts.c:23:0:
/tmp/UB1604_K4.8.0_GCC6.2.0/x86_64-native-linuxapp-gcc/191ea688df054cf7ae31564337a9fe39/dpdk/x86_64-native-linuxapp-gcc/include/rte_interrupts.h:91:1: error: expected ‘=’, ‘,’, ‘;’, ‘asm’ or ‘__attribute__’ before ‘int’
 int rte_intr_callback_unregister_pending(const struct rte_intr_handle *intr_handle,
 ^~~
/tmp/UB1604_K4.8.0_GCC6.2.0/x86_64-native-linuxapp-gcc/191ea688df054cf7ae31564337a9fe39/dpdk/lib/librte_eal/linuxapp/eal/eal_interrupts.c:527:1: warning: no previous prototype for ‘rte_intr_callback_unregister_pending’ [-Wmissing-prototypes]
 rte_intr_callback_unregister_pending(const struct rte_intr_handle *intr_handle,
 ^~~~~~~~~~~~~~~~~~~~~~~~~~~~~~~~~~~~
/tmp/UB1604_K4.8.0_GCC6.2.0/x86_64-native-linuxapp-gcc/191ea688df054cf7ae31564337a9fe39/dpdk/mk/internal/rte.compile-pre.mk:114: recipe for target 'eal_interrupts.o' failed
make[7]: *** [eal_interrupts.o] Error 1
make[7]: *** Waiting for unfinished jobs....
/tmp/UB1604_K4.8.0_GCC6.2.0/x86_64-native-linuxapp-gcc/191ea688df054cf7ae31564337a9fe39/dpdk/mk/rte.subdir.mk:35: recipe for target 'eal' failed
make[6]: *** [eal] Error 2
/tmp/UB1604_K4.8.0_GCC6.2.0/x86_64-native-linuxapp-gcc/191ea688df054cf7ae31564337a9fe39/dpdk/mk/rte.subdir.mk:35: recipe for target 'linuxapp' failed
make[5]: *** [linuxapp] Error 2
/tmp/UB1604_K4.8.0_GCC6.2.0/x86_64-native-linuxapp-gcc/191ea688df054cf7ae31564337a9fe39/dpdk/mk/rte.subdir.mk:35: recipe for target 'librte_eal' failed
make[4]: *** [librte_eal] Error 2
/tmp/UB1604_K4.8.0_GCC6.2.0/x86_64-native-linuxapp-gcc/191ea688df054cf7ae31564337a9fe39/dpdk/mk/rte.sdkbuild.mk:49: recipe for target 'lib' failed
make[3]: *** [lib] Error 2
/tmp/UB1604_K4.8.0_GCC6.2.0/x86_64-native-linuxapp-gcc/191ea688df054cf7ae31564337a9fe39/dpdk/mk/rte.sdkroot.mk:100: recipe for target 'all' failed
make[2]: *** [all] Error 2
/tmp/UB1604_K4.8.0_GCC6.2.0/x86_64-native-linuxapp-gcc/191ea688df054cf7ae31564337a9fe39/dpdk/mk/rte.sdkinstall.mk:57: recipe for target 'pre_install' failed
make[1]: *** [pre_install] Error 2
/tmp/UB1604_K4.8.0_GCC6.2.0/x86_64-native-linuxapp-gcc/191ea688df054cf7ae31564337a9fe39/dpdk/mk/rte.sdkroot.mk:79: recipe for target 'install' failed
make: *** [install] Error 2

*Failed Build #3:
OS: CENTOS
Target: i686-native-linuxapp-gcc
  CC eal_debug.o
  CC eal_lcore.o
  CC eal_timer.o
  CC eal_interrupts.o
In file included from /tmp/CENTOS_K3.10.0_GCC4.8.5/i686-native-linuxapp-gcc/191ea688df054cf7ae31564337a9fe39/dpdk/lib/librte_eal/linuxapp/eal/eal_interrupts.c:23:0:
/tmp/CENTOS_K3.10.0_GCC4.8.5/i686-native-linuxapp-gcc/191ea688df054cf7ae31564337a9fe39/dpdk/i686-native-linuxapp-gcc/include/rte_interrupts.h:91:1: error: expected ‘=’, ‘,’, ‘;’, ‘asm’ or ‘__attribute__’ before ‘int’
 int rte_intr_callback_unregister_pending(const struct rte_intr_handle *intr_handle,
 ^
/tmp/CENTOS_K3.10.0_GCC4.8.5/i686-native-linuxapp-gcc/191ea688df054cf7ae31564337a9fe39/dpdk/lib/librte_eal/linuxapp/eal/eal_interrupts.c:527:1: warning: no previous prototype for ‘rte_intr_callback_unregister_pending’ [-Wmissing-prototypes]
 rte_intr_callback_unregister_pending(const struct rte_intr_handle *intr_handle,
 ^
make[7]: *** [eal_interrupts.o] Error 1
make[7]: *** Waiting for unfinished jobs....
make[6]: *** [eal] Error 2

*Failed Build #4:
OS: CENTOS
Target: x86_64-native-linuxapp-clang
  CC eal_debug.o
  CC eal_lcore.o
  CC eal_timer.o
  CC eal_interrupts.o
In file included from /tmp/CENTOS_K3.10.0_GCC4.8.5/x86_64-native-linuxapp-clang/191ea688df054cf7ae31564337a9fe39/dpdk/lib/librte_eal/linuxapp/eal/eal_interrupts.c:23:
/tmp/CENTOS_K3.10.0_GCC4.8.5/x86_64-native-linuxapp-clang/191ea688df054cf7ae31564337a9fe39/dpdk/x86_64-native-linuxapp-clang/include/rte_interrupts.h:90:2: error: unknown type name '__rte_experimental'
 __rte_experimental
 ^
/tmp/CENTOS_K3.10.0_GCC4.8.5/x86_64-native-linuxapp-clang/191ea688df054cf7ae31564337a9fe39/dpdk/x86_64-native-linuxapp-clang/include/rte_interrupts.h:91:1: error: expected identifier or '('
int rte_intr_callback_unregister_pending(const struct rte_intr_handle *intr_handle,
^
/tmp/CENTOS_K3.10.0_GCC4.8.5/x86_64-native-linuxapp-clang/191ea688df054cf7ae31564337a9fe39/dpdk/lib/librte_eal/linuxapp/eal/eal_interrupts.c:527:1: warning: no previous prototype for function 'rte_intr_callback_unregister_pending' [-Wmissing-prototypes]
rte_intr_callback_unregister_pending(const struct rte_intr_handle *intr_handle,
^
1 warning and 2 errors generated.
make[7]: *** [eal_interrupts.o] Error 1
make[7]: *** Waiting for unfinished jobs....
make[6]: *** [eal] Error 2
make[5]: *** [linuxapp] Error 2
make[4]: *** [librte_eal] Error 2

*Failed Build #5:
OS: CENTOS
Target: x86_64-native-linuxapp-gcc
  CC eal_debug.o
  CC eal_lcore.o
  CC eal_timer.o
  CC eal_interrupts.o
In file included from /tmp/CENTOS_K3.10.0_GCC4.8.5/x86_64-native-linuxapp-gcc/191ea688df054cf7ae31564337a9fe39/dpdk/lib/librte_eal/linuxapp/eal/eal_interrupts.c:23:0:
/tmp/CENTOS_K3.10.0_GCC4.8.5/x86_64-native-linuxapp-gcc/191ea688df054cf7ae31564337a9fe39/dpdk/x86_64-native-linuxapp-gcc/include/rte_interrupts.h:91:1: error: expected ‘=’, ‘,’, ‘;’, ‘asm’ or ‘__attribute__’ before ‘int’
 int rte_intr_callback_unregister_pending(const struct rte_intr_handle *intr_handle,
 ^
/tmp/CENTOS_K3.10.0_GCC4.8.5/x86_64-native-linuxapp-gcc/191ea688df054cf7ae31564337a9fe39/dpdk/lib/librte_eal/linuxapp/eal/eal_interrupts.c:527:1: warning: no previous prototype for ‘rte_intr_callback_unregister_pending’ [-Wmissing-prototypes]
 rte_intr_callback_unregister_pending(const struct rte_intr_handle *intr_handle,
 ^
make[7]: *** [eal_interrupts.o] Error 1
make[7]: *** Waiting for unfinished jobs....
make[6]: *** [eal] Error 2

*Failed Build #6:
OS: CENTOS
Target: x86_64-native-linuxapp-gcc-shared
  CC eal_debug.o
  CC eal_lcore.o
  CC eal_timer.o
  CC eal_interrupts.o
In file included from /tmp/CENTOS_K3.10.0_GCC4.8.5/x86_64-native-linuxapp-gcc-shared/191ea688df054cf7ae31564337a9fe39/dpdk/lib/librte_eal/linuxapp/eal/eal_interrupts.c:23:0:
/tmp/CENTOS_K3.10.0_GCC4.8.5/x86_64-native-linuxapp-gcc-shared/191ea688df054cf7ae31564337a9fe39/dpdk/x86_64-native-linuxapp-gcc/include/rte_interrupts.h:91:1: error: expected ‘=’, ‘,’, ‘;’, ‘asm’ or ‘__attribute__’ before ‘int’
 int rte_intr_callback_unregister_pending(const struct rte_intr_handle *intr_handle,
 ^
/tmp/CENTOS_K3.10.0_GCC4.8.5/x86_64-native-linuxapp-gcc-shared/191ea688df054cf7ae31564337a9fe39/dpdk/lib/librte_eal/linuxapp/eal/eal_interrupts.c:527:1: warning: no previous prototype for ‘rte_intr_callback_unregister_pending’ [-Wmissing-prototypes]
 rte_intr_callback_unregister_pending(const struct rte_intr_handle *intr_handle,
 ^
make[7]: *** [eal_interrupts.o] Error 1
make[7]: *** Waiting for unfinished jobs....
make[6]: *** [eal] Error 2

*Failed Build #7:
OS: UB1604
Target: x86_64-native-linuxapp-gcc-shared
  CC eal_debug.o
  CC eal_lcore.o
  CC eal_timer.o
  CC eal_interrupts.o
In file included from /tmp/UB1604_K4.4.0_GCC5.4.0/x86_64-native-linuxapp-gcc-shared/191ea688df054cf7ae31564337a9fe39/dpdk/lib/librte_eal/linuxapp/eal/eal_interrupts.c:23:0:
/tmp/UB1604_K4.4.0_GCC5.4.0/x86_64-native-linuxapp-gcc-shared/191ea688df054cf7ae31564337a9fe39/dpdk/x86_64-native-linuxapp-gcc/include/rte_interrupts.h:91:1: error: expected ‘=’, ‘,’, ‘;’, ‘asm’ or ‘__attribute__’ before ‘int’
 int rte_intr_callback_unregister_pending(const struct rte_intr_handle *intr_handle,
 ^
/tmp/UB1604_K4.4.0_GCC5.4.0/x86_64-native-linuxapp-gcc-shared/191ea688df054cf7ae31564337a9fe39/dpdk/lib/librte_eal/linuxapp/eal/eal_interrupts.c:527:1: warning: no previous prototype for ‘rte_intr_callback_unregister_pending’ [-Wmissing-prototypes]
 rte_intr_callback_unregister_pending(const struct rte_intr_handle *intr_handle,
 ^
/tmp/UB1604_K4.4.0_GCC5.4.0/x86_64-native-linuxapp-gcc-shared/191ea688df054cf7ae31564337a9fe39/dpdk/mk/internal/rte.compile-pre.mk:114: recipe for target 'eal_interrupts.o' failed
make[7]: *** [eal_interrupts.o] Error 1
make[7]: *** Waiting for unfinished jobs....
/tmp/UB1604_K4.4.0_GCC5.4.0/x86_64-native-linuxapp-gcc-shared/191ea688df054cf7ae31564337a9fe39/dpdk/mk/rte.subdir.mk:35: recipe for target 'eal' failed
make[6]: *** [eal] Error 2
/tmp/UB1604_K4.4.0_GCC5.4.0/x86_64-native-linuxapp-gcc-shared/191ea688df054cf7ae31564337a9fe39/dpdk/mk/rte.subdir.mk:35: recipe for target 'linuxapp' failed
make[5]: *** [linuxapp] Error 2
/tmp/UB1604_K4.4.0_GCC5.4.0/x86_64-native-linuxapp-gcc-shared/191ea688df054cf7ae31564337a9fe39/dpdk/mk/rte.subdir.mk:35: recipe for target 'librte_eal' failed
make[4]: *** [librte_eal] Error 2
/tmp/UB1604_K4.4.0_GCC5.4.0/x86_64-native-linuxapp-gcc-shared/191ea688df054cf7ae31564337a9fe39/dpdk/mk/rte.sdkbuild.mk:49: recipe for target 'lib' failed
make[3]: *** [lib] Error 2
/tmp/UB1604_K4.4.0_GCC5.4.0/x86_64-native-linuxapp-gcc-shared/191ea688df054cf7ae31564337a9fe39/dpdk/mk/rte.sdkroot.mk:100: recipe for target 'all' failed
make[2]: *** [all] Error 2
/tmp/UB1604_K4.4.0_GCC5.4.0/x86_64-native-linuxapp-gcc-shared/191ea688df054cf7ae31564337a9fe39/dpdk/mk/rte.sdkinstall.mk:57: recipe for target 'pre_install' failed
make[1]: *** [pre_install] Error 2
/tmp/UB1604_K4.4.0_GCC5.4.0/x86_64-native-linuxapp-gcc-shared/191ea688df054cf7ae31564337a9fe39/dpdk/mk/rte.sdkroot.mk:79: recipe for target 'install' failed
make: *** [install] Error 2

*Failed Build #8:
OS: UB1604
Target: i686-native-linuxapp-gcc
  CC eal_debug.o
  CC eal_lcore.o
  CC eal_timer.o
  CC eal_interrupts.o
In file included from /tmp/UB1604_K4.4.0_GCC5.4.0/i686-native-linuxapp-gcc/191ea688df054cf7ae31564337a9fe39/dpdk/lib/librte_eal/linuxapp/eal/eal_interrupts.c:23:0:
/tmp/UB1604_K4.4.0_GCC5.4.0/i686-native-linuxapp-gcc/191ea688df054cf7ae31564337a9fe39/dpdk/i686-native-linuxapp-gcc/include/rte_interrupts.h:91:1: error: expected ‘=’, ‘,’, ‘;’, ‘asm’ or ‘__attribute__’ before ‘int’
 int rte_intr_callback_unregister_pending(const struct rte_intr_handle *intr_handle,
 ^
/tmp/UB1604_K4.4.0_GCC5.4.0/i686-native-linuxapp-gcc/191ea688df054cf7ae31564337a9fe39/dpdk/lib/librte_eal/linuxapp/eal/eal_interrupts.c:527:1: warning: no previous prototype for ‘rte_intr_callback_unregister_pending’ [-Wmissing-prototypes]
 rte_intr_callback_unregister_pending(const struct rte_intr_handle *intr_handle,
 ^
/tmp/UB1604_K4.4.0_GCC5.4.0/i686-native-linuxapp-gcc/191ea688df054cf7ae31564337a9fe39/dpdk/mk/internal/rte.compile-pre.mk:114: recipe for target 'eal_interrupts.o' failed
make[7]: *** [eal_interrupts.o] Error 1
make[7]: *** Waiting for unfinished jobs....
/tmp/UB1604_K4.4.0_GCC5.4.0/i686-native-linuxapp-gcc/191ea688df054cf7ae31564337a9fe39/dpdk/mk/rte.subdir.mk:35: recipe for target 'eal' failed
make[6]: *** [eal] Error 2
/tmp/UB1604_K4.4.0_GCC5.4.0/i686-native-linuxapp-gcc/191ea688df054cf7ae31564337a9fe39/dpdk/mk/rte.subdir.mk:35: recipe for target 'linuxapp' failed
make[5]: *** [linuxapp] Error 2
/tmp/UB1604_K4.4.0_GCC5.4.0/i686-native-linuxapp-gcc/191ea688df054cf7ae31564337a9fe39/dpdk/mk/rte.subdir.mk:35: recipe for target 'librte_eal' failed
make[4]: *** [librte_eal] Error 2
/tmp/UB1604_K4.4.0_GCC5.4.0/i686-native-linuxapp-gcc/191ea688df054cf7ae31564337a9fe39/dpdk/mk/rte.sdkbuild.mk:49: recipe for target 'lib' failed
make[3]: *** [lib] Error 2
/tmp/UB1604_K4.4.0_GCC5.4.0/i686-native-linuxapp-gcc/191ea688df054cf7ae31564337a9fe39/dpdk/mk/rte.sdkroot.mk:100: recipe for target 'all' failed
make[2]: *** [all] Error 2
/tmp/UB1604_K4.4.0_GCC5.4.0/i686-native-linuxapp-gcc/191ea688df054cf7ae31564337a9fe39/dpdk/mk/rte.sdkinstall.mk:57: recipe for target 'pre_install' failed
make[1]: *** [pre_install] Error 2
/tmp/UB1604_K4.4.0_GCC5.4.0/i686-native-linuxapp-gcc/191ea688df054cf7ae31564337a9fe39/dpdk/mk/rte.sdkroot.mk:79: recipe for target 'install' failed
make: *** [install] Error 2

*Failed Build #9:
OS: UB1604
Target: x86_64-native-linuxapp-clang
  CC eal_debug.o
  CC eal_lcore.o
  CC eal_timer.o
  CC eal_interrupts.o
In file included from /tmp/UB1604_K4.4.0_GCC5.4.0/x86_64-native-linuxapp-clang/191ea688df054cf7ae31564337a9fe39/dpdk/lib/librte_eal/linuxapp/eal/eal_interrupts.c:23:
/tmp/UB1604_K4.4.0_GCC5.4.0/x86_64-native-linuxapp-clang/191ea688df054cf7ae31564337a9fe39/dpdk/x86_64-native-linuxapp-clang/include/rte_interrupts.h:90:2: error: unknown type name '__rte_experimental'
 __rte_experimental
 ^
/tmp/UB1604_K4.4.0_GCC5.4.0/x86_64-native-linuxapp-clang/191ea688df054cf7ae31564337a9fe39/dpdk/x86_64-native-linuxapp-clang/include/rte_interrupts.h:91:1: error: expected identifier or '('
int rte_intr_callback_unregister_pending(const struct rte_intr_handle *intr_handle,
^
  CC eal_alarm.o
/tmp/UB1604_K4.4.0_GCC5.4.0/x86_64-native-linuxapp-clang/191ea688df054cf7ae31564337a9fe39/dpdk/lib/librte_eal/linuxapp/eal/eal_interrupts.c:527:1: warning: no previous prototype for function 'rte_intr_callback_unregister_pending' [-Wmissing-prototypes]
rte_intr_callback_unregister_pending(const struct rte_intr_handle *intr_handle,
^
1 warning and 2 errors generated.
/tmp/UB1604_K4.4.0_GCC5.4.0/x86_64-native-linuxapp-clang/191ea688df054cf7ae31564337a9fe39/dpdk/mk/internal/rte.compile-pre.mk:114: recipe for target 'eal_interrupts.o' failed
make[7]: *** [eal_interrupts.o] Error 1
make[7]: *** Waiting for unfinished jobs....
/tmp/UB1604_K4.4.0_GCC5.4.0/x86_64-native-linuxapp-clang/191ea688df054cf7ae31564337a9fe39/dpdk/mk/rte.subdir.mk:35: recipe for target 'eal' failed
make[6]: *** [eal] Error 2
/tmp/UB1604_K4.4.0_GCC5.4.0/x86_64-native-linuxapp-clang/191ea688df054cf7ae31564337a9fe39/dpdk/mk/rte.subdir.mk:35: recipe for target 'linuxapp' failed
make[5]: *** [linuxapp] Error 2
/tmp/UB1604_K4.4.0_GCC5.4.0/x86_64-native-linuxapp-clang/191ea688df054cf7ae31564337a9fe39/dpdk/mk/rte.subdir.mk:35: recipe for target 'librte_eal' failed
make[4]: *** [librte_eal] Error 2
/tmp/UB1604_K4.4.0_GCC5.4.0/x86_64-native-linuxapp-clang/191ea688df054cf7ae31564337a9fe39/dpdk/mk/rte.sdkbuild.mk:49: recipe for target 'lib' failed
make[3]: *** [lib] Error 2
/tmp/UB1604_K4.4.0_GCC5.4.0/x86_64-native-linuxapp-clang/191ea688df054cf7ae31564337a9fe39/dpdk/mk/rte.sdkroot.mk:100: recipe for target 'all' failed
make[2]: *** [all] Error 2
/tmp/UB1604_K4.4.0_GCC5.4.0/x86_64-native-linuxapp-clang/191ea688df054cf7ae31564337a9fe39/dpdk/mk/rte.sdkinstall.mk:57: recipe for target 'pre_install' failed
make[1]: *** [pre_install] Error 2
/tmp/UB1604_K4.4.0_GCC5.4.0/x86_64-native-linuxapp-clang/191ea688df054cf7ae31564337a9fe39/dpdk/mk/rte.sdkroot.mk:79: recipe for target 'install' failed
make: *** [install] Error 2

*Failed Build #10:
OS: FC24
Target: i686-native-linuxapp-gcc
  CC eal_debug.o
  CC eal_lcore.o
  CC eal_timer.o
  CC eal_interrupts.o
In file included from /tmp/FC24_K4.5.5_GCC6.1.1/i686-native-linuxapp-gcc/191ea688df054cf7ae31564337a9fe39/dpdk/lib/librte_eal/linuxapp/eal/eal_interrupts.c:23:0:
/tmp/FC24_K4.5.5_GCC6.1.1/i686-native-linuxapp-gcc/191ea688df054cf7ae31564337a9fe39/dpdk/i686-native-linuxapp-gcc/include/rte_interrupts.h:91:1: error: expected ‘=’, ‘,’, ‘;’, ‘asm’ or ‘__attribute__’ before ‘int’
 int rte_intr_callback_unregister_pending(const struct rte_intr_handle *intr_handle,
 ^~~
/tmp/FC24_K4.5.5_GCC6.1.1/i686-native-linuxapp-gcc/191ea688df054cf7ae31564337a9fe39/dpdk/lib/librte_eal/linuxapp/eal/eal_interrupts.c:527:1: warning: no previous prototype for ‘rte_intr_callback_unregister_pending’ [-Wmissing-prototypes]
 rte_intr_callback_unregister_pending(const struct rte_intr_handle *intr_handle,
 ^~~~~~~~~~~~~~~~~~~~~~~~~~~~~~~~~~~~
/tmp/FC24_K4.5.5_GCC6.1.1/i686-native-linuxapp-gcc/191ea688df054cf7ae31564337a9fe39/dpdk/mk/internal/rte.compile-pre.mk:114: recipe for target 'eal_interrupts.o' failed
make[7]: *** [eal_interrupts.o] Error 1
make[7]: *** Waiting for unfinished jobs....
/tmp/FC24_K4.5.5_GCC6.1.1/i686-native-linuxapp-gcc/191ea688df054cf7ae31564337a9fe39/dpdk/mk/rte.subdir.mk:35: recipe for target 'eal' failed
make[6]: *** [eal] Error 2
/tmp/FC24_K4.5.5_GCC6.1.1/i686-native-linuxapp-gcc/191ea688df054cf7ae31564337a9fe39/dpdk/mk/rte.subdir.mk:35: recipe for target 'linuxapp' failed
make[5]: *** [linuxapp] Error 2
/tmp/FC24_K4.5.5_GCC6.1.1/i686-native-linuxapp-gcc/191ea688df054cf7ae31564337a9fe39/dpdk/mk/rte.subdir.mk:35: recipe for target 'librte_eal' failed
make[4]: *** [librte_eal] Error 2
/tmp/FC24_K4.5.5_GCC6.1.1/i686-native-linuxapp-gcc/191ea688df054cf7ae31564337a9fe39/dpdk/mk/rte.sdkbuild.mk:49: recipe for target 'lib' failed
make[3]: *** [lib] Error 2
/tmp/FC24_K4.5.5_GCC6.1.1/i686-native-linuxapp-gcc/191ea688df054cf7ae31564337a9fe39/dpdk/mk/rte.sdkroot.mk:100: recipe for target 'all' failed
make[2]: *** [all] Error 2
/tmp/FC24_K4.5.5_GCC6.1.1/i686-native-linuxapp-gcc/191ea688df054cf7ae31564337a9fe39/dpdk/mk/rte.sdkinstall.mk:57: recipe for target 'pre_install' failed
make[1]: *** [pre_install] Error 2
/tmp/FC24_K4.5.5_GCC6.1.1/i686-native-linuxapp-gcc/191ea688df054cf7ae31564337a9fe39/dpdk/mk/rte.sdkroot.mk:79: recipe for target 'install' failed
make: *** [install] Error 2

*Failed Build #11:
OS: FC24
Target: x86_64-native-linuxapp-clang
  CC eal_debug.o
  CC eal_lcore.o
  CC eal_timer.o
  CC eal_interrupts.o
In file included from /tmp/FC24_K4.9.13_GCC6.2.1/x86_64-native-linuxapp-clang/191ea688df054cf7ae31564337a9fe39/dpdk/lib/librte_eal/linuxapp/eal/eal_interrupts.c:23:
/tmp/FC24_K4.9.13_GCC6.2.1/x86_64-native-linuxapp-clang/191ea688df054cf7ae31564337a9fe39/dpdk/x86_64-native-linuxapp-clang/include/rte_interrupts.h:90:2: error: unknown type name '__rte_experimental'
 __rte_experimental
 ^
/tmp/FC24_K4.9.13_GCC6.2.1/x86_64-native-linuxapp-clang/191ea688df054cf7ae31564337a9fe39/dpdk/x86_64-native-linuxapp-clang/include/rte_interrupts.h:91:1: error: expected identifier or '('
int rte_intr_callback_unregister_pending(const struct rte_intr_handle *intr_handle,
^
/tmp/FC24_K4.9.13_GCC6.2.1/x86_64-native-linuxapp-clang/191ea688df054cf7ae31564337a9fe39/dpdk/lib/librte_eal/linuxapp/eal/eal_interrupts.c:527:1: warning: no previous prototype for function 'rte_intr_callback_unregister_pending' [-Wmissing-prototypes]
rte_intr_callback_unregister_pending(const struct rte_intr_handle *intr_handle,
^
1 warning and 2 errors generated.
/tmp/FC24_K4.9.13_GCC6.2.1/x86_64-native-linuxapp-clang/191ea688df054cf7ae31564337a9fe39/dpdk/mk/internal/rte.compile-pre.mk:114: recipe for target 'eal_interrupts.o' failed
make[7]: *** [eal_interrupts.o] Error 1
make[7]: *** Waiting for unfinished jobs....
  CC eal_alarm.o
/tmp/FC24_K4.9.13_GCC6.2.1/x86_64-native-linuxapp-clang/191ea688df054cf7ae31564337a9fe39/dpdk/mk/rte.subdir.mk:35: recipe for target 'eal' failed
make[6]: *** [eal] Error 2
/tmp/FC24_K4.9.13_GCC6.2.1/x86_64-native-linuxapp-clang/191ea688df054cf7ae31564337a9fe39/dpdk/mk/rte.subdir.mk:35: recipe for target 'linuxapp' failed
make[5]: *** [linuxapp] Error 2
/tmp/FC24_K4.9.13_GCC6.2.1/x86_64-native-linuxapp-clang/191ea688df054cf7ae31564337a9fe39/dpdk/mk/rte.subdir.mk:35: recipe for target 'librte_eal' failed
make[4]: *** [librte_eal] Error 2
/tmp/FC24_K4.9.13_GCC6.2.1/x86_64-native-linuxapp-clang/191ea688df054cf7ae31564337a9fe39/dpdk/mk/rte.sdkbuild.mk:49: recipe for target 'lib' failed
make[3]: *** [lib] Error 2
/tmp/FC24_K4.9.13_GCC6.2.1/x86_64-native-linuxapp-clang/191ea688df054cf7ae31564337a9fe39/dpdk/mk/rte.sdkroot.mk:100: recipe for target 'all' failed
make[2]: *** [all] Error 2
/tmp/FC24_K4.9.13_GCC6.2.1/x86_64-native-linuxapp-clang/191ea688df054cf7ae31564337a9fe39/dpdk/mk/rte.sdkinstall.mk:57: recipe for target 'pre_install' failed
make[1]: *** [pre_install] Error 2
/tmp/FC24_K4.9.13_GCC6.2.1/x86_64-native-linuxapp-clang/191ea688df054cf7ae31564337a9fe39/dpdk/mk/rte.sdkroot.mk:79: recipe for target 'install' failed
make: *** [install] Error 2

*Failed Build #12:
OS: FC25
Target: x86_64-native-linuxapp-gcc-debug
  CC eal_debug.o
  CC eal_lcore.o
  CC eal_timer.o
  CC eal_interrupts.o
In file included from /tmp/FC25_K4.8.6_GCC6.3.1/x86_64-native-linuxapp-gcc-debug/191ea688df054cf7ae31564337a9fe39/dpdk/lib/librte_eal/linuxapp/eal/eal_interrupts.c:23:0:
/tmp/FC25_K4.8.6_GCC6.3.1/x86_64-native-linuxapp-gcc-debug/191ea688df054cf7ae31564337a9fe39/dpdk/x86_64-native-linuxapp-gcc/include/rte_interrupts.h:91:1: error: expected ‘=’, ‘,’, ‘;’, ‘asm’ or ‘__attribute__’ before ‘int’
 int rte_intr_callback_unregister_pending(const struct rte_intr_handle *intr_handle,
 ^~~
/tmp/FC25_K4.8.6_GCC6.3.1/x86_64-native-linuxapp-gcc-debug/191ea688df054cf7ae31564337a9fe39/dpdk/lib/librte_eal/linuxapp/eal/eal_interrupts.c:527:1: warning: no previous prototype for ‘rte_intr_callback_unregister_pending’ [-Wmissing-prototypes]
 rte_intr_callback_unregister_pending(const struct rte_intr_handle *intr_handle,
 ^~~~~~~~~~~~~~~~~~~~~~~~~~~~~~~~~~~~
/tmp/FC25_K4.8.6_GCC6.3.1/x86_64-native-linuxapp-gcc-debug/191ea688df054cf7ae31564337a9fe39/dpdk/mk/internal/rte.compile-pre.mk:114: recipe for target 'eal_interrupts.o' failed
make[7]: *** [eal_interrupts.o] Error 1
make[7]: *** Waiting for unfinished jobs....
/tmp/FC25_K4.8.6_GCC6.3.1/x86_64-native-linuxapp-gcc-debug/191ea688df054cf7ae31564337a9fe39/dpdk/mk/rte.subdir.mk:35: recipe for target 'eal' failed
make[6]: *** [eal] Error 2
/tmp/FC25_K4.8.6_GCC6.3.1/x86_64-native-linuxapp-gcc-debug/191ea688df054cf7ae31564337a9fe39/dpdk/mk/rte.subdir.mk:35: recipe for target 'linuxapp' failed
make[5]: *** [linuxapp] Error 2
/tmp/FC25_K4.8.6_GCC6.3.1/x86_64-native-linuxapp-gcc-debug/191ea688df054cf7ae31564337a9fe39/dpdk/mk/rte.subdir.mk:35: recipe for target 'librte_eal' failed
make[4]: *** [librte_eal] Error 2
/tmp/FC25_K4.8.6_GCC6.3.1/x86_64-native-linuxapp-gcc-debug/191ea688df054cf7ae31564337a9fe39/dpdk/mk/rte.sdkbuild.mk:49: recipe for target 'lib' failed
make[3]: *** [lib] Error 2
/tmp/FC25_K4.8.6_GCC6.3.1/x86_64-native-linuxapp-gcc-debug/191ea688df054cf7ae31564337a9fe39/dpdk/mk/rte.sdkroot.mk:100: recipe for target 'all' failed
make[2]: *** [all] Error 2
/tmp/FC25_K4.8.6_GCC6.3.1/x86_64-native-linuxapp-gcc-debug/191ea688df054cf7ae31564337a9fe39/dpdk/mk/rte.sdkinstall.mk:57: recipe for target 'pre_install' failed
make[1]: *** [pre_install] Error 2
/tmp/FC25_K4.8.6_GCC6.3.1/x86_64-native-linuxapp-gcc-debug/191ea688df054cf7ae31564337a9fe39/dpdk/mk/rte.sdkroot.mk:79: recipe for target 'install' failed
make: *** [install] Error 2

*Failed Build #13:
OS: FreeBSD
Target: x86_64-native-bsdapp-gcc
  CC rte_pci.o
  SYMLINK-FILE include/rte_ring_generic.h
  SYMLINK-FILE include/rte_ring_c11_mem.h
  CC rte_ring.o
In file included from /tmp/FreeBSD_K10.3_GCC4.8.5/x86_64-native-bsdapp-gcc/191ea688df054cf7ae31564337a9fe39/dpdk/lib/librte_pci/rte_pci.c:15:0:
/tmp/FreeBSD_K10.3_GCC4.8.5/x86_64-native-bsdapp-gcc/191ea688df054cf7ae31564337a9fe39/dpdk/x86_64-native-bsdapp-gcc/include/rte_interrupts.h:91:1: error: expected '=', ',', ';', 'asm' or '__attribute__' before 'int'
 int rte_intr_callback_unregister_pending(const struct rte_intr_handle *intr_handle,
 ^~~
gmake[5]: *** [/tmp/FreeBSD_K10.3_GCC4.8.5/x86_64-native-bsdapp-gcc/191ea688df054cf7ae31564337a9fe39/dpdk/mk/internal/rte.compile-pre.mk:116: rte_pci.o] Error 1
gmake[4]: *** [/tmp/FreeBSD_K10.3_GCC4.8.5/x86_64-native-bsdapp-gcc/191ea688df054cf7ae31564337a9fe39/dpdk/mk/rte.subdir.mk:37: librte_pci] Error 2
gmake[4]: *** Waiting for unfinished jobs....

*Failed Build #14:
OS: FC24
Target: x86_64-native-linuxapp-gcc-shared
  CC eal_debug.o
  CC eal_lcore.o
  CC eal_timer.o
  CC eal_interrupts.o
In file included from /tmp/FC24_K4.9.13_GCC6.2.1/x86_64-native-linuxapp-gcc-shared/191ea688df054cf7ae31564337a9fe39/dpdk/lib/librte_eal/linuxapp/eal/eal_interrupts.c:23:0:
/tmp/FC24_K4.9.13_GCC6.2.1/x86_64-native-linuxapp-gcc-shared/191ea688df054cf7ae31564337a9fe39/dpdk/x86_64-native-linuxapp-gcc/include/rte_interrupts.h:91:1: error: expected ‘=’, ‘,’, ‘;’, ‘asm’ or ‘__attribute__’ before ‘int’
 int rte_intr_callback_unregister_pending(const struct rte_intr_handle *intr_handle,
 ^~~
/tmp/FC24_K4.9.13_GCC6.2.1/x86_64-native-linuxapp-gcc-shared/191ea688df054cf7ae31564337a9fe39/dpdk/lib/librte_eal/linuxapp/eal/eal_interrupts.c:527:1: warning: no previous prototype for ‘rte_intr_callback_unregister_pending’ [-Wmissing-prototypes]
 rte_intr_callback_unregister_pending(const struct rte_intr_handle *intr_handle,
 ^~~~~~~~~~~~~~~~~~~~~~~~~~~~~~~~~~~~
/tmp/FC24_K4.9.13_GCC6.2.1/x86_64-native-linuxapp-gcc-shared/191ea688df054cf7ae31564337a9fe39/dpdk/mk/internal/rte.compile-pre.mk:114: recipe for target 'eal_interrupts.o' failed
make[7]: *** [eal_interrupts.o] Error 1
make[7]: *** Waiting for unfinished jobs....
/tmp/FC24_K4.9.13_GCC6.2.1/x86_64-native-linuxapp-gcc-shared/191ea688df054cf7ae31564337a9fe39/dpdk/mk/rte.subdir.mk:35: recipe for target 'eal' failed
make[6]: *** [eal] Error 2
/tmp/FC24_K4.9.13_GCC6.2.1/x86_64-native-linuxapp-gcc-shared/191ea688df054cf7ae31564337a9fe39/dpdk/mk/rte.subdir.mk:35: recipe for target 'linuxapp' failed
make[5]: *** [linuxapp] Error 2
/tmp/FC24_K4.9.13_GCC6.2.1/x86_64-native-linuxapp-gcc-shared/191ea688df054cf7ae31564337a9fe39/dpdk/mk/rte.subdir.mk:35: recipe for target 'librte_eal' failed
make[4]: *** [librte_eal] Error 2
/tmp/FC24_K4.9.13_GCC6.2.1/x86_64-native-linuxapp-gcc-shared/191ea688df054cf7ae31564337a9fe39/dpdk/mk/rte.sdkbuild.mk:49: recipe for target 'lib' failed
make[3]: *** [lib] Error 2
/tmp/FC24_K4.9.13_GCC6.2.1/x86_64-native-linuxapp-gcc-shared/191ea688df054cf7ae31564337a9fe39/dpdk/mk/rte.sdkroot.mk:100: recipe for target 'all' failed
make[2]: *** [all] Error 2
/tmp/FC24_K4.9.13_GCC6.2.1/x86_64-native-linuxapp-gcc-shared/191ea688df054cf7ae31564337a9fe39/dpdk/mk/rte.sdkinstall.mk:57: recipe for target 'pre_install' failed
make[1]: *** [pre_install] Error 2
/tmp/FC24_K4.9.13_GCC6.2.1/x86_64-native-linuxapp-gcc-shared/191ea688df054cf7ae31564337a9fe39/dpdk/mk/rte.sdkroot.mk:79: recipe for target 'install' failed
make: *** [install] Error 2

*Failed Build #15:
OS: FreeBSD
Target: x86_64-native-bsdapp-clang
  SYMLINK-FILE include/rte_ring_generic.h
  CC rte_pci.o
  SYMLINK-FILE include/rte_ring_c11_mem.h
  CC rte_ring.o
In file included from /tmp/FreeBSD_K10.3_GCC4.8.5/x86_64-native-bsdapp-clang/191ea688df054cf7ae31564337a9fe39/dpdk/lib/librte_pci/rte_pci.c:15:
/tmp/FreeBSD_K10.3_GCC4.8.5/x86_64-native-bsdapp-clang/191ea688df054cf7ae31564337a9fe39/dpdk/x86_64-native-bsdapp-clang/include/rte_interrupts.h:90:2: error: unknown type name '__rte_experimental'
 __rte_experimental
 ^
/tmp/FreeBSD_K10.3_GCC4.8.5/x86_64-native-bsdapp-clang/191ea688df054cf7ae31564337a9fe39/dpdk/x86_64-native-bsdapp-clang/include/rte_interrupts.h:91:1: error: expected identifier or '('
int rte_intr_callback_unregister_pending(const struct rte_intr_handle *intr_handle,
^
2 errors generated.
gmake[5]: *** [/tmp/FreeBSD_K10.3_GCC4.8.5/x86_64-native-bsdapp-clang/191ea688df054cf7ae31564337a9fe39/dpdk/mk/internal/rte.compile-pre.mk:116: rte_pci.o] Error 1
gmake[4]: *** [/tmp/FreeBSD_K10.3_GCC4.8.5/x86_64-native-bsdapp-clang/191ea688df054cf7ae31564337a9fe39/dpdk/mk/rte.subdir.mk:37: librte_pci] Error 2
gmake[4]: *** Waiting for unfinished jobs....
  AR librte_ring.a
  INSTALL-LIB librte_ring.a

DPDK STV team


More information about the test-report mailing list