[dpdk-test-report] |FAILURE| pw49092[v7, 2/3] net/i40e: support PF respond VF request more queues

sys_stv at intel.com sys_stv at intel.com
Wed Dec 19 06:38:26 CET 2018


Test-Label: Intel-compilation
Test-Status: FAILURE
http://dpdk.org/patch/49092

_Compilation issues_

Submitter: Zhirun Yan <zhirun.yan at intel.com>
Date: 2018-12-19 13:08:55
DPDK git baseline: Repo:dpdk-master, CommitID: f8a05885e7fffbcba1b42bf21ac61c2523943cde

Build Summary: 15 Builds Done, 0 Successful, 15 Failures

Test environment and configuration as below:

OS: FC25
	Kernel Version: 4.5.5-300.fc24.x86_64
	CPU info: Intel(R) Xeon(R) CPU E5-2699 v3 @ 2.30GHz
	GCC Version: gcc (GCC) 6.1.1 20160510 (Red Hat 6.1.1-2)
	Clang Version: 3.8.0 (tags/RELEASE_380/final)
	x86_64-native-linuxapp-gcc
	x86_64-native-linuxapp-gcc-debug

OS: FC24
	Kernel Version: 4.9.13-100.fc24.x86_64
	CPU info: Intel(R) Xeon(R) CPU E5-2699 v3 @ 2.30GHz
	GCC Version: gcc (GCC) 6.3.1 20161221 (Red Hat 6.3.1-1)
	Clang Version: 3.8.1 (tags/RELEASE_381/final)
	x86_64-native-linuxapp-gcc-shared
	x86_64-native-linuxapp-clang
	i686-native-linuxapp-gcc

OS: CENTOS
	Kernel Version: 3.10.0-862.14.4.el7.x86_64
	CPU info: Intel(R) Xeon(R) CPU E5-2699 v3 @ 2.30GHz
	GCC Version: gcc (GCC) 4.8.5 20150623 (Red Hat 4.8.5-28)
	Clang Version: NA
	x86_64-native-linuxapp-clang
	x86_64-native-linuxapp-gcc
	x86_64-native-linuxapp-gcc-shared
	i686-native-linuxapp-gcc

OS: UB1604
	Kernel Version: 4.4.0-137-generic
	CPU info: Intel(R) Xeon(R) CPU E5-2699 v3 @ 2.30GHz
	GCC Version: gcc (Ubuntu 5.4.0-6ubuntu1~16.04.10) 5.4.0 20160609
	Clang Version: 3.8.0-2ubuntu4 (tags/RELEASE_380/final)
	x86_64-native-linuxapp-gcc
	x86_64-native-linuxapp-clang
	i686-native-linuxapp-gcc
	x86_64-native-linuxapp-gcc-shared

OS: FreeBSD
	Kernel Version: 10.3-RELEASE
	CPU info: Intel(R) Xeon(R) CPU E5-2699 v3 @ 2.30GHz (2294.75-MHz K8-class CPU)
	GCC Version: gcc (FreeBSD Ports Collection) 7.3.0
	Clang Version: 3.4.1 (tags/RELEASE_34/dot1-final 208032) 20140512
	x86_64-native-bsdapp-clang
	x86_64-native-bsdapp-gcc

*Failed Build #1:
OS: FC25
Target: x86_64-native-linuxapp-gcc
  PMDINFO i40e_ethdev_vf.o.pmd.c
  CC i40e_ethdev_vf.o.pmd.o
  LD i40e_ethdev_vf.o
  CC i40e_pf.o
/tmp/FC25_K4.8.6_GCC6.3.1/x86_64-native-linuxapp-gcc/d1f1def0ab3f48ecae99e77a82bbe165/dpdk/drivers/net/i40e/i40e_pf.c: In function ‘i40e_pf_host_process_cmd_request_queues’:
/tmp/FC25_K4.8.6_GCC6.3.1/x86_64-native-linuxapp-gcc/d1f1def0ab3f48ecae99e77a82bbe165/dpdk/drivers/net/i40e/i40e_pf.c:1254:20: warning: missing terminating " character
   PMD_DRV_LOG(ERR, "VF %d tried to request %d queues.
                    ^
/tmp/FC25_K4.8.6_GCC6.3.1/x86_64-native-linuxapp-gcc/d1f1def0ab3f48ecae99e77a82bbe165/dpdk/drivers/net/i40e/i40e_pf.c:1255:19: warning: missing terminating " character
        Ignoring.\n", vf->vf_idx,
                   ^
In file included from /tmp/FC25_K4.8.6_GCC6.3.1/x86_64-native-linuxapp-gcc/d1f1def0ab3f48ecae99e77a82bbe165/dpdk/drivers/net/i40e/i40e_pf.c:21:0:
/tmp/FC25_K4.8.6_GCC6.3.1/x86_64-native-linuxapp-gcc/d1f1def0ab3f48ecae99e77a82bbe165/dpdk/drivers/net/i40e/i40e_pf.c:1254:20: error: missing terminating " character
   PMD_DRV_LOG(ERR, "VF %d tried to request %d queues.
                    ^
/tmp/FC25_K4.8.6_GCC6.3.1/x86_64-native-linuxapp-gcc/d1f1def0ab3f48ecae99e77a82bbe165/dpdk/drivers/net/i40e/i40e_logs.h:37:59: note: in definition of macro ‘PMD_DRV_LOG_RAW’
  rte_log(RTE_LOG_ ## level, i40e_logtype_driver, "%s(): " fmt, \
                                                           ^~~
/tmp/FC25_K4.8.6_GCC6.3.1/x86_64-native-linuxapp-gcc/d1f1def0ab3f48ecae99e77a82bbe165/dpdk/drivers/net/i40e/i40e_pf.c:1254:3: note: in expansion of macro ‘PMD_DRV_LOG’
   PMD_DRV_LOG(ERR, "VF %d tried to request %d queues.
   ^~~~~~~~~~~
/tmp/FC25_K4.8.6_GCC6.3.1/x86_64-native-linuxapp-gcc/d1f1def0ab3f48ecae99e77a82bbe165/dpdk/drivers/net/i40e/i40e_pf.c:1255:8: error: expected ‘)’ before ‘Ignoring’
        Ignoring.\n", vf->vf_idx,
        ^
/tmp/FC25_K4.8.6_GCC6.3.1/x86_64-native-linuxapp-gcc/d1f1def0ab3f48ecae99e77a82bbe165/dpdk/drivers/net/i40e/i40e_logs.h:37:59: note: in definition of macro ‘PMD_DRV_LOG_RAW’
  rte_log(RTE_LOG_ ## level, i40e_logtype_driver, "%s(): " fmt, \
                                                           ^~~
/tmp/FC25_K4.8.6_GCC6.3.1/x86_64-native-linuxapp-gcc/d1f1def0ab3f48ecae99e77a82bbe165/dpdk/drivers/net/i40e/i40e_pf.c:1254:3: note: in expansion of macro ‘PMD_DRV_LOG’
   PMD_DRV_LOG(ERR, "VF %d tried to request %d queues.
   ^~~~~~~~~~~
/tmp/FC25_K4.8.6_GCC6.3.1/x86_64-native-linuxapp-gcc/d1f1def0ab3f48ecae99e77a82bbe165/dpdk/drivers/net/i40e/i40e_pf.c:1255:17: error: stray ‘\’ in program
        Ignoring.\n", vf->vf_idx,
                 ^
/tmp/FC25_K4.8.6_GCC6.3.1/x86_64-native-linuxapp-gcc/d1f1def0ab3f48ecae99e77a82bbe165/dpdk/drivers/net/i40e/i40e_logs.h:37:59: note: in definition of macro ‘PMD_DRV_LOG_RAW’
  rte_log(RTE_LOG_ ## level, i40e_logtype_driver, "%s(): " fmt, \
                                                           ^~~
/tmp/FC25_K4.8.6_GCC6.3.1/x86_64-native-linuxapp-gcc/d1f1def0ab3f48ecae99e77a82bbe165/dpdk/drivers/net/i40e/i40e_pf.c:1254:3: note: in expansion of macro ‘PMD_DRV_LOG’
   PMD_DRV_LOG(ERR, "VF %d tried to request %d queues.
   ^~~~~~~~~~~
/tmp/FC25_K4.8.6_GCC6.3.1/x86_64-native-linuxapp-gcc/d1f1def0ab3f48ecae99e77a82bbe165/dpdk/drivers/net/i40e/i40e_pf.c:1255:19: error: missing terminating " character
        Ignoring.\n", vf->vf_idx,
                   ^
/tmp/FC25_K4.8.6_GCC6.3.1/x86_64-native-linuxapp-gcc/d1f1def0ab3f48ecae99e77a82bbe165/dpdk/drivers/net/i40e/i40e_logs.h:37:59: note: in definition of macro ‘PMD_DRV_LOG_RAW’
  rte_log(RTE_LOG_ ## level, i40e_logtype_driver, "%s(): " fmt, \
                                                           ^~~
/tmp/FC25_K4.8.6_GCC6.3.1/x86_64-native-linuxapp-gcc/d1f1def0ab3f48ecae99e77a82bbe165/dpdk/drivers/net/i40e/i40e_pf.c:1254:3: note: in expansion of macro ‘PMD_DRV_LOG’
   PMD_DRV_LOG(ERR, "VF %d tried to request %d queues.
   ^~~~~~~~~~~
/tmp/FC25_K4.8.6_GCC6.3.1/x86_64-native-linuxapp-gcc/d1f1def0ab3f48ecae99e77a82bbe165/dpdk/drivers/net/i40e/i40e_logs.h:37:50: warning: format ‘%s’ expects a matching ‘char *’ argument [-Wformat=]
  rte_log(RTE_LOG_ ## level, i40e_logtype_driver, "%s(): " fmt, \
                                                  ^
/tmp/FC25_K4.8.6_GCC6.3.1/x86_64-native-linuxapp-gcc/d1f1def0ab3f48ecae99e77a82bbe165/dpdk/drivers/net/i40e/i40e_logs.h:41:2: note: in expansion of macro ‘PMD_DRV_LOG_RAW’
  PMD_DRV_LOG_RAW(level, fmt "\n", ## args)
  ^~~~~~~~~~~~~~~
/tmp/FC25_K4.8.6_GCC6.3.1/x86_64-native-linuxapp-gcc/d1f1def0ab3f48ecae99e77a82bbe165/dpdk/drivers/net/i40e/i40e_pf.c:1254:3: note: in expansion of macro ‘PMD_DRV_LOG’
   PMD_DRV_LOG(ERR, "VF %d tried to request %d queues.
   ^~~~~~~~~~~
/tmp/FC25_K4.8.6_GCC6.3.1/x86_64-native-linuxapp-gcc/d1f1def0ab3f48ecae99e77a82bbe165/dpdk/drivers/net/i40e/i40e_pf.c:1258:20: warning: missing terminating " character
   PMD_DRV_LOG(ERR, "VF %d tried to request more than
                    ^
/tmp/FC25_K4.8.6_GCC6.3.1/x86_64-native-linuxapp-gcc/d1f1def0ab3f48ecae99e77a82bbe165/dpdk/drivers/net/i40e/i40e_pf.c:1259:20: warning: missing terminating " character
        %d queues.\n", vf->vf_idx,
                    ^
In file included from /tmp/FC25_K4.8.6_GCC6.3.1/x86_64-native-linuxapp-gcc/d1f1def0ab3f48ecae99e77a82bbe165/dpdk/drivers/net/i40e/i40e_pf.c:21:0:
/tmp/FC25_K4.8.6_GCC6.3.1/x86_64-native-linuxapp-gcc/d1f1def0ab3f48ecae99e77a82bbe165/dpdk/drivers/net/i40e/i40e_pf.c:1258:20: error: missing terminating " character
   PMD_DRV_LOG(ERR, "VF %d tried to request more than
                    ^
/tmp/FC25_K4.8.6_GCC6.3.1/x86_64-native-linuxapp-gcc/d1f1def0ab3f48ecae99e77a82bbe165/dpdk/drivers/net/i40e/i40e_logs.h:37:59: note: in definition of macro ‘PMD_DRV_LOG_RAW’
  rte_log(RTE_LOG_ ## level, i40e_logtype_driver, "%s(): " fmt, \
                                                           ^~~
/tmp/FC25_K4.8.6_GCC6.3.1/x86_64-native-linuxapp-gcc/d1f1def0ab3f48ecae99e77a82bbe165/dpdk/drivers/net/i40e/i40e_pf.c:1258:3: note: in expansion of macro ‘PMD_DRV_LOG’
   PMD_DRV_LOG(ERR, "VF %d tried to request more than
   ^~~~~~~~~~~
/tmp/FC25_K4.8.6_GCC6.3.1/x86_64-native-linuxapp-gcc/d1f1def0ab3f48ecae99e77a82bbe165/dpdk/drivers/net/i40e/i40e_pf.c:1259:9: error: ‘d’ undeclared (first use in this function)
        %d queues.\n", vf->vf_idx,
         ^
/tmp/FC25_K4.8.6_GCC6.3.1/x86_64-native-linuxapp-gcc/d1f1def0ab3f48ecae99e77a82bbe165/dpdk/drivers/net/i40e/i40e_logs.h:37:59: note: in definition of macro ‘PMD_DRV_LOG_RAW’
  rte_log(RTE_LOG_ ## level, i40e_logtype_driver, "%s(): " fmt, \
                                                           ^~~
--
  rte_log(RTE_LOG_ ## level, i40e_logtype_driver, "%s(): " fmt, \
                                                           ^~~
/tmp/FC25_K4.8.6_GCC6.3.1/x86_64-native-linuxapp-gcc/d1f1def0ab3f48ecae99e77a82bbe165/dpdk/drivers/net/i40e/i40e_pf.c:1258:3: note: in expansion of macro ‘PMD_DRV_LOG’
   PMD_DRV_LOG(ERR, "VF %d tried to request more than
   ^~~~~~~~~~~
/tmp/FC25_K4.8.6_GCC6.3.1/x86_64-native-linuxapp-gcc/d1f1def0ab3f48ecae99e77a82bbe165/dpdk/drivers/net/i40e/i40e_pf.c:1259:11: error: expected ‘)’ before ‘queues’
        %d queues.\n", vf->vf_idx,
           ^
/tmp/FC25_K4.8.6_GCC6.3.1/x86_64-native-linuxapp-gcc/d1f1def0ab3f48ecae99e77a82bbe165/dpdk/drivers/net/i40e/i40e_logs.h:37:59: note: in definition of macro ‘PMD_DRV_LOG_RAW’
  rte_log(RTE_LOG_ ## level, i40e_logtype_driver, "%s(): " fmt, \
                                                           ^~~
/tmp/FC25_K4.8.6_GCC6.3.1/x86_64-native-linuxapp-gcc/d1f1def0ab3f48ecae99e77a82bbe165/dpdk/drivers/net/i40e/i40e_pf.c:1258:3: note: in expansion of macro ‘PMD_DRV_LOG’
   PMD_DRV_LOG(ERR, "VF %d tried to request more than
   ^~~~~~~~~~~
/tmp/FC25_K4.8.6_GCC6.3.1/x86_64-native-linuxapp-gcc/d1f1def0ab3f48ecae99e77a82bbe165/dpdk/drivers/net/i40e/i40e_pf.c:1259:18: error: stray ‘\’ in program
        %d queues.\n", vf->vf_idx,
                  ^
/tmp/FC25_K4.8.6_GCC6.3.1/x86_64-native-linuxapp-gcc/d1f1def0ab3f48ecae99e77a82bbe165/dpdk/drivers/net/i40e/i40e_logs.h:37:59: note: in definition of macro ‘PMD_DRV_LOG_RAW’
  rte_log(RTE_LOG_ ## level, i40e_logtype_driver, "%s(): " fmt, \
                                                           ^~~
/tmp/FC25_K4.8.6_GCC6.3.1/x86_64-native-linuxapp-gcc/d1f1def0ab3f48ecae99e77a82bbe165/dpdk/drivers/net/i40e/i40e_pf.c:1258:3: note: in expansion of macro ‘PMD_DRV_LOG’
   PMD_DRV_LOG(ERR, "VF %d tried to request more than
   ^~~~~~~~~~~
/tmp/FC25_K4.8.6_GCC6.3.1/x86_64-native-linuxapp-gcc/d1f1def0ab3f48ecae99e77a82bbe165/dpdk/drivers/net/i40e/i40e_pf.c:1259:20: error: missing terminating " character
        %d queues.\n", vf->vf_idx,
                    ^
/tmp/FC25_K4.8.6_GCC6.3.1/x86_64-native-linuxapp-gcc/d1f1def0ab3f48ecae99e77a82bbe165/dpdk/drivers/net/i40e/i40e_logs.h:37:59: note: in definition of macro ‘PMD_DRV_LOG_RAW’
  rte_log(RTE_LOG_ ## level, i40e_logtype_driver, "%s(): " fmt, \
                                                           ^~~
/tmp/FC25_K4.8.6_GCC6.3.1/x86_64-native-linuxapp-gcc/d1f1def0ab3f48ecae99e77a82bbe165/dpdk/drivers/net/i40e/i40e_pf.c:1258:3: note: in expansion of macro ‘PMD_DRV_LOG’
   PMD_DRV_LOG(ERR, "VF %d tried to request more than
   ^~~~~~~~~~~
/tmp/FC25_K4.8.6_GCC6.3.1/x86_64-native-linuxapp-gcc/d1f1def0ab3f48ecae99e77a82bbe165/dpdk/drivers/net/i40e/i40e_pf.c:1263:20: warning: missing terminating " character
   PMD_DRV_LOG(ERR, "VF %d requested %d more queues,
                    ^
/tmp/FC25_K4.8.6_GCC6.3.1/x86_64-native-linuxapp-gcc/d1f1def0ab3f48ecae99e77a82bbe165/dpdk/drivers/net/i40e/i40e_pf.c:1264:26: warning: missing terminating " character
        but noly %d left\n", vf->vf_idx,
                          ^
In file included from /tmp/FC25_K4.8.6_GCC6.3.1/x86_64-native-linuxapp-gcc/d1f1def0ab3f48ecae99e77a82bbe165/dpdk/drivers/net/i40e/i40e_pf.c:21:0:
/tmp/FC25_K4.8.6_GCC6.3.1/x86_64-native-linuxapp-gcc/d1f1def0ab3f48ecae99e77a82bbe165/dpdk/drivers/net/i40e/i40e_pf.c:1263:20: error: missing terminating " character
   PMD_DRV_LOG(ERR, "VF %d requested %d more queues,
                    ^
/tmp/FC25_K4.8.6_GCC6.3.1/x86_64-native-linuxapp-gcc/d1f1def0ab3f48ecae99e77a82bbe165/dpdk/drivers/net/i40e/i40e_logs.h:37:59: note: in definition of macro ‘PMD_DRV_LOG_RAW’
  rte_log(RTE_LOG_ ## level, i40e_logtype_driver, "%s(): " fmt, \
                                                           ^~~
/tmp/FC25_K4.8.6_GCC6.3.1/x86_64-native-linuxapp-gcc/d1f1def0ab3f48ecae99e77a82bbe165/dpdk/drivers/net/i40e/i40e_pf.c:1263:3: note: in expansion of macro ‘PMD_DRV_LOG’
   PMD_DRV_LOG(ERR, "VF %d requested %d more queues,
   ^~~~~~~~~~~
/tmp/FC25_K4.8.6_GCC6.3.1/x86_64-native-linuxapp-gcc/d1f1def0ab3f48ecae99e77a82bbe165/dpdk/drivers/net/i40e/i40e_pf.c:1264:8: error: expected ‘)’ before ‘but’
        but noly %d left\n", vf->vf_idx,
        ^
/tmp/FC25_K4.8.6_GCC6.3.1/x86_64-native-linuxapp-gcc/d1f1def0ab3f48ecae99e77a82bbe165/dpdk/drivers/net/i40e/i40e_logs.h:37:59: note: in definition of macro ‘PMD_DRV_LOG_RAW’
  rte_log(RTE_LOG_ ## level, i40e_logtype_driver, "%s(): " fmt, \
                                                           ^~~
/tmp/FC25_K4.8.6_GCC6.3.1/x86_64-native-linuxapp-gcc/d1f1def0ab3f48ecae99e77a82bbe165/dpdk/drivers/net/i40e/i40e_pf.c:1263:3: note: in expansion of macro ‘PMD_DRV_LOG’
   PMD_DRV_LOG(ERR, "VF %d requested %d more queues,
   ^~~~~~~~~~~
/tmp/FC25_K4.8.6_GCC6.3.1/x86_64-native-linuxapp-gcc/d1f1def0ab3f48ecae99e77a82bbe165/dpdk/drivers/net/i40e/i40e_pf.c:1264:24: error: stray ‘\’ in program
        but noly %d left\n", vf->vf_idx,
                        ^
/tmp/FC25_K4.8.6_GCC6.3.1/x86_64-native-linuxapp-gcc/d1f1def0ab3f48ecae99e77a82bbe165/dpdk/drivers/net/i40e/i40e_logs.h:37:59: note: in definition of macro ‘PMD_DRV_LOG_RAW’
  rte_log(RTE_LOG_ ## level, i40e_logtype_driver, "%s(): " fmt, \
                                                           ^~~
/tmp/FC25_K4.8.6_GCC6.3.1/x86_64-native-linuxapp-gcc/d1f1def0ab3f48ecae99e77a82bbe165/dpdk/drivers/net/i40e/i40e_pf.c:1263:3: note: in expansion of macro ‘PMD_DRV_LOG’
   PMD_DRV_LOG(ERR, "VF %d requested %d more queues,
   ^~~~~~~~~~~
/tmp/FC25_K4.8.6_GCC6.3.1/x86_64-native-linuxapp-gcc/d1f1def0ab3f48ecae99e77a82bbe165/dpdk/drivers/net/i40e/i40e_pf.c:1264:26: error: missing terminating " character
        but noly %d left\n", vf->vf_idx,
                          ^
/tmp/FC25_K4.8.6_GCC6.3.1/x86_64-native-linuxapp-gcc/d1f1def0ab3f48ecae99e77a82bbe165/dpdk/drivers/net/i40e/i40e_logs.h:37:59: note: in definition of macro ‘PMD_DRV_LOG_RAW’
  rte_log(RTE_LOG_ ## level, i40e_logtype_driver, "%s(): " fmt, \
                                                           ^~~
/tmp/FC25_K4.8.6_GCC6.3.1/x86_64-native-linuxapp-gcc/d1f1def0ab3f48ecae99e77a82bbe165/dpdk/drivers/net/i40e/i40e_pf.c:1263:3: note: in expansion of macro ‘PMD_DRV_LOG’
   PMD_DRV_LOG(ERR, "VF %d requested %d more queues,
   ^~~~~~~~~~~
/tmp/FC25_K4.8.6_GCC6.3.1/x86_64-native-linuxapp-gcc/d1f1def0ab3f48ecae99e77a82bbe165/dpdk/drivers/net/i40e/i40e_logs.h:37:50: warning: format ‘%s’ expects a matching ‘char *’ argument [-Wformat=]
  rte_log(RTE_LOG_ ## level, i40e_logtype_driver, "%s(): " fmt, \
                                                  ^
/tmp/FC25_K4.8.6_GCC6.3.1/x86_64-native-linuxapp-gcc/d1f1def0ab3f48ecae99e77a82bbe165/dpdk/drivers/net/i40e/i40e_logs.h:41:2: note: in expansion of macro ‘PMD_DRV_LOG_RAW’
  PMD_DRV_LOG_RAW(level, fmt "\n", ## args)
  ^~~~~~~~~~~~~~~
/tmp/FC25_K4.8.6_GCC6.3.1/x86_64-native-linuxapp-gcc/d1f1def0ab3f48ecae99e77a82bbe165/dpdk/drivers/net/i40e/i40e_pf.c:1263:3: note: in expansion of macro ‘PMD_DRV_LOG’
   PMD_DRV_LOG(ERR, "VF %d requested %d more queues,
   ^~~~~~~~~~~
/tmp/FC25_K4.8.6_GCC6.3.1/x86_64-native-linuxapp-gcc/d1f1def0ab3f48ecae99e77a82bbe165/dpdk/mk/internal/rte.compile-pre.mk:114: recipe for target 'i40e_pf.o' failed
make[6]: *** [i40e_pf.o] Error 1
/tmp/FC25_K4.8.6_GCC6.3.1/x86_64-native-linuxapp-gcc/d1f1def0ab3f48ecae99e77a82bbe165/dpdk/mk/rte.subdir.mk:35: recipe for target 'i40e' failed
make[5]: *** [i40e] Error 2
make[5]: *** Waiting for unfinished jobs....
  CC ixgbe_ethdev.o
  CC ixgbe_fdir.o
  CC ixgbe_pf.o
--
  CC rte_pmd_ixgbe.o
  CC ixgbe_tm.o
  CC ixgbe_vf_representor.o
  AR librte_pmd_ixgbe.a
  INSTALL-LIB librte_pmd_ixgbe.a
/tmp/FC25_K4.8.6_GCC6.3.1/x86_64-native-linuxapp-gcc/d1f1def0ab3f48ecae99e77a82bbe165/dpdk/mk/rte.subdir.mk:35: recipe for target 'net' failed
make[4]: *** [net] Error 2
/tmp/FC25_K4.8.6_GCC6.3.1/x86_64-native-linuxapp-gcc/d1f1def0ab3f48ecae99e77a82bbe165/dpdk/mk/rte.sdkbuild.mk:49: recipe for target 'drivers' failed
make[3]: *** [drivers] Error 2
/tmp/FC25_K4.8.6_GCC6.3.1/x86_64-native-linuxapp-gcc/d1f1def0ab3f48ecae99e77a82bbe165/dpdk/mk/rte.sdkroot.mk:100: recipe for target 'all' failed
make[2]: *** [all] Error 2
/tmp/FC25_K4.8.6_GCC6.3.1/x86_64-native-linuxapp-gcc/d1f1def0ab3f48ecae99e77a82bbe165/dpdk/mk/rte.sdkinstall.mk:57: recipe for target 'pre_install' failed
make[1]: *** [pre_install] Error 2
/tmp/FC25_K4.8.6_GCC6.3.1/x86_64-native-linuxapp-gcc/d1f1def0ab3f48ecae99e77a82bbe165/dpdk/mk/rte.sdkroot.mk:79: recipe for target 'install' failed
make: *** [install] Error 2

*Failed Build #2:
OS: UB1604
Target: x86_64-native-linuxapp-gcc
  PMDINFO ixgbe_ethdev.o.pmd.c
  CC ixgbe_ethdev.o.pmd.o
  LD ixgbe_ethdev.o
  CC ixgbe_fdir.o
/tmp/UB1604_K4.8.0_GCC6.2.0/x86_64-native-linuxapp-gcc/d1f1def0ab3f48ecae99e77a82bbe165/dpdk/drivers/net/i40e/i40e_pf.c: In function ‘i40e_pf_host_process_cmd_request_queues’:
/tmp/UB1604_K4.8.0_GCC6.2.0/x86_64-native-linuxapp-gcc/d1f1def0ab3f48ecae99e77a82bbe165/dpdk/drivers/net/i40e/i40e_pf.c:1254:20: warning: missing terminating " character
   PMD_DRV_LOG(ERR, "VF %d tried to request %d queues.
                    ^
/tmp/UB1604_K4.8.0_GCC6.2.0/x86_64-native-linuxapp-gcc/d1f1def0ab3f48ecae99e77a82bbe165/dpdk/drivers/net/i40e/i40e_pf.c:1255:19: warning: missing terminating " character
        Ignoring.\n", vf->vf_idx,
                   ^
In file included from /tmp/UB1604_K4.8.0_GCC6.2.0/x86_64-native-linuxapp-gcc/d1f1def0ab3f48ecae99e77a82bbe165/dpdk/drivers/net/i40e/i40e_pf.c:21:0:
/tmp/UB1604_K4.8.0_GCC6.2.0/x86_64-native-linuxapp-gcc/d1f1def0ab3f48ecae99e77a82bbe165/dpdk/drivers/net/i40e/i40e_pf.c:1254:20: error: missing terminating " character
   PMD_DRV_LOG(ERR, "VF %d tried to request %d queues.
                    ^
/tmp/UB1604_K4.8.0_GCC6.2.0/x86_64-native-linuxapp-gcc/d1f1def0ab3f48ecae99e77a82bbe165/dpdk/drivers/net/i40e/i40e_logs.h:37:59: note: in definition of macro ‘PMD_DRV_LOG_RAW’
  rte_log(RTE_LOG_ ## level, i40e_logtype_driver, "%s(): " fmt, \
                                                           ^~~
/tmp/UB1604_K4.8.0_GCC6.2.0/x86_64-native-linuxapp-gcc/d1f1def0ab3f48ecae99e77a82bbe165/dpdk/drivers/net/i40e/i40e_pf.c:1254:3: note: in expansion of macro ‘PMD_DRV_LOG’
   PMD_DRV_LOG(ERR, "VF %d tried to request %d queues.
   ^~~~~~~~~~~
/tmp/UB1604_K4.8.0_GCC6.2.0/x86_64-native-linuxapp-gcc/d1f1def0ab3f48ecae99e77a82bbe165/dpdk/drivers/net/i40e/i40e_pf.c:1255:8: error: expected ‘)’ before ‘Ignoring’
        Ignoring.\n", vf->vf_idx,
        ^
/tmp/UB1604_K4.8.0_GCC6.2.0/x86_64-native-linuxapp-gcc/d1f1def0ab3f48ecae99e77a82bbe165/dpdk/drivers/net/i40e/i40e_logs.h:37:59: note: in definition of macro ‘PMD_DRV_LOG_RAW’
  rte_log(RTE_LOG_ ## level, i40e_logtype_driver, "%s(): " fmt, \
                                                           ^~~
/tmp/UB1604_K4.8.0_GCC6.2.0/x86_64-native-linuxapp-gcc/d1f1def0ab3f48ecae99e77a82bbe165/dpdk/drivers/net/i40e/i40e_pf.c:1254:3: note: in expansion of macro ‘PMD_DRV_LOG’
   PMD_DRV_LOG(ERR, "VF %d tried to request %d queues.
   ^~~~~~~~~~~
/tmp/UB1604_K4.8.0_GCC6.2.0/x86_64-native-linuxapp-gcc/d1f1def0ab3f48ecae99e77a82bbe165/dpdk/drivers/net/i40e/i40e_pf.c:1255:17: error: stray ‘\’ in program
        Ignoring.\n", vf->vf_idx,
                 ^
/tmp/UB1604_K4.8.0_GCC6.2.0/x86_64-native-linuxapp-gcc/d1f1def0ab3f48ecae99e77a82bbe165/dpdk/drivers/net/i40e/i40e_logs.h:37:59: note: in definition of macro ‘PMD_DRV_LOG_RAW’
  rte_log(RTE_LOG_ ## level, i40e_logtype_driver, "%s(): " fmt, \
                                                           ^~~
/tmp/UB1604_K4.8.0_GCC6.2.0/x86_64-native-linuxapp-gcc/d1f1def0ab3f48ecae99e77a82bbe165/dpdk/drivers/net/i40e/i40e_pf.c:1254:3: note: in expansion of macro ‘PMD_DRV_LOG’
   PMD_DRV_LOG(ERR, "VF %d tried to request %d queues.
   ^~~~~~~~~~~
/tmp/UB1604_K4.8.0_GCC6.2.0/x86_64-native-linuxapp-gcc/d1f1def0ab3f48ecae99e77a82bbe165/dpdk/drivers/net/i40e/i40e_pf.c:1255:19: error: missing terminating " character
        Ignoring.\n", vf->vf_idx,
                   ^
/tmp/UB1604_K4.8.0_GCC6.2.0/x86_64-native-linuxapp-gcc/d1f1def0ab3f48ecae99e77a82bbe165/dpdk/drivers/net/i40e/i40e_logs.h:37:59: note: in definition of macro ‘PMD_DRV_LOG_RAW’
  rte_log(RTE_LOG_ ## level, i40e_logtype_driver, "%s(): " fmt, \
                                                           ^~~
/tmp/UB1604_K4.8.0_GCC6.2.0/x86_64-native-linuxapp-gcc/d1f1def0ab3f48ecae99e77a82bbe165/dpdk/drivers/net/i40e/i40e_pf.c:1254:3: note: in expansion of macro ‘PMD_DRV_LOG’
   PMD_DRV_LOG(ERR, "VF %d tried to request %d queues.
   ^~~~~~~~~~~
/tmp/UB1604_K4.8.0_GCC6.2.0/x86_64-native-linuxapp-gcc/d1f1def0ab3f48ecae99e77a82bbe165/dpdk/drivers/net/i40e/i40e_logs.h:37:50: warning: format ‘%s’ expects a matching ‘char *’ argument [-Wformat=]
  rte_log(RTE_LOG_ ## level, i40e_logtype_driver, "%s(): " fmt, \
                                                  ^
/tmp/UB1604_K4.8.0_GCC6.2.0/x86_64-native-linuxapp-gcc/d1f1def0ab3f48ecae99e77a82bbe165/dpdk/drivers/net/i40e/i40e_logs.h:41:2: note: in expansion of macro ‘PMD_DRV_LOG_RAW’
  PMD_DRV_LOG_RAW(level, fmt "\n", ## args)
  ^~~~~~~~~~~~~~~
/tmp/UB1604_K4.8.0_GCC6.2.0/x86_64-native-linuxapp-gcc/d1f1def0ab3f48ecae99e77a82bbe165/dpdk/drivers/net/i40e/i40e_pf.c:1254:3: note: in expansion of macro ‘PMD_DRV_LOG’
   PMD_DRV_LOG(ERR, "VF %d tried to request %d queues.
   ^~~~~~~~~~~
/tmp/UB1604_K4.8.0_GCC6.2.0/x86_64-native-linuxapp-gcc/d1f1def0ab3f48ecae99e77a82bbe165/dpdk/drivers/net/i40e/i40e_pf.c:1258:20: warning: missing terminating " character
   PMD_DRV_LOG(ERR, "VF %d tried to request more than
                    ^
/tmp/UB1604_K4.8.0_GCC6.2.0/x86_64-native-linuxapp-gcc/d1f1def0ab3f48ecae99e77a82bbe165/dpdk/drivers/net/i40e/i40e_pf.c:1259:20: warning: missing terminating " character
        %d queues.\n", vf->vf_idx,
                    ^
In file included from /tmp/UB1604_K4.8.0_GCC6.2.0/x86_64-native-linuxapp-gcc/d1f1def0ab3f48ecae99e77a82bbe165/dpdk/drivers/net/i40e/i40e_pf.c:21:0:
/tmp/UB1604_K4.8.0_GCC6.2.0/x86_64-native-linuxapp-gcc/d1f1def0ab3f48ecae99e77a82bbe165/dpdk/drivers/net/i40e/i40e_pf.c:1258:20: error: missing terminating " character
   PMD_DRV_LOG(ERR, "VF %d tried to request more than
                    ^
/tmp/UB1604_K4.8.0_GCC6.2.0/x86_64-native-linuxapp-gcc/d1f1def0ab3f48ecae99e77a82bbe165/dpdk/drivers/net/i40e/i40e_logs.h:37:59: note: in definition of macro ‘PMD_DRV_LOG_RAW’
  rte_log(RTE_LOG_ ## level, i40e_logtype_driver, "%s(): " fmt, \
                                                           ^~~
/tmp/UB1604_K4.8.0_GCC6.2.0/x86_64-native-linuxapp-gcc/d1f1def0ab3f48ecae99e77a82bbe165/dpdk/drivers/net/i40e/i40e_pf.c:1258:3: note: in expansion of macro ‘PMD_DRV_LOG’
   PMD_DRV_LOG(ERR, "VF %d tried to request more than
   ^~~~~~~~~~~
/tmp/UB1604_K4.8.0_GCC6.2.0/x86_64-native-linuxapp-gcc/d1f1def0ab3f48ecae99e77a82bbe165/dpdk/drivers/net/i40e/i40e_pf.c:1259:9: error: ‘d’ undeclared (first use in this function)
        %d queues.\n", vf->vf_idx,
         ^
/tmp/UB1604_K4.8.0_GCC6.2.0/x86_64-native-linuxapp-gcc/d1f1def0ab3f48ecae99e77a82bbe165/dpdk/drivers/net/i40e/i40e_logs.h:37:59: note: in definition of macro ‘PMD_DRV_LOG_RAW’
  rte_log(RTE_LOG_ ## level, i40e_logtype_driver, "%s(): " fmt, \
                                                           ^~~
--
  rte_log(RTE_LOG_ ## level, i40e_logtype_driver, "%s(): " fmt, \
                                                           ^~~
/tmp/UB1604_K4.8.0_GCC6.2.0/x86_64-native-linuxapp-gcc/d1f1def0ab3f48ecae99e77a82bbe165/dpdk/drivers/net/i40e/i40e_pf.c:1258:3: note: in expansion of macro ‘PMD_DRV_LOG’
   PMD_DRV_LOG(ERR, "VF %d tried to request more than
   ^~~~~~~~~~~
/tmp/UB1604_K4.8.0_GCC6.2.0/x86_64-native-linuxapp-gcc/d1f1def0ab3f48ecae99e77a82bbe165/dpdk/drivers/net/i40e/i40e_pf.c:1259:11: error: expected ‘)’ before ‘queues’
        %d queues.\n", vf->vf_idx,
           ^
/tmp/UB1604_K4.8.0_GCC6.2.0/x86_64-native-linuxapp-gcc/d1f1def0ab3f48ecae99e77a82bbe165/dpdk/drivers/net/i40e/i40e_logs.h:37:59: note: in definition of macro ‘PMD_DRV_LOG_RAW’
  rte_log(RTE_LOG_ ## level, i40e_logtype_driver, "%s(): " fmt, \
                                                           ^~~
/tmp/UB1604_K4.8.0_GCC6.2.0/x86_64-native-linuxapp-gcc/d1f1def0ab3f48ecae99e77a82bbe165/dpdk/drivers/net/i40e/i40e_pf.c:1258:3: note: in expansion of macro ‘PMD_DRV_LOG’
   PMD_DRV_LOG(ERR, "VF %d tried to request more than
   ^~~~~~~~~~~
/tmp/UB1604_K4.8.0_GCC6.2.0/x86_64-native-linuxapp-gcc/d1f1def0ab3f48ecae99e77a82bbe165/dpdk/drivers/net/i40e/i40e_pf.c:1259:18: error: stray ‘\’ in program
        %d queues.\n", vf->vf_idx,
                  ^
/tmp/UB1604_K4.8.0_GCC6.2.0/x86_64-native-linuxapp-gcc/d1f1def0ab3f48ecae99e77a82bbe165/dpdk/drivers/net/i40e/i40e_logs.h:37:59: note: in definition of macro ‘PMD_DRV_LOG_RAW’
  rte_log(RTE_LOG_ ## level, i40e_logtype_driver, "%s(): " fmt, \
                                                           ^~~
/tmp/UB1604_K4.8.0_GCC6.2.0/x86_64-native-linuxapp-gcc/d1f1def0ab3f48ecae99e77a82bbe165/dpdk/drivers/net/i40e/i40e_pf.c:1258:3: note: in expansion of macro ‘PMD_DRV_LOG’
   PMD_DRV_LOG(ERR, "VF %d tried to request more than
   ^~~~~~~~~~~
/tmp/UB1604_K4.8.0_GCC6.2.0/x86_64-native-linuxapp-gcc/d1f1def0ab3f48ecae99e77a82bbe165/dpdk/drivers/net/i40e/i40e_pf.c:1259:20: error: missing terminating " character
        %d queues.\n", vf->vf_idx,
                    ^
/tmp/UB1604_K4.8.0_GCC6.2.0/x86_64-native-linuxapp-gcc/d1f1def0ab3f48ecae99e77a82bbe165/dpdk/drivers/net/i40e/i40e_logs.h:37:59: note: in definition of macro ‘PMD_DRV_LOG_RAW’
  rte_log(RTE_LOG_ ## level, i40e_logtype_driver, "%s(): " fmt, \
                                                           ^~~
/tmp/UB1604_K4.8.0_GCC6.2.0/x86_64-native-linuxapp-gcc/d1f1def0ab3f48ecae99e77a82bbe165/dpdk/drivers/net/i40e/i40e_pf.c:1258:3: note: in expansion of macro ‘PMD_DRV_LOG’
   PMD_DRV_LOG(ERR, "VF %d tried to request more than
   ^~~~~~~~~~~
/tmp/UB1604_K4.8.0_GCC6.2.0/x86_64-native-linuxapp-gcc/d1f1def0ab3f48ecae99e77a82bbe165/dpdk/drivers/net/i40e/i40e_pf.c:1263:20: warning: missing terminating " character
   PMD_DRV_LOG(ERR, "VF %d requested %d more queues,
                    ^
/tmp/UB1604_K4.8.0_GCC6.2.0/x86_64-native-linuxapp-gcc/d1f1def0ab3f48ecae99e77a82bbe165/dpdk/drivers/net/i40e/i40e_pf.c:1264:26: warning: missing terminating " character
        but noly %d left\n", vf->vf_idx,
                          ^
In file included from /tmp/UB1604_K4.8.0_GCC6.2.0/x86_64-native-linuxapp-gcc/d1f1def0ab3f48ecae99e77a82bbe165/dpdk/drivers/net/i40e/i40e_pf.c:21:0:
/tmp/UB1604_K4.8.0_GCC6.2.0/x86_64-native-linuxapp-gcc/d1f1def0ab3f48ecae99e77a82bbe165/dpdk/drivers/net/i40e/i40e_pf.c:1263:20: error: missing terminating " character
   PMD_DRV_LOG(ERR, "VF %d requested %d more queues,
                    ^
/tmp/UB1604_K4.8.0_GCC6.2.0/x86_64-native-linuxapp-gcc/d1f1def0ab3f48ecae99e77a82bbe165/dpdk/drivers/net/i40e/i40e_logs.h:37:59: note: in definition of macro ‘PMD_DRV_LOG_RAW’
  rte_log(RTE_LOG_ ## level, i40e_logtype_driver, "%s(): " fmt, \
                                                           ^~~
/tmp/UB1604_K4.8.0_GCC6.2.0/x86_64-native-linuxapp-gcc/d1f1def0ab3f48ecae99e77a82bbe165/dpdk/drivers/net/i40e/i40e_pf.c:1263:3: note: in expansion of macro ‘PMD_DRV_LOG’
   PMD_DRV_LOG(ERR, "VF %d requested %d more queues,
   ^~~~~~~~~~~
/tmp/UB1604_K4.8.0_GCC6.2.0/x86_64-native-linuxapp-gcc/d1f1def0ab3f48ecae99e77a82bbe165/dpdk/drivers/net/i40e/i40e_pf.c:1264:8: error: expected ‘)’ before ‘but’
        but noly %d left\n", vf->vf_idx,
        ^
/tmp/UB1604_K4.8.0_GCC6.2.0/x86_64-native-linuxapp-gcc/d1f1def0ab3f48ecae99e77a82bbe165/dpdk/drivers/net/i40e/i40e_logs.h:37:59: note: in definition of macro ‘PMD_DRV_LOG_RAW’
  rte_log(RTE_LOG_ ## level, i40e_logtype_driver, "%s(): " fmt, \
                                                           ^~~
/tmp/UB1604_K4.8.0_GCC6.2.0/x86_64-native-linuxapp-gcc/d1f1def0ab3f48ecae99e77a82bbe165/dpdk/drivers/net/i40e/i40e_pf.c:1263:3: note: in expansion of macro ‘PMD_DRV_LOG’
   PMD_DRV_LOG(ERR, "VF %d requested %d more queues,
   ^~~~~~~~~~~
/tmp/UB1604_K4.8.0_GCC6.2.0/x86_64-native-linuxapp-gcc/d1f1def0ab3f48ecae99e77a82bbe165/dpdk/drivers/net/i40e/i40e_pf.c:1264:24: error: stray ‘\’ in program
        but noly %d left\n", vf->vf_idx,
                        ^
/tmp/UB1604_K4.8.0_GCC6.2.0/x86_64-native-linuxapp-gcc/d1f1def0ab3f48ecae99e77a82bbe165/dpdk/drivers/net/i40e/i40e_logs.h:37:59: note: in definition of macro ‘PMD_DRV_LOG_RAW’
  rte_log(RTE_LOG_ ## level, i40e_logtype_driver, "%s(): " fmt, \
                                                           ^~~
/tmp/UB1604_K4.8.0_GCC6.2.0/x86_64-native-linuxapp-gcc/d1f1def0ab3f48ecae99e77a82bbe165/dpdk/drivers/net/i40e/i40e_pf.c:1263:3: note: in expansion of macro ‘PMD_DRV_LOG’
   PMD_DRV_LOG(ERR, "VF %d requested %d more queues,
   ^~~~~~~~~~~
/tmp/UB1604_K4.8.0_GCC6.2.0/x86_64-native-linuxapp-gcc/d1f1def0ab3f48ecae99e77a82bbe165/dpdk/drivers/net/i40e/i40e_pf.c:1264:26: error: missing terminating " character
        but noly %d left\n", vf->vf_idx,
                          ^
/tmp/UB1604_K4.8.0_GCC6.2.0/x86_64-native-linuxapp-gcc/d1f1def0ab3f48ecae99e77a82bbe165/dpdk/drivers/net/i40e/i40e_logs.h:37:59: note: in definition of macro ‘PMD_DRV_LOG_RAW’
  rte_log(RTE_LOG_ ## level, i40e_logtype_driver, "%s(): " fmt, \
                                                           ^~~
/tmp/UB1604_K4.8.0_GCC6.2.0/x86_64-native-linuxapp-gcc/d1f1def0ab3f48ecae99e77a82bbe165/dpdk/drivers/net/i40e/i40e_pf.c:1263:3: note: in expansion of macro ‘PMD_DRV_LOG’
   PMD_DRV_LOG(ERR, "VF %d requested %d more queues,
   ^~~~~~~~~~~
/tmp/UB1604_K4.8.0_GCC6.2.0/x86_64-native-linuxapp-gcc/d1f1def0ab3f48ecae99e77a82bbe165/dpdk/drivers/net/i40e/i40e_logs.h:37:50: warning: format ‘%s’ expects a matching ‘char *’ argument [-Wformat=]
  rte_log(RTE_LOG_ ## level, i40e_logtype_driver, "%s(): " fmt, \
                                                  ^
/tmp/UB1604_K4.8.0_GCC6.2.0/x86_64-native-linuxapp-gcc/d1f1def0ab3f48ecae99e77a82bbe165/dpdk/drivers/net/i40e/i40e_logs.h:41:2: note: in expansion of macro ‘PMD_DRV_LOG_RAW’
  PMD_DRV_LOG_RAW(level, fmt "\n", ## args)
  ^~~~~~~~~~~~~~~
/tmp/UB1604_K4.8.0_GCC6.2.0/x86_64-native-linuxapp-gcc/d1f1def0ab3f48ecae99e77a82bbe165/dpdk/drivers/net/i40e/i40e_pf.c:1263:3: note: in expansion of macro ‘PMD_DRV_LOG’
   PMD_DRV_LOG(ERR, "VF %d requested %d more queues,
   ^~~~~~~~~~~
/tmp/UB1604_K4.8.0_GCC6.2.0/x86_64-native-linuxapp-gcc/d1f1def0ab3f48ecae99e77a82bbe165/dpdk/mk/internal/rte.compile-pre.mk:114: recipe for target 'i40e_pf.o' failed
make[6]: *** [i40e_pf.o] Error 1
/tmp/UB1604_K4.8.0_GCC6.2.0/x86_64-native-linuxapp-gcc/d1f1def0ab3f48ecae99e77a82bbe165/dpdk/mk/rte.subdir.mk:35: recipe for target 'i40e' failed
make[5]: *** [i40e] Error 2
make[5]: *** Waiting for unfinished jobs....
  CC ixgbe_pf.o
  CC ixgbe_flow.o
  CC ixgbe_rxtx_vec_sse.o
--
  CC rte_pmd_ixgbe.o
  CC ixgbe_tm.o
  CC ixgbe_vf_representor.o
  AR librte_pmd_ixgbe.a
  INSTALL-LIB librte_pmd_ixgbe.a
/tmp/UB1604_K4.8.0_GCC6.2.0/x86_64-native-linuxapp-gcc/d1f1def0ab3f48ecae99e77a82bbe165/dpdk/mk/rte.subdir.mk:35: recipe for target 'net' failed
make[4]: *** [net] Error 2
/tmp/UB1604_K4.8.0_GCC6.2.0/x86_64-native-linuxapp-gcc/d1f1def0ab3f48ecae99e77a82bbe165/dpdk/mk/rte.sdkbuild.mk:49: recipe for target 'drivers' failed
make[3]: *** [drivers] Error 2
/tmp/UB1604_K4.8.0_GCC6.2.0/x86_64-native-linuxapp-gcc/d1f1def0ab3f48ecae99e77a82bbe165/dpdk/mk/rte.sdkroot.mk:100: recipe for target 'all' failed
make[2]: *** [all] Error 2
/tmp/UB1604_K4.8.0_GCC6.2.0/x86_64-native-linuxapp-gcc/d1f1def0ab3f48ecae99e77a82bbe165/dpdk/mk/rte.sdkinstall.mk:57: recipe for target 'pre_install' failed
make[1]: *** [pre_install] Error 2
/tmp/UB1604_K4.8.0_GCC6.2.0/x86_64-native-linuxapp-gcc/d1f1def0ab3f48ecae99e77a82bbe165/dpdk/mk/rte.sdkroot.mk:79: recipe for target 'install' failed
make: *** [install] Error 2

*Failed Build #3:
OS: CENTOS
Target: x86_64-native-linuxapp-clang
  PMDINFO i40e_ethdev_vf.o.pmd.c
  CC i40e_ethdev_vf.o.pmd.o
  LD i40e_ethdev_vf.o
  CC i40e_pf.o
  CC ixgbe_ethdev.o
/tmp/CENTOS_K3.10.0_GCC4.8.5/x86_64-native-linuxapp-clang/d1f1def0ab3f48ecae99e77a82bbe165/dpdk/drivers/net/i40e/i40e_pf.c:1254:20: warning: missing terminating '"' character [-Winvalid-pp-token]
                PMD_DRV_LOG(ERR, "VF %d tried to request %d queues.
                                 ^
/tmp/CENTOS_K3.10.0_GCC4.8.5/x86_64-native-linuxapp-clang/d1f1def0ab3f48ecae99e77a82bbe165/dpdk/drivers/net/i40e/i40e_pf.c:1255:19: warning: missing terminating '"' character [-Winvalid-pp-token]
                            Ignoring.\n", vf->vf_idx,
                                       ^
/tmp/CENTOS_K3.10.0_GCC4.8.5/x86_64-native-linuxapp-clang/d1f1def0ab3f48ecae99e77a82bbe165/dpdk/drivers/net/i40e/i40e_pf.c:1254:20: error: expected ')'
                PMD_DRV_LOG(ERR, "VF %d tried to request %d queues.
                                 ^
/tmp/CENTOS_K3.10.0_GCC4.8.5/x86_64-native-linuxapp-clang/d1f1def0ab3f48ecae99e77a82bbe165/dpdk/drivers/net/i40e/i40e_logs.h:41:25: note: expanded from macro 'PMD_DRV_LOG'
        PMD_DRV_LOG_RAW(level, fmt "\n", ## args)
                               ^
--
        PMD_DRV_LOG_RAW(level, fmt "\n", ## args)
        ^
/tmp/CENTOS_K3.10.0_GCC4.8.5/x86_64-native-linuxapp-clang/d1f1def0ab3f48ecae99e77a82bbe165/dpdk/drivers/net/i40e/i40e_logs.h:37:9: note: expanded from macro 'PMD_DRV_LOG_RAW'
        rte_log(RTE_LOG_ ## level, i40e_logtype_driver, "%s(): " fmt, \
               ^
/tmp/CENTOS_K3.10.0_GCC4.8.5/x86_64-native-linuxapp-clang/d1f1def0ab3f48ecae99e77a82bbe165/dpdk/drivers/net/i40e/i40e_pf.c:1258:20: warning: missing terminating '"' character [-Winvalid-pp-token]
                PMD_DRV_LOG(ERR, "VF %d tried to request more than
                                 ^
/tmp/CENTOS_K3.10.0_GCC4.8.5/x86_64-native-linuxapp-clang/d1f1def0ab3f48ecae99e77a82bbe165/dpdk/drivers/net/i40e/i40e_pf.c:1259:20: warning: missing terminating '"' character [-Winvalid-pp-token]
                            %d queues.\n", vf->vf_idx,
                                        ^
/tmp/CENTOS_K3.10.0_GCC4.8.5/x86_64-native-linuxapp-clang/d1f1def0ab3f48ecae99e77a82bbe165/dpdk/drivers/net/i40e/i40e_pf.c:1258:20: error: expected ')'
                PMD_DRV_LOG(ERR, "VF %d tried to request more than
                                 ^
/tmp/CENTOS_K3.10.0_GCC4.8.5/x86_64-native-linuxapp-clang/d1f1def0ab3f48ecae99e77a82bbe165/dpdk/drivers/net/i40e/i40e_logs.h:41:25: note: expanded from macro 'PMD_DRV_LOG'
        PMD_DRV_LOG_RAW(level, fmt "\n", ## args)
                               ^
--
        PMD_DRV_LOG_RAW(level, fmt "\n", ## args)
        ^
/tmp/CENTOS_K3.10.0_GCC4.8.5/x86_64-native-linuxapp-clang/d1f1def0ab3f48ecae99e77a82bbe165/dpdk/drivers/net/i40e/i40e_logs.h:37:9: note: expanded from macro 'PMD_DRV_LOG_RAW'
        rte_log(RTE_LOG_ ## level, i40e_logtype_driver, "%s(): " fmt, \
               ^
/tmp/CENTOS_K3.10.0_GCC4.8.5/x86_64-native-linuxapp-clang/d1f1def0ab3f48ecae99e77a82bbe165/dpdk/drivers/net/i40e/i40e_pf.c:1263:20: warning: missing terminating '"' character [-Winvalid-pp-token]
                PMD_DRV_LOG(ERR, "VF %d requested %d more queues,
                                 ^
/tmp/CENTOS_K3.10.0_GCC4.8.5/x86_64-native-linuxapp-clang/d1f1def0ab3f48ecae99e77a82bbe165/dpdk/drivers/net/i40e/i40e_pf.c:1264:26: warning: missing terminating '"' character [-Winvalid-pp-token]
                            but noly %d left\n", vf->vf_idx,
                                              ^
/tmp/CENTOS_K3.10.0_GCC4.8.5/x86_64-native-linuxapp-clang/d1f1def0ab3f48ecae99e77a82bbe165/dpdk/drivers/net/i40e/i40e_pf.c:1263:20: error: expected ')'
                PMD_DRV_LOG(ERR, "VF %d requested %d more queues,
                                 ^
/tmp/CENTOS_K3.10.0_GCC4.8.5/x86_64-native-linuxapp-clang/d1f1def0ab3f48ecae99e77a82bbe165/dpdk/drivers/net/i40e/i40e_logs.h:41:25: note: expanded from macro 'PMD_DRV_LOG'
        PMD_DRV_LOG_RAW(level, fmt "\n", ## args)
                               ^
--
        PMD_DRV_LOG_RAW(level, fmt "\n", ## args)
        ^
/tmp/CENTOS_K3.10.0_GCC4.8.5/x86_64-native-linuxapp-clang/d1f1def0ab3f48ecae99e77a82bbe165/dpdk/drivers/net/i40e/i40e_logs.h:37:9: note: expanded from macro 'PMD_DRV_LOG_RAW'
        rte_log(RTE_LOG_ ## level, i40e_logtype_driver, "%s(): " fmt, \
               ^
6 warnings and 3 errors generated.
make[6]: *** [i40e_pf.o] Error 1
make[5]: *** [i40e] Error 2
make[5]: *** Waiting for unfinished jobs....
  CC ixgbe_fdir.o
  CC ixgbe_pf.o

*Failed Build #4:
OS: UB1604
Target: x86_64-native-linuxapp-clang
  CC ixgbe_rxtx.o
  PMDINFO i40e_ethdev_vf.o.pmd.c
  CC i40e_ethdev_vf.o.pmd.o
  LD i40e_ethdev_vf.o
  CC i40e_pf.o
/tmp/UB1604_K4.4.0_GCC5.4.0/x86_64-native-linuxapp-clang/d1f1def0ab3f48ecae99e77a82bbe165/dpdk/drivers/net/i40e/i40e_pf.c:1254:20: warning: missing terminating '"' character [-Winvalid-pp-token]
                PMD_DRV_LOG(ERR, "VF %d tried to request %d queues.
                                 ^
/tmp/UB1604_K4.4.0_GCC5.4.0/x86_64-native-linuxapp-clang/d1f1def0ab3f48ecae99e77a82bbe165/dpdk/drivers/net/i40e/i40e_pf.c:1255:19: warning: missing terminating '"' character [-Winvalid-pp-token]
                            Ignoring.\n", vf->vf_idx,
                                       ^
/tmp/UB1604_K4.4.0_GCC5.4.0/x86_64-native-linuxapp-clang/d1f1def0ab3f48ecae99e77a82bbe165/dpdk/drivers/net/i40e/i40e_pf.c:1254:20: error: expected ')'
                PMD_DRV_LOG(ERR, "VF %d tried to request %d queues.
                                 ^
/tmp/UB1604_K4.4.0_GCC5.4.0/x86_64-native-linuxapp-clang/d1f1def0ab3f48ecae99e77a82bbe165/dpdk/drivers/net/i40e/i40e_pf.c:1254:3: note: to match this '('
                PMD_DRV_LOG(ERR, "VF %d tried to request %d queues.
                ^
--
        PMD_DRV_LOG_RAW(level, fmt "\n", ## args)
        ^
/tmp/UB1604_K4.4.0_GCC5.4.0/x86_64-native-linuxapp-clang/d1f1def0ab3f48ecae99e77a82bbe165/dpdk/drivers/net/i40e/base/../i40e_logs.h:37:9: note: expanded from macro 'PMD_DRV_LOG_RAW'
        rte_log(RTE_LOG_ ## level, i40e_logtype_driver, "%s(): " fmt, \
               ^
/tmp/UB1604_K4.4.0_GCC5.4.0/x86_64-native-linuxapp-clang/d1f1def0ab3f48ecae99e77a82bbe165/dpdk/drivers/net/i40e/i40e_pf.c:1258:20: warning: missing terminating '"' character [-Winvalid-pp-token]
                PMD_DRV_LOG(ERR, "VF %d tried to request more than
                                 ^
/tmp/UB1604_K4.4.0_GCC5.4.0/x86_64-native-linuxapp-clang/d1f1def0ab3f48ecae99e77a82bbe165/dpdk/drivers/net/i40e/i40e_pf.c:1259:20: warning: missing terminating '"' character [-Winvalid-pp-token]
                            %d queues.\n", vf->vf_idx,
                                        ^
/tmp/UB1604_K4.4.0_GCC5.4.0/x86_64-native-linuxapp-clang/d1f1def0ab3f48ecae99e77a82bbe165/dpdk/drivers/net/i40e/i40e_pf.c:1258:20: error: expected ')'
                PMD_DRV_LOG(ERR, "VF %d tried to request more than
                                 ^
/tmp/UB1604_K4.4.0_GCC5.4.0/x86_64-native-linuxapp-clang/d1f1def0ab3f48ecae99e77a82bbe165/dpdk/drivers/net/i40e/i40e_pf.c:1258:3: note: to match this '('
                PMD_DRV_LOG(ERR, "VF %d tried to request more than
                ^
--
        PMD_DRV_LOG_RAW(level, fmt "\n", ## args)
        ^
/tmp/UB1604_K4.4.0_GCC5.4.0/x86_64-native-linuxapp-clang/d1f1def0ab3f48ecae99e77a82bbe165/dpdk/drivers/net/i40e/base/../i40e_logs.h:37:9: note: expanded from macro 'PMD_DRV_LOG_RAW'
        rte_log(RTE_LOG_ ## level, i40e_logtype_driver, "%s(): " fmt, \
               ^
/tmp/UB1604_K4.4.0_GCC5.4.0/x86_64-native-linuxapp-clang/d1f1def0ab3f48ecae99e77a82bbe165/dpdk/drivers/net/i40e/i40e_pf.c:1263:20: warning: missing terminating '"' character [-Winvalid-pp-token]
                PMD_DRV_LOG(ERR, "VF %d requested %d more queues,
                                 ^
/tmp/UB1604_K4.4.0_GCC5.4.0/x86_64-native-linuxapp-clang/d1f1def0ab3f48ecae99e77a82bbe165/dpdk/drivers/net/i40e/i40e_pf.c:1264:26: warning: missing terminating '"' character [-Winvalid-pp-token]
                            but noly %d left\n", vf->vf_idx,
                                              ^
/tmp/UB1604_K4.4.0_GCC5.4.0/x86_64-native-linuxapp-clang/d1f1def0ab3f48ecae99e77a82bbe165/dpdk/drivers/net/i40e/i40e_pf.c:1263:20: error: expected ')'
                PMD_DRV_LOG(ERR, "VF %d requested %d more queues,
                                 ^
/tmp/UB1604_K4.4.0_GCC5.4.0/x86_64-native-linuxapp-clang/d1f1def0ab3f48ecae99e77a82bbe165/dpdk/drivers/net/i40e/i40e_pf.c:1263:3: note: to match this '('
                PMD_DRV_LOG(ERR, "VF %d requested %d more queues,
                ^
--
        PMD_DRV_LOG_RAW(level, fmt "\n", ## args)
        ^
/tmp/UB1604_K4.4.0_GCC5.4.0/x86_64-native-linuxapp-clang/d1f1def0ab3f48ecae99e77a82bbe165/dpdk/drivers/net/i40e/base/../i40e_logs.h:37:9: note: expanded from macro 'PMD_DRV_LOG_RAW'
        rte_log(RTE_LOG_ ## level, i40e_logtype_driver, "%s(): " fmt, \
               ^
6 warnings and 3 errors generated.
/tmp/UB1604_K4.4.0_GCC5.4.0/x86_64-native-linuxapp-clang/d1f1def0ab3f48ecae99e77a82bbe165/dpdk/mk/internal/rte.compile-pre.mk:114: recipe for target 'i40e_pf.o' failed
make[6]: *** [i40e_pf.o] Error 1
/tmp/UB1604_K4.4.0_GCC5.4.0/x86_64-native-linuxapp-clang/d1f1def0ab3f48ecae99e77a82bbe165/dpdk/mk/rte.subdir.mk:35: recipe for target 'i40e' failed
make[5]: *** [i40e] Error 2
make[5]: *** Waiting for unfinished jobs....
  CC ixgbe_ethdev.o
  CC ixgbe_fdir.o
  CC ixgbe_pf.o
--
  CC rte_pmd_ixgbe.o
  CC ixgbe_tm.o
  CC ixgbe_vf_representor.o
  AR librte_pmd_ixgbe.a
  INSTALL-LIB librte_pmd_ixgbe.a
/tmp/UB1604_K4.4.0_GCC5.4.0/x86_64-native-linuxapp-clang/d1f1def0ab3f48ecae99e77a82bbe165/dpdk/mk/rte.subdir.mk:35: recipe for target 'net' failed
make[4]: *** [net] Error 2
/tmp/UB1604_K4.4.0_GCC5.4.0/x86_64-native-linuxapp-clang/d1f1def0ab3f48ecae99e77a82bbe165/dpdk/mk/rte.sdkbuild.mk:49: recipe for target 'drivers' failed
make[3]: *** [drivers] Error 2
/tmp/UB1604_K4.4.0_GCC5.4.0/x86_64-native-linuxapp-clang/d1f1def0ab3f48ecae99e77a82bbe165/dpdk/mk/rte.sdkroot.mk:100: recipe for target 'all' failed
make[2]: *** [all] Error 2
/tmp/UB1604_K4.4.0_GCC5.4.0/x86_64-native-linuxapp-clang/d1f1def0ab3f48ecae99e77a82bbe165/dpdk/mk/rte.sdkinstall.mk:57: recipe for target 'pre_install' failed
make[1]: *** [pre_install] Error 2
/tmp/UB1604_K4.4.0_GCC5.4.0/x86_64-native-linuxapp-clang/d1f1def0ab3f48ecae99e77a82bbe165/dpdk/mk/rte.sdkroot.mk:79: recipe for target 'install' failed
make: *** [install] Error 2

*Failed Build #5:
OS: CENTOS
Target: x86_64-native-linuxapp-gcc
  PMDINFO i40e_ethdev_vf.o.pmd.c
  CC i40e_ethdev_vf.o.pmd.o
  LD i40e_ethdev_vf.o
  CC i40e_pf.o
/tmp/CENTOS_K3.10.0_GCC4.8.5/x86_64-native-linuxapp-gcc/d1f1def0ab3f48ecae99e77a82bbe165/dpdk/drivers/net/i40e/i40e_pf.c: In function ‘i40e_pf_host_process_cmd_request_queues’:
/tmp/CENTOS_K3.10.0_GCC4.8.5/x86_64-native-linuxapp-gcc/d1f1def0ab3f48ecae99e77a82bbe165/dpdk/drivers/net/i40e/i40e_pf.c:1254:20: warning: missing terminating " character [enabled by default]
   PMD_DRV_LOG(ERR, "VF %d tried to request %d queues.
                    ^
/tmp/CENTOS_K3.10.0_GCC4.8.5/x86_64-native-linuxapp-gcc/d1f1def0ab3f48ecae99e77a82bbe165/dpdk/drivers/net/i40e/i40e_pf.c:1255:19: warning: missing terminating " character [enabled by default]
        Ignoring.\n", vf->vf_idx,
                   ^
/tmp/CENTOS_K3.10.0_GCC4.8.5/x86_64-native-linuxapp-gcc/d1f1def0ab3f48ecae99e77a82bbe165/dpdk/drivers/net/i40e/i40e_pf.c:1254:3: error: missing terminating " character
   PMD_DRV_LOG(ERR, "VF %d tried to request %d queues.
   ^
In file included from /tmp/CENTOS_K3.10.0_GCC4.8.5/x86_64-native-linuxapp-gcc/d1f1def0ab3f48ecae99e77a82bbe165/dpdk/drivers/net/i40e/i40e_pf.c:21:0:
/tmp/CENTOS_K3.10.0_GCC4.8.5/x86_64-native-linuxapp-gcc/d1f1def0ab3f48ecae99e77a82bbe165/dpdk/drivers/net/i40e/i40e_pf.c:1255:8: error: expected ‘)’ before ‘Ignoring’
        Ignoring.\n", vf->vf_idx,
        ^
/tmp/CENTOS_K3.10.0_GCC4.8.5/x86_64-native-linuxapp-gcc/d1f1def0ab3f48ecae99e77a82bbe165/dpdk/drivers/net/i40e/i40e_logs.h:37:59: note: in definition of macro ‘PMD_DRV_LOG_RAW’
  rte_log(RTE_LOG_ ## level, i40e_logtype_driver, "%s(): " fmt, \
                                                           ^
/tmp/CENTOS_K3.10.0_GCC4.8.5/x86_64-native-linuxapp-gcc/d1f1def0ab3f48ecae99e77a82bbe165/dpdk/drivers/net/i40e/i40e_pf.c:1254:3: note: in expansion of macro ‘PMD_DRV_LOG’
   PMD_DRV_LOG(ERR, "VF %d tried to request %d queues.
   ^
/tmp/CENTOS_K3.10.0_GCC4.8.5/x86_64-native-linuxapp-gcc/d1f1def0ab3f48ecae99e77a82bbe165/dpdk/drivers/net/i40e/i40e_pf.c:1255:8: error: stray ‘\’ in program
        Ignoring.\n", vf->vf_idx,
        ^
/tmp/CENTOS_K3.10.0_GCC4.8.5/x86_64-native-linuxapp-gcc/d1f1def0ab3f48ecae99e77a82bbe165/dpdk/drivers/net/i40e/i40e_logs.h:37:59: note: in definition of macro ‘PMD_DRV_LOG_RAW’
  rte_log(RTE_LOG_ ## level, i40e_logtype_driver, "%s(): " fmt, \
                                                           ^
/tmp/CENTOS_K3.10.0_GCC4.8.5/x86_64-native-linuxapp-gcc/d1f1def0ab3f48ecae99e77a82bbe165/dpdk/drivers/net/i40e/i40e_pf.c:1254:3: note: in expansion of macro ‘PMD_DRV_LOG’
   PMD_DRV_LOG(ERR, "VF %d tried to request %d queues.
   ^
/tmp/CENTOS_K3.10.0_GCC4.8.5/x86_64-native-linuxapp-gcc/d1f1def0ab3f48ecae99e77a82bbe165/dpdk/drivers/net/i40e/i40e_pf.c:1255:8: error: missing terminating " character
        Ignoring.\n", vf->vf_idx,
        ^
/tmp/CENTOS_K3.10.0_GCC4.8.5/x86_64-native-linuxapp-gcc/d1f1def0ab3f48ecae99e77a82bbe165/dpdk/drivers/net/i40e/i40e_logs.h:37:59: note: in definition of macro ‘PMD_DRV_LOG_RAW’
  rte_log(RTE_LOG_ ## level, i40e_logtype_driver, "%s(): " fmt, \
                                                           ^
/tmp/CENTOS_K3.10.0_GCC4.8.5/x86_64-native-linuxapp-gcc/d1f1def0ab3f48ecae99e77a82bbe165/dpdk/drivers/net/i40e/i40e_pf.c:1254:3: note: in expansion of macro ‘PMD_DRV_LOG’
   PMD_DRV_LOG(ERR, "VF %d tried to request %d queues.
   ^
/tmp/CENTOS_K3.10.0_GCC4.8.5/x86_64-native-linuxapp-gcc/d1f1def0ab3f48ecae99e77a82bbe165/dpdk/drivers/net/i40e/i40e_pf.c:1255:8: warning: format ‘%s’ expects a matching ‘char *’ argument [-Wformat=]
        Ignoring.\n", vf->vf_idx,
        ^
/tmp/CENTOS_K3.10.0_GCC4.8.5/x86_64-native-linuxapp-gcc/d1f1def0ab3f48ecae99e77a82bbe165/dpdk/drivers/net/i40e/i40e_logs.h:37:59: note: in definition of macro ‘PMD_DRV_LOG_RAW’
  rte_log(RTE_LOG_ ## level, i40e_logtype_driver, "%s(): " fmt, \
                                                           ^
/tmp/CENTOS_K3.10.0_GCC4.8.5/x86_64-native-linuxapp-gcc/d1f1def0ab3f48ecae99e77a82bbe165/dpdk/drivers/net/i40e/i40e_pf.c:1254:3: note: in expansion of macro ‘PMD_DRV_LOG’
   PMD_DRV_LOG(ERR, "VF %d tried to request %d queues.
   ^
/tmp/CENTOS_K3.10.0_GCC4.8.5/x86_64-native-linuxapp-gcc/d1f1def0ab3f48ecae99e77a82bbe165/dpdk/drivers/net/i40e/i40e_pf.c:1258:20: warning: missing terminating " character [enabled by default]
   PMD_DRV_LOG(ERR, "VF %d tried to request more than
                    ^
/tmp/CENTOS_K3.10.0_GCC4.8.5/x86_64-native-linuxapp-gcc/d1f1def0ab3f48ecae99e77a82bbe165/dpdk/drivers/net/i40e/i40e_pf.c:1259:20: warning: missing terminating " character [enabled by default]
        %d queues.\n", vf->vf_idx,
                    ^
/tmp/CENTOS_K3.10.0_GCC4.8.5/x86_64-native-linuxapp-gcc/d1f1def0ab3f48ecae99e77a82bbe165/dpdk/drivers/net/i40e/i40e_pf.c:1258:3: error: missing terminating " character
   PMD_DRV_LOG(ERR, "VF %d tried to request more than
   ^
In file included from /tmp/CENTOS_K3.10.0_GCC4.8.5/x86_64-native-linuxapp-gcc/d1f1def0ab3f48ecae99e77a82bbe165/dpdk/drivers/net/i40e/i40e_pf.c:21:0:
/tmp/CENTOS_K3.10.0_GCC4.8.5/x86_64-native-linuxapp-gcc/d1f1def0ab3f48ecae99e77a82bbe165/dpdk/drivers/net/i40e/i40e_pf.c:1259:9: error: ‘d’ undeclared (first use in this function)
        %d queues.\n", vf->vf_idx,
         ^
/tmp/CENTOS_K3.10.0_GCC4.8.5/x86_64-native-linuxapp-gcc/d1f1def0ab3f48ecae99e77a82bbe165/dpdk/drivers/net/i40e/i40e_logs.h:37:59: note: in definition of macro ‘PMD_DRV_LOG_RAW’
  rte_log(RTE_LOG_ ## level, i40e_logtype_driver, "%s(): " fmt, \
                                                           ^
--
  rte_log(RTE_LOG_ ## level, i40e_logtype_driver, "%s(): " fmt, \
                                                           ^
/tmp/CENTOS_K3.10.0_GCC4.8.5/x86_64-native-linuxapp-gcc/d1f1def0ab3f48ecae99e77a82bbe165/dpdk/drivers/net/i40e/i40e_pf.c:1258:3: note: in expansion of macro ‘PMD_DRV_LOG’
   PMD_DRV_LOG(ERR, "VF %d tried to request more than
   ^
/tmp/CENTOS_K3.10.0_GCC4.8.5/x86_64-native-linuxapp-gcc/d1f1def0ab3f48ecae99e77a82bbe165/dpdk/drivers/net/i40e/i40e_pf.c:1259:11: error: expected ‘)’ before ‘queues’
        %d queues.\n", vf->vf_idx,
           ^
/tmp/CENTOS_K3.10.0_GCC4.8.5/x86_64-native-linuxapp-gcc/d1f1def0ab3f48ecae99e77a82bbe165/dpdk/drivers/net/i40e/i40e_logs.h:37:59: note: in definition of macro ‘PMD_DRV_LOG_RAW’
  rte_log(RTE_LOG_ ## level, i40e_logtype_driver, "%s(): " fmt, \
                                                           ^
/tmp/CENTOS_K3.10.0_GCC4.8.5/x86_64-native-linuxapp-gcc/d1f1def0ab3f48ecae99e77a82bbe165/dpdk/drivers/net/i40e/i40e_pf.c:1258:3: note: in expansion of macro ‘PMD_DRV_LOG’
   PMD_DRV_LOG(ERR, "VF %d tried to request more than
   ^
/tmp/CENTOS_K3.10.0_GCC4.8.5/x86_64-native-linuxapp-gcc/d1f1def0ab3f48ecae99e77a82bbe165/dpdk/drivers/net/i40e/i40e_pf.c:1259:11: error: stray ‘\’ in program
        %d queues.\n", vf->vf_idx,
           ^
/tmp/CENTOS_K3.10.0_GCC4.8.5/x86_64-native-linuxapp-gcc/d1f1def0ab3f48ecae99e77a82bbe165/dpdk/drivers/net/i40e/i40e_logs.h:37:59: note: in definition of macro ‘PMD_DRV_LOG_RAW’
  rte_log(RTE_LOG_ ## level, i40e_logtype_driver, "%s(): " fmt, \
                                                           ^
/tmp/CENTOS_K3.10.0_GCC4.8.5/x86_64-native-linuxapp-gcc/d1f1def0ab3f48ecae99e77a82bbe165/dpdk/drivers/net/i40e/i40e_pf.c:1258:3: note: in expansion of macro ‘PMD_DRV_LOG’
   PMD_DRV_LOG(ERR, "VF %d tried to request more than
   ^
/tmp/CENTOS_K3.10.0_GCC4.8.5/x86_64-native-linuxapp-gcc/d1f1def0ab3f48ecae99e77a82bbe165/dpdk/drivers/net/i40e/i40e_pf.c:1259:11: error: missing terminating " character
        %d queues.\n", vf->vf_idx,
           ^
/tmp/CENTOS_K3.10.0_GCC4.8.5/x86_64-native-linuxapp-gcc/d1f1def0ab3f48ecae99e77a82bbe165/dpdk/drivers/net/i40e/i40e_logs.h:37:59: note: in definition of macro ‘PMD_DRV_LOG_RAW’
  rte_log(RTE_LOG_ ## level, i40e_logtype_driver, "%s(): " fmt, \
                                                           ^
/tmp/CENTOS_K3.10.0_GCC4.8.5/x86_64-native-linuxapp-gcc/d1f1def0ab3f48ecae99e77a82bbe165/dpdk/drivers/net/i40e/i40e_pf.c:1258:3: note: in expansion of macro ‘PMD_DRV_LOG’
   PMD_DRV_LOG(ERR, "VF %d tried to request more than
   ^
/tmp/CENTOS_K3.10.0_GCC4.8.5/x86_64-native-linuxapp-gcc/d1f1def0ab3f48ecae99e77a82bbe165/dpdk/drivers/net/i40e/i40e_pf.c:1263:20: warning: missing terminating " character [enabled by default]
   PMD_DRV_LOG(ERR, "VF %d requested %d more queues,
                    ^
/tmp/CENTOS_K3.10.0_GCC4.8.5/x86_64-native-linuxapp-gcc/d1f1def0ab3f48ecae99e77a82bbe165/dpdk/drivers/net/i40e/i40e_pf.c:1264:26: warning: missing terminating " character [enabled by default]
        but noly %d left\n", vf->vf_idx,
                          ^
/tmp/CENTOS_K3.10.0_GCC4.8.5/x86_64-native-linuxapp-gcc/d1f1def0ab3f48ecae99e77a82bbe165/dpdk/drivers/net/i40e/i40e_pf.c:1263:3: error: missing terminating " character
   PMD_DRV_LOG(ERR, "VF %d requested %d more queues,
   ^
In file included from /tmp/CENTOS_K3.10.0_GCC4.8.5/x86_64-native-linuxapp-gcc/d1f1def0ab3f48ecae99e77a82bbe165/dpdk/drivers/net/i40e/i40e_pf.c:21:0:
/tmp/CENTOS_K3.10.0_GCC4.8.5/x86_64-native-linuxapp-gcc/d1f1def0ab3f48ecae99e77a82bbe165/dpdk/drivers/net/i40e/i40e_pf.c:1264:8: error: expected ‘)’ before ‘but’
        but noly %d left\n", vf->vf_idx,
        ^
/tmp/CENTOS_K3.10.0_GCC4.8.5/x86_64-native-linuxapp-gcc/d1f1def0ab3f48ecae99e77a82bbe165/dpdk/drivers/net/i40e/i40e_logs.h:37:59: note: in definition of macro ‘PMD_DRV_LOG_RAW’
  rte_log(RTE_LOG_ ## level, i40e_logtype_driver, "%s(): " fmt, \
                                                           ^
/tmp/CENTOS_K3.10.0_GCC4.8.5/x86_64-native-linuxapp-gcc/d1f1def0ab3f48ecae99e77a82bbe165/dpdk/drivers/net/i40e/i40e_pf.c:1263:3: note: in expansion of macro ‘PMD_DRV_LOG’
   PMD_DRV_LOG(ERR, "VF %d requested %d more queues,
   ^
/tmp/CENTOS_K3.10.0_GCC4.8.5/x86_64-native-linuxapp-gcc/d1f1def0ab3f48ecae99e77a82bbe165/dpdk/drivers/net/i40e/i40e_pf.c:1264:8: error: stray ‘\’ in program
        but noly %d left\n", vf->vf_idx,
        ^
/tmp/CENTOS_K3.10.0_GCC4.8.5/x86_64-native-linuxapp-gcc/d1f1def0ab3f48ecae99e77a82bbe165/dpdk/drivers/net/i40e/i40e_logs.h:37:59: note: in definition of macro ‘PMD_DRV_LOG_RAW’
  rte_log(RTE_LOG_ ## level, i40e_logtype_driver, "%s(): " fmt, \
                                                           ^
/tmp/CENTOS_K3.10.0_GCC4.8.5/x86_64-native-linuxapp-gcc/d1f1def0ab3f48ecae99e77a82bbe165/dpdk/drivers/net/i40e/i40e_pf.c:1263:3: note: in expansion of macro ‘PMD_DRV_LOG’
   PMD_DRV_LOG(ERR, "VF %d requested %d more queues,
   ^
/tmp/CENTOS_K3.10.0_GCC4.8.5/x86_64-native-linuxapp-gcc/d1f1def0ab3f48ecae99e77a82bbe165/dpdk/drivers/net/i40e/i40e_pf.c:1264:8: error: missing terminating " character
        but noly %d left\n", vf->vf_idx,
        ^
/tmp/CENTOS_K3.10.0_GCC4.8.5/x86_64-native-linuxapp-gcc/d1f1def0ab3f48ecae99e77a82bbe165/dpdk/drivers/net/i40e/i40e_logs.h:37:59: note: in definition of macro ‘PMD_DRV_LOG_RAW’
  rte_log(RTE_LOG_ ## level, i40e_logtype_driver, "%s(): " fmt, \
                                                           ^
/tmp/CENTOS_K3.10.0_GCC4.8.5/x86_64-native-linuxapp-gcc/d1f1def0ab3f48ecae99e77a82bbe165/dpdk/drivers/net/i40e/i40e_pf.c:1263:3: note: in expansion of macro ‘PMD_DRV_LOG’
   PMD_DRV_LOG(ERR, "VF %d requested %d more queues,
   ^
/tmp/CENTOS_K3.10.0_GCC4.8.5/x86_64-native-linuxapp-gcc/d1f1def0ab3f48ecae99e77a82bbe165/dpdk/drivers/net/i40e/i40e_pf.c:1264:8: warning: format ‘%s’ expects a matching ‘char *’ argument [-Wformat=]
        but noly %d left\n", vf->vf_idx,
        ^
/tmp/CENTOS_K3.10.0_GCC4.8.5/x86_64-native-linuxapp-gcc/d1f1def0ab3f48ecae99e77a82bbe165/dpdk/drivers/net/i40e/i40e_logs.h:37:59: note: in definition of macro ‘PMD_DRV_LOG_RAW’
  rte_log(RTE_LOG_ ## level, i40e_logtype_driver, "%s(): " fmt, \
                                                           ^

*Failed Build #6:
OS: CENTOS
Target: x86_64-native-linuxapp-gcc-shared
  PMDINFO i40e_ethdev_vf.o.pmd.c
  CC i40e_ethdev_vf.o.pmd.o
  LD i40e_ethdev_vf.o
  CC i40e_pf.o
/tmp/CENTOS_K3.10.0_GCC4.8.5/x86_64-native-linuxapp-gcc-shared/d1f1def0ab3f48ecae99e77a82bbe165/dpdk/drivers/net/i40e/i40e_pf.c: In function ‘i40e_pf_host_process_cmd_request_queues’:
/tmp/CENTOS_K3.10.0_GCC4.8.5/x86_64-native-linuxapp-gcc-shared/d1f1def0ab3f48ecae99e77a82bbe165/dpdk/drivers/net/i40e/i40e_pf.c:1254:20: warning: missing terminating " character [enabled by default]
   PMD_DRV_LOG(ERR, "VF %d tried to request %d queues.
                    ^
/tmp/CENTOS_K3.10.0_GCC4.8.5/x86_64-native-linuxapp-gcc-shared/d1f1def0ab3f48ecae99e77a82bbe165/dpdk/drivers/net/i40e/i40e_pf.c:1255:19: warning: missing terminating " character [enabled by default]
        Ignoring.\n", vf->vf_idx,
                   ^
/tmp/CENTOS_K3.10.0_GCC4.8.5/x86_64-native-linuxapp-gcc-shared/d1f1def0ab3f48ecae99e77a82bbe165/dpdk/drivers/net/i40e/i40e_pf.c:1254:3: error: missing terminating " character
   PMD_DRV_LOG(ERR, "VF %d tried to request %d queues.
   ^
In file included from /tmp/CENTOS_K3.10.0_GCC4.8.5/x86_64-native-linuxapp-gcc-shared/d1f1def0ab3f48ecae99e77a82bbe165/dpdk/drivers/net/i40e/i40e_pf.c:21:0:
/tmp/CENTOS_K3.10.0_GCC4.8.5/x86_64-native-linuxapp-gcc-shared/d1f1def0ab3f48ecae99e77a82bbe165/dpdk/drivers/net/i40e/i40e_pf.c:1255:8: error: expected ‘)’ before ‘Ignoring’
        Ignoring.\n", vf->vf_idx,
        ^
/tmp/CENTOS_K3.10.0_GCC4.8.5/x86_64-native-linuxapp-gcc-shared/d1f1def0ab3f48ecae99e77a82bbe165/dpdk/drivers/net/i40e/i40e_logs.h:37:59: note: in definition of macro ‘PMD_DRV_LOG_RAW’
  rte_log(RTE_LOG_ ## level, i40e_logtype_driver, "%s(): " fmt, \
                                                           ^
/tmp/CENTOS_K3.10.0_GCC4.8.5/x86_64-native-linuxapp-gcc-shared/d1f1def0ab3f48ecae99e77a82bbe165/dpdk/drivers/net/i40e/i40e_pf.c:1254:3: note: in expansion of macro ‘PMD_DRV_LOG’
   PMD_DRV_LOG(ERR, "VF %d tried to request %d queues.
   ^
/tmp/CENTOS_K3.10.0_GCC4.8.5/x86_64-native-linuxapp-gcc-shared/d1f1def0ab3f48ecae99e77a82bbe165/dpdk/drivers/net/i40e/i40e_pf.c:1255:8: error: stray ‘\’ in program
        Ignoring.\n", vf->vf_idx,
        ^
/tmp/CENTOS_K3.10.0_GCC4.8.5/x86_64-native-linuxapp-gcc-shared/d1f1def0ab3f48ecae99e77a82bbe165/dpdk/drivers/net/i40e/i40e_logs.h:37:59: note: in definition of macro ‘PMD_DRV_LOG_RAW’
  rte_log(RTE_LOG_ ## level, i40e_logtype_driver, "%s(): " fmt, \
                                                           ^
/tmp/CENTOS_K3.10.0_GCC4.8.5/x86_64-native-linuxapp-gcc-shared/d1f1def0ab3f48ecae99e77a82bbe165/dpdk/drivers/net/i40e/i40e_pf.c:1254:3: note: in expansion of macro ‘PMD_DRV_LOG’
   PMD_DRV_LOG(ERR, "VF %d tried to request %d queues.
   ^
/tmp/CENTOS_K3.10.0_GCC4.8.5/x86_64-native-linuxapp-gcc-shared/d1f1def0ab3f48ecae99e77a82bbe165/dpdk/drivers/net/i40e/i40e_pf.c:1255:8: error: missing terminating " character
        Ignoring.\n", vf->vf_idx,
        ^
/tmp/CENTOS_K3.10.0_GCC4.8.5/x86_64-native-linuxapp-gcc-shared/d1f1def0ab3f48ecae99e77a82bbe165/dpdk/drivers/net/i40e/i40e_logs.h:37:59: note: in definition of macro ‘PMD_DRV_LOG_RAW’
  rte_log(RTE_LOG_ ## level, i40e_logtype_driver, "%s(): " fmt, \
                                                           ^
/tmp/CENTOS_K3.10.0_GCC4.8.5/x86_64-native-linuxapp-gcc-shared/d1f1def0ab3f48ecae99e77a82bbe165/dpdk/drivers/net/i40e/i40e_pf.c:1254:3: note: in expansion of macro ‘PMD_DRV_LOG’
   PMD_DRV_LOG(ERR, "VF %d tried to request %d queues.
   ^
/tmp/CENTOS_K3.10.0_GCC4.8.5/x86_64-native-linuxapp-gcc-shared/d1f1def0ab3f48ecae99e77a82bbe165/dpdk/drivers/net/i40e/i40e_pf.c:1255:8: warning: format ‘%s’ expects a matching ‘char *’ argument [-Wformat=]
        Ignoring.\n", vf->vf_idx,
        ^
/tmp/CENTOS_K3.10.0_GCC4.8.5/x86_64-native-linuxapp-gcc-shared/d1f1def0ab3f48ecae99e77a82bbe165/dpdk/drivers/net/i40e/i40e_logs.h:37:59: note: in definition of macro ‘PMD_DRV_LOG_RAW’
  rte_log(RTE_LOG_ ## level, i40e_logtype_driver, "%s(): " fmt, \
                                                           ^
/tmp/CENTOS_K3.10.0_GCC4.8.5/x86_64-native-linuxapp-gcc-shared/d1f1def0ab3f48ecae99e77a82bbe165/dpdk/drivers/net/i40e/i40e_pf.c:1254:3: note: in expansion of macro ‘PMD_DRV_LOG’
   PMD_DRV_LOG(ERR, "VF %d tried to request %d queues.
   ^
/tmp/CENTOS_K3.10.0_GCC4.8.5/x86_64-native-linuxapp-gcc-shared/d1f1def0ab3f48ecae99e77a82bbe165/dpdk/drivers/net/i40e/i40e_pf.c:1258:20: warning: missing terminating " character [enabled by default]
   PMD_DRV_LOG(ERR, "VF %d tried to request more than
                    ^
/tmp/CENTOS_K3.10.0_GCC4.8.5/x86_64-native-linuxapp-gcc-shared/d1f1def0ab3f48ecae99e77a82bbe165/dpdk/drivers/net/i40e/i40e_pf.c:1259:20: warning: missing terminating " character [enabled by default]
        %d queues.\n", vf->vf_idx,
                    ^
/tmp/CENTOS_K3.10.0_GCC4.8.5/x86_64-native-linuxapp-gcc-shared/d1f1def0ab3f48ecae99e77a82bbe165/dpdk/drivers/net/i40e/i40e_pf.c:1258:3: error: missing terminating " character
   PMD_DRV_LOG(ERR, "VF %d tried to request more than
   ^
In file included from /tmp/CENTOS_K3.10.0_GCC4.8.5/x86_64-native-linuxapp-gcc-shared/d1f1def0ab3f48ecae99e77a82bbe165/dpdk/drivers/net/i40e/i40e_pf.c:21:0:
/tmp/CENTOS_K3.10.0_GCC4.8.5/x86_64-native-linuxapp-gcc-shared/d1f1def0ab3f48ecae99e77a82bbe165/dpdk/drivers/net/i40e/i40e_pf.c:1259:9: error: ‘d’ undeclared (first use in this function)
        %d queues.\n", vf->vf_idx,
         ^
/tmp/CENTOS_K3.10.0_GCC4.8.5/x86_64-native-linuxapp-gcc-shared/d1f1def0ab3f48ecae99e77a82bbe165/dpdk/drivers/net/i40e/i40e_logs.h:37:59: note: in definition of macro ‘PMD_DRV_LOG_RAW’
  rte_log(RTE_LOG_ ## level, i40e_logtype_driver, "%s(): " fmt, \
                                                           ^
--
  rte_log(RTE_LOG_ ## level, i40e_logtype_driver, "%s(): " fmt, \
                                                           ^
/tmp/CENTOS_K3.10.0_GCC4.8.5/x86_64-native-linuxapp-gcc-shared/d1f1def0ab3f48ecae99e77a82bbe165/dpdk/drivers/net/i40e/i40e_pf.c:1258:3: note: in expansion of macro ‘PMD_DRV_LOG’
   PMD_DRV_LOG(ERR, "VF %d tried to request more than
   ^
/tmp/CENTOS_K3.10.0_GCC4.8.5/x86_64-native-linuxapp-gcc-shared/d1f1def0ab3f48ecae99e77a82bbe165/dpdk/drivers/net/i40e/i40e_pf.c:1259:11: error: expected ‘)’ before ‘queues’
        %d queues.\n", vf->vf_idx,
           ^
/tmp/CENTOS_K3.10.0_GCC4.8.5/x86_64-native-linuxapp-gcc-shared/d1f1def0ab3f48ecae99e77a82bbe165/dpdk/drivers/net/i40e/i40e_logs.h:37:59: note: in definition of macro ‘PMD_DRV_LOG_RAW’
  rte_log(RTE_LOG_ ## level, i40e_logtype_driver, "%s(): " fmt, \
                                                           ^
/tmp/CENTOS_K3.10.0_GCC4.8.5/x86_64-native-linuxapp-gcc-shared/d1f1def0ab3f48ecae99e77a82bbe165/dpdk/drivers/net/i40e/i40e_pf.c:1258:3: note: in expansion of macro ‘PMD_DRV_LOG’
   PMD_DRV_LOG(ERR, "VF %d tried to request more than
   ^
/tmp/CENTOS_K3.10.0_GCC4.8.5/x86_64-native-linuxapp-gcc-shared/d1f1def0ab3f48ecae99e77a82bbe165/dpdk/drivers/net/i40e/i40e_pf.c:1259:11: error: stray ‘\’ in program
        %d queues.\n", vf->vf_idx,
           ^
/tmp/CENTOS_K3.10.0_GCC4.8.5/x86_64-native-linuxapp-gcc-shared/d1f1def0ab3f48ecae99e77a82bbe165/dpdk/drivers/net/i40e/i40e_logs.h:37:59: note: in definition of macro ‘PMD_DRV_LOG_RAW’
  rte_log(RTE_LOG_ ## level, i40e_logtype_driver, "%s(): " fmt, \
                                                           ^
/tmp/CENTOS_K3.10.0_GCC4.8.5/x86_64-native-linuxapp-gcc-shared/d1f1def0ab3f48ecae99e77a82bbe165/dpdk/drivers/net/i40e/i40e_pf.c:1258:3: note: in expansion of macro ‘PMD_DRV_LOG’
   PMD_DRV_LOG(ERR, "VF %d tried to request more than
   ^
/tmp/CENTOS_K3.10.0_GCC4.8.5/x86_64-native-linuxapp-gcc-shared/d1f1def0ab3f48ecae99e77a82bbe165/dpdk/drivers/net/i40e/i40e_pf.c:1259:11: error: missing terminating " character
        %d queues.\n", vf->vf_idx,
           ^
/tmp/CENTOS_K3.10.0_GCC4.8.5/x86_64-native-linuxapp-gcc-shared/d1f1def0ab3f48ecae99e77a82bbe165/dpdk/drivers/net/i40e/i40e_logs.h:37:59: note: in definition of macro ‘PMD_DRV_LOG_RAW’
  rte_log(RTE_LOG_ ## level, i40e_logtype_driver, "%s(): " fmt, \
                                                           ^
/tmp/CENTOS_K3.10.0_GCC4.8.5/x86_64-native-linuxapp-gcc-shared/d1f1def0ab3f48ecae99e77a82bbe165/dpdk/drivers/net/i40e/i40e_pf.c:1258:3: note: in expansion of macro ‘PMD_DRV_LOG’
   PMD_DRV_LOG(ERR, "VF %d tried to request more than
   ^
/tmp/CENTOS_K3.10.0_GCC4.8.5/x86_64-native-linuxapp-gcc-shared/d1f1def0ab3f48ecae99e77a82bbe165/dpdk/drivers/net/i40e/i40e_pf.c:1263:20: warning: missing terminating " character [enabled by default]
   PMD_DRV_LOG(ERR, "VF %d requested %d more queues,
                    ^
/tmp/CENTOS_K3.10.0_GCC4.8.5/x86_64-native-linuxapp-gcc-shared/d1f1def0ab3f48ecae99e77a82bbe165/dpdk/drivers/net/i40e/i40e_pf.c:1264:26: warning: missing terminating " character [enabled by default]
        but noly %d left\n", vf->vf_idx,
                          ^
/tmp/CENTOS_K3.10.0_GCC4.8.5/x86_64-native-linuxapp-gcc-shared/d1f1def0ab3f48ecae99e77a82bbe165/dpdk/drivers/net/i40e/i40e_pf.c:1263:3: error: missing terminating " character
   PMD_DRV_LOG(ERR, "VF %d requested %d more queues,
   ^
In file included from /tmp/CENTOS_K3.10.0_GCC4.8.5/x86_64-native-linuxapp-gcc-shared/d1f1def0ab3f48ecae99e77a82bbe165/dpdk/drivers/net/i40e/i40e_pf.c:21:0:
/tmp/CENTOS_K3.10.0_GCC4.8.5/x86_64-native-linuxapp-gcc-shared/d1f1def0ab3f48ecae99e77a82bbe165/dpdk/drivers/net/i40e/i40e_pf.c:1264:8: error: expected ‘)’ before ‘but’
        but noly %d left\n", vf->vf_idx,
        ^
/tmp/CENTOS_K3.10.0_GCC4.8.5/x86_64-native-linuxapp-gcc-shared/d1f1def0ab3f48ecae99e77a82bbe165/dpdk/drivers/net/i40e/i40e_logs.h:37:59: note: in definition of macro ‘PMD_DRV_LOG_RAW’
  rte_log(RTE_LOG_ ## level, i40e_logtype_driver, "%s(): " fmt, \
                                                           ^
/tmp/CENTOS_K3.10.0_GCC4.8.5/x86_64-native-linuxapp-gcc-shared/d1f1def0ab3f48ecae99e77a82bbe165/dpdk/drivers/net/i40e/i40e_pf.c:1263:3: note: in expansion of macro ‘PMD_DRV_LOG’
   PMD_DRV_LOG(ERR, "VF %d requested %d more queues,
   ^
/tmp/CENTOS_K3.10.0_GCC4.8.5/x86_64-native-linuxapp-gcc-shared/d1f1def0ab3f48ecae99e77a82bbe165/dpdk/drivers/net/i40e/i40e_pf.c:1264:8: error: stray ‘\’ in program
        but noly %d left\n", vf->vf_idx,
        ^
/tmp/CENTOS_K3.10.0_GCC4.8.5/x86_64-native-linuxapp-gcc-shared/d1f1def0ab3f48ecae99e77a82bbe165/dpdk/drivers/net/i40e/i40e_logs.h:37:59: note: in definition of macro ‘PMD_DRV_LOG_RAW’
  rte_log(RTE_LOG_ ## level, i40e_logtype_driver, "%s(): " fmt, \
                                                           ^
/tmp/CENTOS_K3.10.0_GCC4.8.5/x86_64-native-linuxapp-gcc-shared/d1f1def0ab3f48ecae99e77a82bbe165/dpdk/drivers/net/i40e/i40e_pf.c:1263:3: note: in expansion of macro ‘PMD_DRV_LOG’
   PMD_DRV_LOG(ERR, "VF %d requested %d more queues,
   ^
/tmp/CENTOS_K3.10.0_GCC4.8.5/x86_64-native-linuxapp-gcc-shared/d1f1def0ab3f48ecae99e77a82bbe165/dpdk/drivers/net/i40e/i40e_pf.c:1264:8: error: missing terminating " character
        but noly %d left\n", vf->vf_idx,
        ^
/tmp/CENTOS_K3.10.0_GCC4.8.5/x86_64-native-linuxapp-gcc-shared/d1f1def0ab3f48ecae99e77a82bbe165/dpdk/drivers/net/i40e/i40e_logs.h:37:59: note: in definition of macro ‘PMD_DRV_LOG_RAW’
  rte_log(RTE_LOG_ ## level, i40e_logtype_driver, "%s(): " fmt, \
                                                           ^
/tmp/CENTOS_K3.10.0_GCC4.8.5/x86_64-native-linuxapp-gcc-shared/d1f1def0ab3f48ecae99e77a82bbe165/dpdk/drivers/net/i40e/i40e_pf.c:1263:3: note: in expansion of macro ‘PMD_DRV_LOG’
   PMD_DRV_LOG(ERR, "VF %d requested %d more queues,
   ^
/tmp/CENTOS_K3.10.0_GCC4.8.5/x86_64-native-linuxapp-gcc-shared/d1f1def0ab3f48ecae99e77a82bbe165/dpdk/drivers/net/i40e/i40e_pf.c:1264:8: warning: format ‘%s’ expects a matching ‘char *’ argument [-Wformat=]
        but noly %d left\n", vf->vf_idx,
        ^
/tmp/CENTOS_K3.10.0_GCC4.8.5/x86_64-native-linuxapp-gcc-shared/d1f1def0ab3f48ecae99e77a82bbe165/dpdk/drivers/net/i40e/i40e_logs.h:37:59: note: in definition of macro ‘PMD_DRV_LOG_RAW’
  rte_log(RTE_LOG_ ## level, i40e_logtype_driver, "%s(): " fmt, \
                                                           ^

*Failed Build #7:
OS: CENTOS
Target: i686-native-linuxapp-gcc
  PMDINFO i40e_ethdev_vf.o.pmd.c
  CC i40e_ethdev_vf.o.pmd.o
  LD i40e_ethdev_vf.o
  CC i40e_pf.o
/tmp/CENTOS_K3.10.0_GCC4.8.5/i686-native-linuxapp-gcc/d1f1def0ab3f48ecae99e77a82bbe165/dpdk/drivers/net/i40e/i40e_pf.c: In function ‘i40e_pf_host_process_cmd_request_queues’:
/tmp/CENTOS_K3.10.0_GCC4.8.5/i686-native-linuxapp-gcc/d1f1def0ab3f48ecae99e77a82bbe165/dpdk/drivers/net/i40e/i40e_pf.c:1254:20: warning: missing terminating " character [enabled by default]
   PMD_DRV_LOG(ERR, "VF %d tried to request %d queues.
                    ^
/tmp/CENTOS_K3.10.0_GCC4.8.5/i686-native-linuxapp-gcc/d1f1def0ab3f48ecae99e77a82bbe165/dpdk/drivers/net/i40e/i40e_pf.c:1255:19: warning: missing terminating " character [enabled by default]
        Ignoring.\n", vf->vf_idx,
                   ^
/tmp/CENTOS_K3.10.0_GCC4.8.5/i686-native-linuxapp-gcc/d1f1def0ab3f48ecae99e77a82bbe165/dpdk/drivers/net/i40e/i40e_pf.c:1254:3: error: missing terminating " character
   PMD_DRV_LOG(ERR, "VF %d tried to request %d queues.
   ^
In file included from /tmp/CENTOS_K3.10.0_GCC4.8.5/i686-native-linuxapp-gcc/d1f1def0ab3f48ecae99e77a82bbe165/dpdk/drivers/net/i40e/i40e_pf.c:21:0:
/tmp/CENTOS_K3.10.0_GCC4.8.5/i686-native-linuxapp-gcc/d1f1def0ab3f48ecae99e77a82bbe165/dpdk/drivers/net/i40e/i40e_pf.c:1255:8: error: expected ‘)’ before ‘Ignoring’
        Ignoring.\n", vf->vf_idx,
        ^
/tmp/CENTOS_K3.10.0_GCC4.8.5/i686-native-linuxapp-gcc/d1f1def0ab3f48ecae99e77a82bbe165/dpdk/drivers/net/i40e/i40e_logs.h:37:59: note: in definition of macro ‘PMD_DRV_LOG_RAW’
  rte_log(RTE_LOG_ ## level, i40e_logtype_driver, "%s(): " fmt, \
                                                           ^
/tmp/CENTOS_K3.10.0_GCC4.8.5/i686-native-linuxapp-gcc/d1f1def0ab3f48ecae99e77a82bbe165/dpdk/drivers/net/i40e/i40e_pf.c:1254:3: note: in expansion of macro ‘PMD_DRV_LOG’
   PMD_DRV_LOG(ERR, "VF %d tried to request %d queues.
   ^
/tmp/CENTOS_K3.10.0_GCC4.8.5/i686-native-linuxapp-gcc/d1f1def0ab3f48ecae99e77a82bbe165/dpdk/drivers/net/i40e/i40e_pf.c:1255:8: error: stray ‘\’ in program
        Ignoring.\n", vf->vf_idx,
        ^
/tmp/CENTOS_K3.10.0_GCC4.8.5/i686-native-linuxapp-gcc/d1f1def0ab3f48ecae99e77a82bbe165/dpdk/drivers/net/i40e/i40e_logs.h:37:59: note: in definition of macro ‘PMD_DRV_LOG_RAW’
  rte_log(RTE_LOG_ ## level, i40e_logtype_driver, "%s(): " fmt, \
                                                           ^
/tmp/CENTOS_K3.10.0_GCC4.8.5/i686-native-linuxapp-gcc/d1f1def0ab3f48ecae99e77a82bbe165/dpdk/drivers/net/i40e/i40e_pf.c:1254:3: note: in expansion of macro ‘PMD_DRV_LOG’
   PMD_DRV_LOG(ERR, "VF %d tried to request %d queues.
   ^
/tmp/CENTOS_K3.10.0_GCC4.8.5/i686-native-linuxapp-gcc/d1f1def0ab3f48ecae99e77a82bbe165/dpdk/drivers/net/i40e/i40e_pf.c:1255:8: error: missing terminating " character
        Ignoring.\n", vf->vf_idx,
        ^
/tmp/CENTOS_K3.10.0_GCC4.8.5/i686-native-linuxapp-gcc/d1f1def0ab3f48ecae99e77a82bbe165/dpdk/drivers/net/i40e/i40e_logs.h:37:59: note: in definition of macro ‘PMD_DRV_LOG_RAW’
  rte_log(RTE_LOG_ ## level, i40e_logtype_driver, "%s(): " fmt, \
                                                           ^
/tmp/CENTOS_K3.10.0_GCC4.8.5/i686-native-linuxapp-gcc/d1f1def0ab3f48ecae99e77a82bbe165/dpdk/drivers/net/i40e/i40e_pf.c:1254:3: note: in expansion of macro ‘PMD_DRV_LOG’
   PMD_DRV_LOG(ERR, "VF %d tried to request %d queues.
   ^
/tmp/CENTOS_K3.10.0_GCC4.8.5/i686-native-linuxapp-gcc/d1f1def0ab3f48ecae99e77a82bbe165/dpdk/drivers/net/i40e/i40e_pf.c:1255:8: warning: format ‘%s’ expects a matching ‘char *’ argument [-Wformat=]
        Ignoring.\n", vf->vf_idx,
        ^
/tmp/CENTOS_K3.10.0_GCC4.8.5/i686-native-linuxapp-gcc/d1f1def0ab3f48ecae99e77a82bbe165/dpdk/drivers/net/i40e/i40e_logs.h:37:59: note: in definition of macro ‘PMD_DRV_LOG_RAW’
  rte_log(RTE_LOG_ ## level, i40e_logtype_driver, "%s(): " fmt, \
                                                           ^
/tmp/CENTOS_K3.10.0_GCC4.8.5/i686-native-linuxapp-gcc/d1f1def0ab3f48ecae99e77a82bbe165/dpdk/drivers/net/i40e/i40e_pf.c:1254:3: note: in expansion of macro ‘PMD_DRV_LOG’
   PMD_DRV_LOG(ERR, "VF %d tried to request %d queues.
   ^
/tmp/CENTOS_K3.10.0_GCC4.8.5/i686-native-linuxapp-gcc/d1f1def0ab3f48ecae99e77a82bbe165/dpdk/drivers/net/i40e/i40e_pf.c:1258:20: warning: missing terminating " character [enabled by default]
   PMD_DRV_LOG(ERR, "VF %d tried to request more than
                    ^
/tmp/CENTOS_K3.10.0_GCC4.8.5/i686-native-linuxapp-gcc/d1f1def0ab3f48ecae99e77a82bbe165/dpdk/drivers/net/i40e/i40e_pf.c:1259:20: warning: missing terminating " character [enabled by default]
        %d queues.\n", vf->vf_idx,
                    ^
/tmp/CENTOS_K3.10.0_GCC4.8.5/i686-native-linuxapp-gcc/d1f1def0ab3f48ecae99e77a82bbe165/dpdk/drivers/net/i40e/i40e_pf.c:1258:3: error: missing terminating " character
   PMD_DRV_LOG(ERR, "VF %d tried to request more than
   ^
In file included from /tmp/CENTOS_K3.10.0_GCC4.8.5/i686-native-linuxapp-gcc/d1f1def0ab3f48ecae99e77a82bbe165/dpdk/drivers/net/i40e/i40e_pf.c:21:0:
/tmp/CENTOS_K3.10.0_GCC4.8.5/i686-native-linuxapp-gcc/d1f1def0ab3f48ecae99e77a82bbe165/dpdk/drivers/net/i40e/i40e_pf.c:1259:9: error: ‘d’ undeclared (first use in this function)
        %d queues.\n", vf->vf_idx,
         ^
/tmp/CENTOS_K3.10.0_GCC4.8.5/i686-native-linuxapp-gcc/d1f1def0ab3f48ecae99e77a82bbe165/dpdk/drivers/net/i40e/i40e_logs.h:37:59: note: in definition of macro ‘PMD_DRV_LOG_RAW’
  rte_log(RTE_LOG_ ## level, i40e_logtype_driver, "%s(): " fmt, \
                                                           ^
--
  rte_log(RTE_LOG_ ## level, i40e_logtype_driver, "%s(): " fmt, \
                                                           ^
/tmp/CENTOS_K3.10.0_GCC4.8.5/i686-native-linuxapp-gcc/d1f1def0ab3f48ecae99e77a82bbe165/dpdk/drivers/net/i40e/i40e_pf.c:1258:3: note: in expansion of macro ‘PMD_DRV_LOG’
   PMD_DRV_LOG(ERR, "VF %d tried to request more than
   ^
/tmp/CENTOS_K3.10.0_GCC4.8.5/i686-native-linuxapp-gcc/d1f1def0ab3f48ecae99e77a82bbe165/dpdk/drivers/net/i40e/i40e_pf.c:1259:11: error: expected ‘)’ before ‘queues’
        %d queues.\n", vf->vf_idx,
           ^
/tmp/CENTOS_K3.10.0_GCC4.8.5/i686-native-linuxapp-gcc/d1f1def0ab3f48ecae99e77a82bbe165/dpdk/drivers/net/i40e/i40e_logs.h:37:59: note: in definition of macro ‘PMD_DRV_LOG_RAW’
  rte_log(RTE_LOG_ ## level, i40e_logtype_driver, "%s(): " fmt, \
                                                           ^
/tmp/CENTOS_K3.10.0_GCC4.8.5/i686-native-linuxapp-gcc/d1f1def0ab3f48ecae99e77a82bbe165/dpdk/drivers/net/i40e/i40e_pf.c:1258:3: note: in expansion of macro ‘PMD_DRV_LOG’
   PMD_DRV_LOG(ERR, "VF %d tried to request more than
   ^
/tmp/CENTOS_K3.10.0_GCC4.8.5/i686-native-linuxapp-gcc/d1f1def0ab3f48ecae99e77a82bbe165/dpdk/drivers/net/i40e/i40e_pf.c:1259:11: error: stray ‘\’ in program
        %d queues.\n", vf->vf_idx,
           ^
/tmp/CENTOS_K3.10.0_GCC4.8.5/i686-native-linuxapp-gcc/d1f1def0ab3f48ecae99e77a82bbe165/dpdk/drivers/net/i40e/i40e_logs.h:37:59: note: in definition of macro ‘PMD_DRV_LOG_RAW’
  rte_log(RTE_LOG_ ## level, i40e_logtype_driver, "%s(): " fmt, \
                                                           ^
/tmp/CENTOS_K3.10.0_GCC4.8.5/i686-native-linuxapp-gcc/d1f1def0ab3f48ecae99e77a82bbe165/dpdk/drivers/net/i40e/i40e_pf.c:1258:3: note: in expansion of macro ‘PMD_DRV_LOG’
   PMD_DRV_LOG(ERR, "VF %d tried to request more than
   ^
/tmp/CENTOS_K3.10.0_GCC4.8.5/i686-native-linuxapp-gcc/d1f1def0ab3f48ecae99e77a82bbe165/dpdk/drivers/net/i40e/i40e_pf.c:1259:11: error: missing terminating " character
        %d queues.\n", vf->vf_idx,
           ^
/tmp/CENTOS_K3.10.0_GCC4.8.5/i686-native-linuxapp-gcc/d1f1def0ab3f48ecae99e77a82bbe165/dpdk/drivers/net/i40e/i40e_logs.h:37:59: note: in definition of macro ‘PMD_DRV_LOG_RAW’
  rte_log(RTE_LOG_ ## level, i40e_logtype_driver, "%s(): " fmt, \
                                                           ^
/tmp/CENTOS_K3.10.0_GCC4.8.5/i686-native-linuxapp-gcc/d1f1def0ab3f48ecae99e77a82bbe165/dpdk/drivers/net/i40e/i40e_pf.c:1258:3: note: in expansion of macro ‘PMD_DRV_LOG’
   PMD_DRV_LOG(ERR, "VF %d tried to request more than
   ^
/tmp/CENTOS_K3.10.0_GCC4.8.5/i686-native-linuxapp-gcc/d1f1def0ab3f48ecae99e77a82bbe165/dpdk/drivers/net/i40e/i40e_pf.c:1263:20: warning: missing terminating " character [enabled by default]
   PMD_DRV_LOG(ERR, "VF %d requested %d more queues,
                    ^
/tmp/CENTOS_K3.10.0_GCC4.8.5/i686-native-linuxapp-gcc/d1f1def0ab3f48ecae99e77a82bbe165/dpdk/drivers/net/i40e/i40e_pf.c:1264:26: warning: missing terminating " character [enabled by default]
        but noly %d left\n", vf->vf_idx,
                          ^
/tmp/CENTOS_K3.10.0_GCC4.8.5/i686-native-linuxapp-gcc/d1f1def0ab3f48ecae99e77a82bbe165/dpdk/drivers/net/i40e/i40e_pf.c:1263:3: error: missing terminating " character
   PMD_DRV_LOG(ERR, "VF %d requested %d more queues,
   ^
In file included from /tmp/CENTOS_K3.10.0_GCC4.8.5/i686-native-linuxapp-gcc/d1f1def0ab3f48ecae99e77a82bbe165/dpdk/drivers/net/i40e/i40e_pf.c:21:0:
/tmp/CENTOS_K3.10.0_GCC4.8.5/i686-native-linuxapp-gcc/d1f1def0ab3f48ecae99e77a82bbe165/dpdk/drivers/net/i40e/i40e_pf.c:1264:8: error: expected ‘)’ before ‘but’
        but noly %d left\n", vf->vf_idx,
        ^
/tmp/CENTOS_K3.10.0_GCC4.8.5/i686-native-linuxapp-gcc/d1f1def0ab3f48ecae99e77a82bbe165/dpdk/drivers/net/i40e/i40e_logs.h:37:59: note: in definition of macro ‘PMD_DRV_LOG_RAW’
  rte_log(RTE_LOG_ ## level, i40e_logtype_driver, "%s(): " fmt, \
                                                           ^
/tmp/CENTOS_K3.10.0_GCC4.8.5/i686-native-linuxapp-gcc/d1f1def0ab3f48ecae99e77a82bbe165/dpdk/drivers/net/i40e/i40e_pf.c:1263:3: note: in expansion of macro ‘PMD_DRV_LOG’
   PMD_DRV_LOG(ERR, "VF %d requested %d more queues,
   ^
/tmp/CENTOS_K3.10.0_GCC4.8.5/i686-native-linuxapp-gcc/d1f1def0ab3f48ecae99e77a82bbe165/dpdk/drivers/net/i40e/i40e_pf.c:1264:8: error: stray ‘\’ in program
        but noly %d left\n", vf->vf_idx,
        ^
/tmp/CENTOS_K3.10.0_GCC4.8.5/i686-native-linuxapp-gcc/d1f1def0ab3f48ecae99e77a82bbe165/dpdk/drivers/net/i40e/i40e_logs.h:37:59: note: in definition of macro ‘PMD_DRV_LOG_RAW’
  rte_log(RTE_LOG_ ## level, i40e_logtype_driver, "%s(): " fmt, \
                                                           ^
/tmp/CENTOS_K3.10.0_GCC4.8.5/i686-native-linuxapp-gcc/d1f1def0ab3f48ecae99e77a82bbe165/dpdk/drivers/net/i40e/i40e_pf.c:1263:3: note: in expansion of macro ‘PMD_DRV_LOG’
   PMD_DRV_LOG(ERR, "VF %d requested %d more queues,
   ^
/tmp/CENTOS_K3.10.0_GCC4.8.5/i686-native-linuxapp-gcc/d1f1def0ab3f48ecae99e77a82bbe165/dpdk/drivers/net/i40e/i40e_pf.c:1264:8: error: missing terminating " character
        but noly %d left\n", vf->vf_idx,
        ^
/tmp/CENTOS_K3.10.0_GCC4.8.5/i686-native-linuxapp-gcc/d1f1def0ab3f48ecae99e77a82bbe165/dpdk/drivers/net/i40e/i40e_logs.h:37:59: note: in definition of macro ‘PMD_DRV_LOG_RAW’
  rte_log(RTE_LOG_ ## level, i40e_logtype_driver, "%s(): " fmt, \
                                                           ^
/tmp/CENTOS_K3.10.0_GCC4.8.5/i686-native-linuxapp-gcc/d1f1def0ab3f48ecae99e77a82bbe165/dpdk/drivers/net/i40e/i40e_pf.c:1263:3: note: in expansion of macro ‘PMD_DRV_LOG’
   PMD_DRV_LOG(ERR, "VF %d requested %d more queues,
   ^
/tmp/CENTOS_K3.10.0_GCC4.8.5/i686-native-linuxapp-gcc/d1f1def0ab3f48ecae99e77a82bbe165/dpdk/drivers/net/i40e/i40e_pf.c:1264:8: warning: format ‘%s’ expects a matching ‘char *’ argument [-Wformat=]
        but noly %d left\n", vf->vf_idx,
        ^
/tmp/CENTOS_K3.10.0_GCC4.8.5/i686-native-linuxapp-gcc/d1f1def0ab3f48ecae99e77a82bbe165/dpdk/drivers/net/i40e/i40e_logs.h:37:59: note: in definition of macro ‘PMD_DRV_LOG_RAW’
  rte_log(RTE_LOG_ ## level, i40e_logtype_driver, "%s(): " fmt, \
                                                           ^

*Failed Build #8:
OS: UB1604
Target: i686-native-linuxapp-gcc
  PMDINFO i40e_ethdev_vf.o.pmd.c
  CC i40e_ethdev_vf.o.pmd.o
  LD i40e_ethdev_vf.o
  CC i40e_pf.o
/tmp/UB1604_K4.4.0_GCC5.4.0/i686-native-linuxapp-gcc/d1f1def0ab3f48ecae99e77a82bbe165/dpdk/drivers/net/i40e/i40e_pf.c: In function ‘i40e_pf_host_process_cmd_request_queues’:
/tmp/UB1604_K4.4.0_GCC5.4.0/i686-native-linuxapp-gcc/d1f1def0ab3f48ecae99e77a82bbe165/dpdk/drivers/net/i40e/i40e_pf.c:1254:20: warning: missing terminating " character
   PMD_DRV_LOG(ERR, "VF %d tried to request %d queues.
                    ^
/tmp/UB1604_K4.4.0_GCC5.4.0/i686-native-linuxapp-gcc/d1f1def0ab3f48ecae99e77a82bbe165/dpdk/drivers/net/i40e/i40e_pf.c:1255:19: warning: missing terminating " character
        Ignoring.\n", vf->vf_idx,
                   ^
/tmp/UB1604_K4.4.0_GCC5.4.0/i686-native-linuxapp-gcc/d1f1def0ab3f48ecae99e77a82bbe165/dpdk/drivers/net/i40e/i40e_pf.c:1254:3: error: missing terminating " character
   PMD_DRV_LOG(ERR, "VF %d tried to request %d queues.
   ^
In file included from /tmp/UB1604_K4.4.0_GCC5.4.0/i686-native-linuxapp-gcc/d1f1def0ab3f48ecae99e77a82bbe165/dpdk/drivers/net/i40e/i40e_pf.c:21:0:
/tmp/UB1604_K4.4.0_GCC5.4.0/i686-native-linuxapp-gcc/d1f1def0ab3f48ecae99e77a82bbe165/dpdk/drivers/net/i40e/i40e_pf.c:1255:8: error: expected ‘)’ before ‘Ignoring’
        Ignoring.\n", vf->vf_idx,
        ^
/tmp/UB1604_K4.4.0_GCC5.4.0/i686-native-linuxapp-gcc/d1f1def0ab3f48ecae99e77a82bbe165/dpdk/drivers/net/i40e/i40e_logs.h:37:59: note: in definition of macro ‘PMD_DRV_LOG_RAW’
  rte_log(RTE_LOG_ ## level, i40e_logtype_driver, "%s(): " fmt, \
                                                           ^
/tmp/UB1604_K4.4.0_GCC5.4.0/i686-native-linuxapp-gcc/d1f1def0ab3f48ecae99e77a82bbe165/dpdk/drivers/net/i40e/i40e_pf.c:1254:3: note: in expansion of macro ‘PMD_DRV_LOG’
   PMD_DRV_LOG(ERR, "VF %d tried to request %d queues.
   ^
/tmp/UB1604_K4.4.0_GCC5.4.0/i686-native-linuxapp-gcc/d1f1def0ab3f48ecae99e77a82bbe165/dpdk/drivers/net/i40e/i40e_pf.c:1255:8: error: stray ‘\’ in program
        Ignoring.\n", vf->vf_idx,
        ^
/tmp/UB1604_K4.4.0_GCC5.4.0/i686-native-linuxapp-gcc/d1f1def0ab3f48ecae99e77a82bbe165/dpdk/drivers/net/i40e/i40e_logs.h:37:59: note: in definition of macro ‘PMD_DRV_LOG_RAW’
  rte_log(RTE_LOG_ ## level, i40e_logtype_driver, "%s(): " fmt, \
                                                           ^
/tmp/UB1604_K4.4.0_GCC5.4.0/i686-native-linuxapp-gcc/d1f1def0ab3f48ecae99e77a82bbe165/dpdk/drivers/net/i40e/i40e_pf.c:1254:3: note: in expansion of macro ‘PMD_DRV_LOG’
   PMD_DRV_LOG(ERR, "VF %d tried to request %d queues.
   ^
/tmp/UB1604_K4.4.0_GCC5.4.0/i686-native-linuxapp-gcc/d1f1def0ab3f48ecae99e77a82bbe165/dpdk/drivers/net/i40e/i40e_pf.c:1255:8: error: missing terminating " character
        Ignoring.\n", vf->vf_idx,
        ^
/tmp/UB1604_K4.4.0_GCC5.4.0/i686-native-linuxapp-gcc/d1f1def0ab3f48ecae99e77a82bbe165/dpdk/drivers/net/i40e/i40e_logs.h:37:59: note: in definition of macro ‘PMD_DRV_LOG_RAW’
  rte_log(RTE_LOG_ ## level, i40e_logtype_driver, "%s(): " fmt, \
                                                           ^
/tmp/UB1604_K4.4.0_GCC5.4.0/i686-native-linuxapp-gcc/d1f1def0ab3f48ecae99e77a82bbe165/dpdk/drivers/net/i40e/i40e_pf.c:1254:3: note: in expansion of macro ‘PMD_DRV_LOG’
   PMD_DRV_LOG(ERR, "VF %d tried to request %d queues.
   ^
/tmp/UB1604_K4.4.0_GCC5.4.0/i686-native-linuxapp-gcc/d1f1def0ab3f48ecae99e77a82bbe165/dpdk/drivers/net/i40e/i40e_logs.h:37:50: warning: format ‘%s’ expects a matching ‘char *’ argument [-Wformat=]
  rte_log(RTE_LOG_ ## level, i40e_logtype_driver, "%s(): " fmt, \
                                                  ^
/tmp/UB1604_K4.4.0_GCC5.4.0/i686-native-linuxapp-gcc/d1f1def0ab3f48ecae99e77a82bbe165/dpdk/drivers/net/i40e/i40e_logs.h:41:2: note: in expansion of macro ‘PMD_DRV_LOG_RAW’
  PMD_DRV_LOG_RAW(level, fmt "\n", ## args)
  ^
/tmp/UB1604_K4.4.0_GCC5.4.0/i686-native-linuxapp-gcc/d1f1def0ab3f48ecae99e77a82bbe165/dpdk/drivers/net/i40e/i40e_pf.c:1254:3: note: in expansion of macro ‘PMD_DRV_LOG’
   PMD_DRV_LOG(ERR, "VF %d tried to request %d queues.
   ^
/tmp/UB1604_K4.4.0_GCC5.4.0/i686-native-linuxapp-gcc/d1f1def0ab3f48ecae99e77a82bbe165/dpdk/drivers/net/i40e/i40e_pf.c:1258:20: warning: missing terminating " character
   PMD_DRV_LOG(ERR, "VF %d tried to request more than
                    ^
/tmp/UB1604_K4.4.0_GCC5.4.0/i686-native-linuxapp-gcc/d1f1def0ab3f48ecae99e77a82bbe165/dpdk/drivers/net/i40e/i40e_pf.c:1259:20: warning: missing terminating " character
        %d queues.\n", vf->vf_idx,
                    ^
/tmp/UB1604_K4.4.0_GCC5.4.0/i686-native-linuxapp-gcc/d1f1def0ab3f48ecae99e77a82bbe165/dpdk/drivers/net/i40e/i40e_pf.c:1258:3: error: missing terminating " character
   PMD_DRV_LOG(ERR, "VF %d tried to request more than
   ^
In file included from /tmp/UB1604_K4.4.0_GCC5.4.0/i686-native-linuxapp-gcc/d1f1def0ab3f48ecae99e77a82bbe165/dpdk/drivers/net/i40e/i40e_pf.c:21:0:
/tmp/UB1604_K4.4.0_GCC5.4.0/i686-native-linuxapp-gcc/d1f1def0ab3f48ecae99e77a82bbe165/dpdk/drivers/net/i40e/i40e_pf.c:1259:9: error: ‘d’ undeclared (first use in this function)
        %d queues.\n", vf->vf_idx,
         ^
/tmp/UB1604_K4.4.0_GCC5.4.0/i686-native-linuxapp-gcc/d1f1def0ab3f48ecae99e77a82bbe165/dpdk/drivers/net/i40e/i40e_logs.h:37:59: note: in definition of macro ‘PMD_DRV_LOG_RAW’
  rte_log(RTE_LOG_ ## level, i40e_logtype_driver, "%s(): " fmt, \
                                                           ^
--
  rte_log(RTE_LOG_ ## level, i40e_logtype_driver, "%s(): " fmt, \
                                                           ^
/tmp/UB1604_K4.4.0_GCC5.4.0/i686-native-linuxapp-gcc/d1f1def0ab3f48ecae99e77a82bbe165/dpdk/drivers/net/i40e/i40e_pf.c:1258:3: note: in expansion of macro ‘PMD_DRV_LOG’
   PMD_DRV_LOG(ERR, "VF %d tried to request more than
   ^
/tmp/UB1604_K4.4.0_GCC5.4.0/i686-native-linuxapp-gcc/d1f1def0ab3f48ecae99e77a82bbe165/dpdk/drivers/net/i40e/i40e_pf.c:1259:11: error: expected ‘)’ before ‘queues’
        %d queues.\n", vf->vf_idx,
           ^
/tmp/UB1604_K4.4.0_GCC5.4.0/i686-native-linuxapp-gcc/d1f1def0ab3f48ecae99e77a82bbe165/dpdk/drivers/net/i40e/i40e_logs.h:37:59: note: in definition of macro ‘PMD_DRV_LOG_RAW’
  rte_log(RTE_LOG_ ## level, i40e_logtype_driver, "%s(): " fmt, \
                                                           ^
/tmp/UB1604_K4.4.0_GCC5.4.0/i686-native-linuxapp-gcc/d1f1def0ab3f48ecae99e77a82bbe165/dpdk/drivers/net/i40e/i40e_pf.c:1258:3: note: in expansion of macro ‘PMD_DRV_LOG’
   PMD_DRV_LOG(ERR, "VF %d tried to request more than
   ^
/tmp/UB1604_K4.4.0_GCC5.4.0/i686-native-linuxapp-gcc/d1f1def0ab3f48ecae99e77a82bbe165/dpdk/drivers/net/i40e/i40e_pf.c:1259:11: error: stray ‘\’ in program
        %d queues.\n", vf->vf_idx,
           ^
/tmp/UB1604_K4.4.0_GCC5.4.0/i686-native-linuxapp-gcc/d1f1def0ab3f48ecae99e77a82bbe165/dpdk/drivers/net/i40e/i40e_logs.h:37:59: note: in definition of macro ‘PMD_DRV_LOG_RAW’
  rte_log(RTE_LOG_ ## level, i40e_logtype_driver, "%s(): " fmt, \
                                                           ^
/tmp/UB1604_K4.4.0_GCC5.4.0/i686-native-linuxapp-gcc/d1f1def0ab3f48ecae99e77a82bbe165/dpdk/drivers/net/i40e/i40e_pf.c:1258:3: note: in expansion of macro ‘PMD_DRV_LOG’
   PMD_DRV_LOG(ERR, "VF %d tried to request more than
   ^
/tmp/UB1604_K4.4.0_GCC5.4.0/i686-native-linuxapp-gcc/d1f1def0ab3f48ecae99e77a82bbe165/dpdk/drivers/net/i40e/i40e_pf.c:1259:11: error: missing terminating " character
        %d queues.\n", vf->vf_idx,
           ^
/tmp/UB1604_K4.4.0_GCC5.4.0/i686-native-linuxapp-gcc/d1f1def0ab3f48ecae99e77a82bbe165/dpdk/drivers/net/i40e/i40e_logs.h:37:59: note: in definition of macro ‘PMD_DRV_LOG_RAW’
  rte_log(RTE_LOG_ ## level, i40e_logtype_driver, "%s(): " fmt, \
                                                           ^
/tmp/UB1604_K4.4.0_GCC5.4.0/i686-native-linuxapp-gcc/d1f1def0ab3f48ecae99e77a82bbe165/dpdk/drivers/net/i40e/i40e_pf.c:1258:3: note: in expansion of macro ‘PMD_DRV_LOG’
   PMD_DRV_LOG(ERR, "VF %d tried to request more than
   ^
/tmp/UB1604_K4.4.0_GCC5.4.0/i686-native-linuxapp-gcc/d1f1def0ab3f48ecae99e77a82bbe165/dpdk/drivers/net/i40e/i40e_pf.c:1263:20: warning: missing terminating " character
   PMD_DRV_LOG(ERR, "VF %d requested %d more queues,
                    ^
/tmp/UB1604_K4.4.0_GCC5.4.0/i686-native-linuxapp-gcc/d1f1def0ab3f48ecae99e77a82bbe165/dpdk/drivers/net/i40e/i40e_pf.c:1264:26: warning: missing terminating " character
        but noly %d left\n", vf->vf_idx,
                          ^
/tmp/UB1604_K4.4.0_GCC5.4.0/i686-native-linuxapp-gcc/d1f1def0ab3f48ecae99e77a82bbe165/dpdk/drivers/net/i40e/i40e_pf.c:1263:3: error: missing terminating " character
   PMD_DRV_LOG(ERR, "VF %d requested %d more queues,
   ^
In file included from /tmp/UB1604_K4.4.0_GCC5.4.0/i686-native-linuxapp-gcc/d1f1def0ab3f48ecae99e77a82bbe165/dpdk/drivers/net/i40e/i40e_pf.c:21:0:
/tmp/UB1604_K4.4.0_GCC5.4.0/i686-native-linuxapp-gcc/d1f1def0ab3f48ecae99e77a82bbe165/dpdk/drivers/net/i40e/i40e_pf.c:1264:8: error: expected ‘)’ before ‘but’
        but noly %d left\n", vf->vf_idx,
        ^
/tmp/UB1604_K4.4.0_GCC5.4.0/i686-native-linuxapp-gcc/d1f1def0ab3f48ecae99e77a82bbe165/dpdk/drivers/net/i40e/i40e_logs.h:37:59: note: in definition of macro ‘PMD_DRV_LOG_RAW’
  rte_log(RTE_LOG_ ## level, i40e_logtype_driver, "%s(): " fmt, \
                                                           ^
/tmp/UB1604_K4.4.0_GCC5.4.0/i686-native-linuxapp-gcc/d1f1def0ab3f48ecae99e77a82bbe165/dpdk/drivers/net/i40e/i40e_pf.c:1263:3: note: in expansion of macro ‘PMD_DRV_LOG’
   PMD_DRV_LOG(ERR, "VF %d requested %d more queues,
   ^
/tmp/UB1604_K4.4.0_GCC5.4.0/i686-native-linuxapp-gcc/d1f1def0ab3f48ecae99e77a82bbe165/dpdk/drivers/net/i40e/i40e_pf.c:1264:8: error: stray ‘\’ in program
        but noly %d left\n", vf->vf_idx,
        ^
/tmp/UB1604_K4.4.0_GCC5.4.0/i686-native-linuxapp-gcc/d1f1def0ab3f48ecae99e77a82bbe165/dpdk/drivers/net/i40e/i40e_logs.h:37:59: note: in definition of macro ‘PMD_DRV_LOG_RAW’
  rte_log(RTE_LOG_ ## level, i40e_logtype_driver, "%s(): " fmt, \
                                                           ^
/tmp/UB1604_K4.4.0_GCC5.4.0/i686-native-linuxapp-gcc/d1f1def0ab3f48ecae99e77a82bbe165/dpdk/drivers/net/i40e/i40e_pf.c:1263:3: note: in expansion of macro ‘PMD_DRV_LOG’
   PMD_DRV_LOG(ERR, "VF %d requested %d more queues,
   ^
/tmp/UB1604_K4.4.0_GCC5.4.0/i686-native-linuxapp-gcc/d1f1def0ab3f48ecae99e77a82bbe165/dpdk/drivers/net/i40e/i40e_pf.c:1264:8: error: missing terminating " character
        but noly %d left\n", vf->vf_idx,
        ^
/tmp/UB1604_K4.4.0_GCC5.4.0/i686-native-linuxapp-gcc/d1f1def0ab3f48ecae99e77a82bbe165/dpdk/drivers/net/i40e/i40e_logs.h:37:59: note: in definition of macro ‘PMD_DRV_LOG_RAW’
  rte_log(RTE_LOG_ ## level, i40e_logtype_driver, "%s(): " fmt, \
                                                           ^
/tmp/UB1604_K4.4.0_GCC5.4.0/i686-native-linuxapp-gcc/d1f1def0ab3f48ecae99e77a82bbe165/dpdk/drivers/net/i40e/i40e_pf.c:1263:3: note: in expansion of macro ‘PMD_DRV_LOG’
   PMD_DRV_LOG(ERR, "VF %d requested %d more queues,
   ^
/tmp/UB1604_K4.4.0_GCC5.4.0/i686-native-linuxapp-gcc/d1f1def0ab3f48ecae99e77a82bbe165/dpdk/drivers/net/i40e/i40e_logs.h:37:50: warning: format ‘%s’ expects a matching ‘char *’ argument [-Wformat=]
  rte_log(RTE_LOG_ ## level, i40e_logtype_driver, "%s(): " fmt, \
                                                  ^
/tmp/UB1604_K4.4.0_GCC5.4.0/i686-native-linuxapp-gcc/d1f1def0ab3f48ecae99e77a82bbe165/dpdk/drivers/net/i40e/i40e_logs.h:41:2: note: in expansion of macro ‘PMD_DRV_LOG_RAW’
  PMD_DRV_LOG_RAW(level, fmt "\n", ## args)
  ^
/tmp/UB1604_K4.4.0_GCC5.4.0/i686-native-linuxapp-gcc/d1f1def0ab3f48ecae99e77a82bbe165/dpdk/drivers/net/i40e/i40e_pf.c:1263:3: note: in expansion of macro ‘PMD_DRV_LOG’
   PMD_DRV_LOG(ERR, "VF %d requested %d more queues,
   ^
/tmp/UB1604_K4.4.0_GCC5.4.0/i686-native-linuxapp-gcc/d1f1def0ab3f48ecae99e77a82bbe165/dpdk/mk/internal/rte.compile-pre.mk:114: recipe for target 'i40e_pf.o' failed
make[6]: *** [i40e_pf.o] Error 1
/tmp/UB1604_K4.4.0_GCC5.4.0/i686-native-linuxapp-gcc/d1f1def0ab3f48ecae99e77a82bbe165/dpdk/mk/rte.subdir.mk:35: recipe for target 'i40e' failed
make[5]: *** [i40e] Error 2
make[5]: *** Waiting for unfinished jobs....
  CC ixgbe_fdir.o
  CC ixgbe_pf.o
  PMDINFO ixgbe_ethdev.o.pmd.c
--
  CC rte_pmd_ixgbe.o
  CC ixgbe_tm.o
  CC ixgbe_vf_representor.o
  AR librte_pmd_ixgbe.a
  INSTALL-LIB librte_pmd_ixgbe.a
/tmp/UB1604_K4.4.0_GCC5.4.0/i686-native-linuxapp-gcc/d1f1def0ab3f48ecae99e77a82bbe165/dpdk/mk/rte.subdir.mk:35: recipe for target 'net' failed
make[4]: *** [net] Error 2
/tmp/UB1604_K4.4.0_GCC5.4.0/i686-native-linuxapp-gcc/d1f1def0ab3f48ecae99e77a82bbe165/dpdk/mk/rte.sdkbuild.mk:49: recipe for target 'drivers' failed
make[3]: *** [drivers] Error 2
/tmp/UB1604_K4.4.0_GCC5.4.0/i686-native-linuxapp-gcc/d1f1def0ab3f48ecae99e77a82bbe165/dpdk/mk/rte.sdkroot.mk:100: recipe for target 'all' failed
make[2]: *** [all] Error 2
/tmp/UB1604_K4.4.0_GCC5.4.0/i686-native-linuxapp-gcc/d1f1def0ab3f48ecae99e77a82bbe165/dpdk/mk/rte.sdkinstall.mk:57: recipe for target 'pre_install' failed
make[1]: *** [pre_install] Error 2
/tmp/UB1604_K4.4.0_GCC5.4.0/i686-native-linuxapp-gcc/d1f1def0ab3f48ecae99e77a82bbe165/dpdk/mk/rte.sdkroot.mk:79: recipe for target 'install' failed
make: *** [install] Error 2

*Failed Build #9:
OS: UB1604
Target: x86_64-native-linuxapp-gcc-shared
  CC i40e_ethdev_vf.o.pmd.o
  LD i40e_ethdev_vf.o
  CC i40e_pf.o
  CC ixgbe_flow.o
/tmp/UB1604_K4.4.0_GCC5.4.0/x86_64-native-linuxapp-gcc-shared/d1f1def0ab3f48ecae99e77a82bbe165/dpdk/drivers/net/i40e/i40e_pf.c: In function ‘i40e_pf_host_process_cmd_request_queues’:
/tmp/UB1604_K4.4.0_GCC5.4.0/x86_64-native-linuxapp-gcc-shared/d1f1def0ab3f48ecae99e77a82bbe165/dpdk/drivers/net/i40e/i40e_pf.c:1254:20: warning: missing terminating " character
   PMD_DRV_LOG(ERR, "VF %d tried to request %d queues.
                    ^
/tmp/UB1604_K4.4.0_GCC5.4.0/x86_64-native-linuxapp-gcc-shared/d1f1def0ab3f48ecae99e77a82bbe165/dpdk/drivers/net/i40e/i40e_pf.c:1255:19: warning: missing terminating " character
        Ignoring.\n", vf->vf_idx,
                   ^
/tmp/UB1604_K4.4.0_GCC5.4.0/x86_64-native-linuxapp-gcc-shared/d1f1def0ab3f48ecae99e77a82bbe165/dpdk/drivers/net/i40e/i40e_pf.c:1254:3: error: missing terminating " character
   PMD_DRV_LOG(ERR, "VF %d tried to request %d queues.
   ^
In file included from /tmp/UB1604_K4.4.0_GCC5.4.0/x86_64-native-linuxapp-gcc-shared/d1f1def0ab3f48ecae99e77a82bbe165/dpdk/drivers/net/i40e/i40e_pf.c:21:0:
/tmp/UB1604_K4.4.0_GCC5.4.0/x86_64-native-linuxapp-gcc-shared/d1f1def0ab3f48ecae99e77a82bbe165/dpdk/drivers/net/i40e/i40e_pf.c:1255:8: error: expected ‘)’ before ‘Ignoring’
        Ignoring.\n", vf->vf_idx,
        ^
/tmp/UB1604_K4.4.0_GCC5.4.0/x86_64-native-linuxapp-gcc-shared/d1f1def0ab3f48ecae99e77a82bbe165/dpdk/drivers/net/i40e/i40e_logs.h:37:59: note: in definition of macro ‘PMD_DRV_LOG_RAW’
  rte_log(RTE_LOG_ ## level, i40e_logtype_driver, "%s(): " fmt, \
                                                           ^
/tmp/UB1604_K4.4.0_GCC5.4.0/x86_64-native-linuxapp-gcc-shared/d1f1def0ab3f48ecae99e77a82bbe165/dpdk/drivers/net/i40e/i40e_pf.c:1254:3: note: in expansion of macro ‘PMD_DRV_LOG’
   PMD_DRV_LOG(ERR, "VF %d tried to request %d queues.
   ^
/tmp/UB1604_K4.4.0_GCC5.4.0/x86_64-native-linuxapp-gcc-shared/d1f1def0ab3f48ecae99e77a82bbe165/dpdk/drivers/net/i40e/i40e_pf.c:1255:8: error: stray ‘\’ in program
        Ignoring.\n", vf->vf_idx,
        ^
/tmp/UB1604_K4.4.0_GCC5.4.0/x86_64-native-linuxapp-gcc-shared/d1f1def0ab3f48ecae99e77a82bbe165/dpdk/drivers/net/i40e/i40e_logs.h:37:59: note: in definition of macro ‘PMD_DRV_LOG_RAW’
  rte_log(RTE_LOG_ ## level, i40e_logtype_driver, "%s(): " fmt, \
                                                           ^
/tmp/UB1604_K4.4.0_GCC5.4.0/x86_64-native-linuxapp-gcc-shared/d1f1def0ab3f48ecae99e77a82bbe165/dpdk/drivers/net/i40e/i40e_pf.c:1254:3: note: in expansion of macro ‘PMD_DRV_LOG’
   PMD_DRV_LOG(ERR, "VF %d tried to request %d queues.
   ^
/tmp/UB1604_K4.4.0_GCC5.4.0/x86_64-native-linuxapp-gcc-shared/d1f1def0ab3f48ecae99e77a82bbe165/dpdk/drivers/net/i40e/i40e_pf.c:1255:8: error: missing terminating " character
        Ignoring.\n", vf->vf_idx,
        ^
/tmp/UB1604_K4.4.0_GCC5.4.0/x86_64-native-linuxapp-gcc-shared/d1f1def0ab3f48ecae99e77a82bbe165/dpdk/drivers/net/i40e/i40e_logs.h:37:59: note: in definition of macro ‘PMD_DRV_LOG_RAW’
  rte_log(RTE_LOG_ ## level, i40e_logtype_driver, "%s(): " fmt, \
                                                           ^
/tmp/UB1604_K4.4.0_GCC5.4.0/x86_64-native-linuxapp-gcc-shared/d1f1def0ab3f48ecae99e77a82bbe165/dpdk/drivers/net/i40e/i40e_pf.c:1254:3: note: in expansion of macro ‘PMD_DRV_LOG’
   PMD_DRV_LOG(ERR, "VF %d tried to request %d queues.
   ^
/tmp/UB1604_K4.4.0_GCC5.4.0/x86_64-native-linuxapp-gcc-shared/d1f1def0ab3f48ecae99e77a82bbe165/dpdk/drivers/net/i40e/i40e_logs.h:37:50: warning: format ‘%s’ expects a matching ‘char *’ argument [-Wformat=]
  rte_log(RTE_LOG_ ## level, i40e_logtype_driver, "%s(): " fmt, \
                                                  ^
/tmp/UB1604_K4.4.0_GCC5.4.0/x86_64-native-linuxapp-gcc-shared/d1f1def0ab3f48ecae99e77a82bbe165/dpdk/drivers/net/i40e/i40e_logs.h:41:2: note: in expansion of macro ‘PMD_DRV_LOG_RAW’
  PMD_DRV_LOG_RAW(level, fmt "\n", ## args)
  ^
/tmp/UB1604_K4.4.0_GCC5.4.0/x86_64-native-linuxapp-gcc-shared/d1f1def0ab3f48ecae99e77a82bbe165/dpdk/drivers/net/i40e/i40e_pf.c:1254:3: note: in expansion of macro ‘PMD_DRV_LOG’
   PMD_DRV_LOG(ERR, "VF %d tried to request %d queues.
   ^
/tmp/UB1604_K4.4.0_GCC5.4.0/x86_64-native-linuxapp-gcc-shared/d1f1def0ab3f48ecae99e77a82bbe165/dpdk/drivers/net/i40e/i40e_pf.c:1258:20: warning: missing terminating " character
   PMD_DRV_LOG(ERR, "VF %d tried to request more than
                    ^
/tmp/UB1604_K4.4.0_GCC5.4.0/x86_64-native-linuxapp-gcc-shared/d1f1def0ab3f48ecae99e77a82bbe165/dpdk/drivers/net/i40e/i40e_pf.c:1259:20: warning: missing terminating " character
        %d queues.\n", vf->vf_idx,
                    ^
/tmp/UB1604_K4.4.0_GCC5.4.0/x86_64-native-linuxapp-gcc-shared/d1f1def0ab3f48ecae99e77a82bbe165/dpdk/drivers/net/i40e/i40e_pf.c:1258:3: error: missing terminating " character
   PMD_DRV_LOG(ERR, "VF %d tried to request more than
   ^
In file included from /tmp/UB1604_K4.4.0_GCC5.4.0/x86_64-native-linuxapp-gcc-shared/d1f1def0ab3f48ecae99e77a82bbe165/dpdk/drivers/net/i40e/i40e_pf.c:21:0:
/tmp/UB1604_K4.4.0_GCC5.4.0/x86_64-native-linuxapp-gcc-shared/d1f1def0ab3f48ecae99e77a82bbe165/dpdk/drivers/net/i40e/i40e_pf.c:1259:9: error: ‘d’ undeclared (first use in this function)
        %d queues.\n", vf->vf_idx,
         ^
/tmp/UB1604_K4.4.0_GCC5.4.0/x86_64-native-linuxapp-gcc-shared/d1f1def0ab3f48ecae99e77a82bbe165/dpdk/drivers/net/i40e/i40e_logs.h:37:59: note: in definition of macro ‘PMD_DRV_LOG_RAW’
  rte_log(RTE_LOG_ ## level, i40e_logtype_driver, "%s(): " fmt, \
                                                           ^
--
  rte_log(RTE_LOG_ ## level, i40e_logtype_driver, "%s(): " fmt, \
                                                           ^
/tmp/UB1604_K4.4.0_GCC5.4.0/x86_64-native-linuxapp-gcc-shared/d1f1def0ab3f48ecae99e77a82bbe165/dpdk/drivers/net/i40e/i40e_pf.c:1258:3: note: in expansion of macro ‘PMD_DRV_LOG’
   PMD_DRV_LOG(ERR, "VF %d tried to request more than
   ^
/tmp/UB1604_K4.4.0_GCC5.4.0/x86_64-native-linuxapp-gcc-shared/d1f1def0ab3f48ecae99e77a82bbe165/dpdk/drivers/net/i40e/i40e_pf.c:1259:11: error: expected ‘)’ before ‘queues’
        %d queues.\n", vf->vf_idx,
           ^
/tmp/UB1604_K4.4.0_GCC5.4.0/x86_64-native-linuxapp-gcc-shared/d1f1def0ab3f48ecae99e77a82bbe165/dpdk/drivers/net/i40e/i40e_logs.h:37:59: note: in definition of macro ‘PMD_DRV_LOG_RAW’
  rte_log(RTE_LOG_ ## level, i40e_logtype_driver, "%s(): " fmt, \
                                                           ^
/tmp/UB1604_K4.4.0_GCC5.4.0/x86_64-native-linuxapp-gcc-shared/d1f1def0ab3f48ecae99e77a82bbe165/dpdk/drivers/net/i40e/i40e_pf.c:1258:3: note: in expansion of macro ‘PMD_DRV_LOG’
   PMD_DRV_LOG(ERR, "VF %d tried to request more than
   ^
/tmp/UB1604_K4.4.0_GCC5.4.0/x86_64-native-linuxapp-gcc-shared/d1f1def0ab3f48ecae99e77a82bbe165/dpdk/drivers/net/i40e/i40e_pf.c:1259:11: error: stray ‘\’ in program
        %d queues.\n", vf->vf_idx,
           ^
/tmp/UB1604_K4.4.0_GCC5.4.0/x86_64-native-linuxapp-gcc-shared/d1f1def0ab3f48ecae99e77a82bbe165/dpdk/drivers/net/i40e/i40e_logs.h:37:59: note: in definition of macro ‘PMD_DRV_LOG_RAW’
  rte_log(RTE_LOG_ ## level, i40e_logtype_driver, "%s(): " fmt, \
                                                           ^
/tmp/UB1604_K4.4.0_GCC5.4.0/x86_64-native-linuxapp-gcc-shared/d1f1def0ab3f48ecae99e77a82bbe165/dpdk/drivers/net/i40e/i40e_pf.c:1258:3: note: in expansion of macro ‘PMD_DRV_LOG’
   PMD_DRV_LOG(ERR, "VF %d tried to request more than
   ^
/tmp/UB1604_K4.4.0_GCC5.4.0/x86_64-native-linuxapp-gcc-shared/d1f1def0ab3f48ecae99e77a82bbe165/dpdk/drivers/net/i40e/i40e_pf.c:1259:11: error: missing terminating " character
        %d queues.\n", vf->vf_idx,
           ^
/tmp/UB1604_K4.4.0_GCC5.4.0/x86_64-native-linuxapp-gcc-shared/d1f1def0ab3f48ecae99e77a82bbe165/dpdk/drivers/net/i40e/i40e_logs.h:37:59: note: in definition of macro ‘PMD_DRV_LOG_RAW’
  rte_log(RTE_LOG_ ## level, i40e_logtype_driver, "%s(): " fmt, \
                                                           ^
/tmp/UB1604_K4.4.0_GCC5.4.0/x86_64-native-linuxapp-gcc-shared/d1f1def0ab3f48ecae99e77a82bbe165/dpdk/drivers/net/i40e/i40e_pf.c:1258:3: note: in expansion of macro ‘PMD_DRV_LOG’
   PMD_DRV_LOG(ERR, "VF %d tried to request more than
   ^
/tmp/UB1604_K4.4.0_GCC5.4.0/x86_64-native-linuxapp-gcc-shared/d1f1def0ab3f48ecae99e77a82bbe165/dpdk/drivers/net/i40e/i40e_pf.c:1263:20: warning: missing terminating " character
   PMD_DRV_LOG(ERR, "VF %d requested %d more queues,
                    ^
/tmp/UB1604_K4.4.0_GCC5.4.0/x86_64-native-linuxapp-gcc-shared/d1f1def0ab3f48ecae99e77a82bbe165/dpdk/drivers/net/i40e/i40e_pf.c:1264:26: warning: missing terminating " character
        but noly %d left\n", vf->vf_idx,
                          ^
/tmp/UB1604_K4.4.0_GCC5.4.0/x86_64-native-linuxapp-gcc-shared/d1f1def0ab3f48ecae99e77a82bbe165/dpdk/drivers/net/i40e/i40e_pf.c:1263:3: error: missing terminating " character
   PMD_DRV_LOG(ERR, "VF %d requested %d more queues,
   ^
In file included from /tmp/UB1604_K4.4.0_GCC5.4.0/x86_64-native-linuxapp-gcc-shared/d1f1def0ab3f48ecae99e77a82bbe165/dpdk/drivers/net/i40e/i40e_pf.c:21:0:
/tmp/UB1604_K4.4.0_GCC5.4.0/x86_64-native-linuxapp-gcc-shared/d1f1def0ab3f48ecae99e77a82bbe165/dpdk/drivers/net/i40e/i40e_pf.c:1264:8: error: expected ‘)’ before ‘but’
        but noly %d left\n", vf->vf_idx,
        ^
/tmp/UB1604_K4.4.0_GCC5.4.0/x86_64-native-linuxapp-gcc-shared/d1f1def0ab3f48ecae99e77a82bbe165/dpdk/drivers/net/i40e/i40e_logs.h:37:59: note: in definition of macro ‘PMD_DRV_LOG_RAW’
  rte_log(RTE_LOG_ ## level, i40e_logtype_driver, "%s(): " fmt, \
                                                           ^
/tmp/UB1604_K4.4.0_GCC5.4.0/x86_64-native-linuxapp-gcc-shared/d1f1def0ab3f48ecae99e77a82bbe165/dpdk/drivers/net/i40e/i40e_pf.c:1263:3: note: in expansion of macro ‘PMD_DRV_LOG’
   PMD_DRV_LOG(ERR, "VF %d requested %d more queues,
   ^
/tmp/UB1604_K4.4.0_GCC5.4.0/x86_64-native-linuxapp-gcc-shared/d1f1def0ab3f48ecae99e77a82bbe165/dpdk/drivers/net/i40e/i40e_pf.c:1264:8: error: stray ‘\’ in program
        but noly %d left\n", vf->vf_idx,
        ^
/tmp/UB1604_K4.4.0_GCC5.4.0/x86_64-native-linuxapp-gcc-shared/d1f1def0ab3f48ecae99e77a82bbe165/dpdk/drivers/net/i40e/i40e_logs.h:37:59: note: in definition of macro ‘PMD_DRV_LOG_RAW’
  rte_log(RTE_LOG_ ## level, i40e_logtype_driver, "%s(): " fmt, \
                                                           ^
/tmp/UB1604_K4.4.0_GCC5.4.0/x86_64-native-linuxapp-gcc-shared/d1f1def0ab3f48ecae99e77a82bbe165/dpdk/drivers/net/i40e/i40e_pf.c:1263:3: note: in expansion of macro ‘PMD_DRV_LOG’
   PMD_DRV_LOG(ERR, "VF %d requested %d more queues,
   ^
/tmp/UB1604_K4.4.0_GCC5.4.0/x86_64-native-linuxapp-gcc-shared/d1f1def0ab3f48ecae99e77a82bbe165/dpdk/drivers/net/i40e/i40e_pf.c:1264:8: error: missing terminating " character
        but noly %d left\n", vf->vf_idx,
        ^
/tmp/UB1604_K4.4.0_GCC5.4.0/x86_64-native-linuxapp-gcc-shared/d1f1def0ab3f48ecae99e77a82bbe165/dpdk/drivers/net/i40e/i40e_logs.h:37:59: note: in definition of macro ‘PMD_DRV_LOG_RAW’
  rte_log(RTE_LOG_ ## level, i40e_logtype_driver, "%s(): " fmt, \
                                                           ^
/tmp/UB1604_K4.4.0_GCC5.4.0/x86_64-native-linuxapp-gcc-shared/d1f1def0ab3f48ecae99e77a82bbe165/dpdk/drivers/net/i40e/i40e_pf.c:1263:3: note: in expansion of macro ‘PMD_DRV_LOG’
   PMD_DRV_LOG(ERR, "VF %d requested %d more queues,
   ^
/tmp/UB1604_K4.4.0_GCC5.4.0/x86_64-native-linuxapp-gcc-shared/d1f1def0ab3f48ecae99e77a82bbe165/dpdk/drivers/net/i40e/i40e_logs.h:37:50: warning: format ‘%s’ expects a matching ‘char *’ argument [-Wformat=]
  rte_log(RTE_LOG_ ## level, i40e_logtype_driver, "%s(): " fmt, \
                                                  ^
/tmp/UB1604_K4.4.0_GCC5.4.0/x86_64-native-linuxapp-gcc-shared/d1f1def0ab3f48ecae99e77a82bbe165/dpdk/drivers/net/i40e/i40e_logs.h:41:2: note: in expansion of macro ‘PMD_DRV_LOG_RAW’
  PMD_DRV_LOG_RAW(level, fmt "\n", ## args)
  ^
/tmp/UB1604_K4.4.0_GCC5.4.0/x86_64-native-linuxapp-gcc-shared/d1f1def0ab3f48ecae99e77a82bbe165/dpdk/drivers/net/i40e/i40e_pf.c:1263:3: note: in expansion of macro ‘PMD_DRV_LOG’
   PMD_DRV_LOG(ERR, "VF %d requested %d more queues,
   ^
/tmp/UB1604_K4.4.0_GCC5.4.0/x86_64-native-linuxapp-gcc-shared/d1f1def0ab3f48ecae99e77a82bbe165/dpdk/mk/internal/rte.compile-pre.mk:114: recipe for target 'i40e_pf.o' failed
make[6]: *** [i40e_pf.o] Error 1
/tmp/UB1604_K4.4.0_GCC5.4.0/x86_64-native-linuxapp-gcc-shared/d1f1def0ab3f48ecae99e77a82bbe165/dpdk/mk/rte.subdir.mk:35: recipe for target 'i40e' failed
make[5]: *** [i40e] Error 2
make[5]: *** Waiting for unfinished jobs....
  CC ixgbe_rxtx_vec_sse.o
  CC ixgbe_ipsec.o
  CC rte_pmd_ixgbe.o
  CC ixgbe_tm.o
  CC ixgbe_vf_representor.o
  LD librte_pmd_ixgbe.so.2.1
  INSTALL-LIB librte_pmd_ixgbe.so.2.1
/tmp/UB1604_K4.4.0_GCC5.4.0/x86_64-native-linuxapp-gcc-shared/d1f1def0ab3f48ecae99e77a82bbe165/dpdk/mk/rte.subdir.mk:35: recipe for target 'net' failed
make[4]: *** [net] Error 2
/tmp/UB1604_K4.4.0_GCC5.4.0/x86_64-native-linuxapp-gcc-shared/d1f1def0ab3f48ecae99e77a82bbe165/dpdk/mk/rte.sdkbuild.mk:49: recipe for target 'drivers' failed
make[3]: *** [drivers] Error 2
/tmp/UB1604_K4.4.0_GCC5.4.0/x86_64-native-linuxapp-gcc-shared/d1f1def0ab3f48ecae99e77a82bbe165/dpdk/mk/rte.sdkroot.mk:100: recipe for target 'all' failed
make[2]: *** [all] Error 2
/tmp/UB1604_K4.4.0_GCC5.4.0/x86_64-native-linuxapp-gcc-shared/d1f1def0ab3f48ecae99e77a82bbe165/dpdk/mk/rte.sdkinstall.mk:57: recipe for target 'pre_install' failed
make[1]: *** [pre_install] Error 2
/tmp/UB1604_K4.4.0_GCC5.4.0/x86_64-native-linuxapp-gcc-shared/d1f1def0ab3f48ecae99e77a82bbe165/dpdk/mk/rte.sdkroot.mk:79: recipe for target 'install' failed
make: *** [install] Error 2

*Failed Build #10:
OS: FreeBSD
Target: x86_64-native-bsdapp-clang
machine -> /usr/src/sys/amd64/include
x86 -> /usr/src/sys/x86/include
awk -f @/tools/makeobjops.awk @/kern/device_if.m -h
== Build drivers
awk -f @/tools/makeobjops.awk @/kern/bus_if.m -h
cc -Winline -Wall -Werror -include /tmp/FreeBSD_K10.3_GCC4.8.5/x86_64-native-bsdapp-clang/d1f1def0ab3f48ecae99e77a82bbe165/dpdk/x86_64-native-bsdapp-clang/include/rte_config.h  -Werror -D_KERNEL -DKLD_MODULE -nostdinc  -I/tmp/FreeBSD_K10.3_GCC4.8.5/x86_64-native-bsdapp-clang/d1f1def0ab3f48ecae99e77a82bbe165/dpdk/kernel/freebsd/contigmem -I/tmp/FreeBSD_K10.3_GCC4.8.5/x86_64-native-bsdapp-clang/d1f1def0ab3f48ecae99e77a82bbe165/dpdk/x86_64-native-bsdapp-clang/include -I. -I@ -I@/contrib/altq -fno-common  -fno-omit-frame-pointer -mno-omit-leaf-frame-pointer  -mno-aes -mno-avx -mcmodel=kernel -mno-red-zone -mno-mmx -mno-sse -msoft-float  -fno-asynchronous-unwind-tables -ffreestanding -fstack-protector -std=iso9899:1999 -Qunused-arguments  -fstack-protector -Wall -Wredundant-decls -Wnested-externs -Wstrict-prototypes  -Wmissing-prototypes -Wpointer-arith -Winline -Wcast-qual  -Wundef -Wno-pointer-sign -fformat-extensions  -Wmissing-include-dirs -fdiagnostics-show-option  -Wno-error-tautological-compare -Wno-error-empty-body  -Wno-error-parentheses-equality -Wno-error-unused-function    -c contigmem.c -o contigmem.o
== Build drivers/common
ld      -L/tmp/FreeBSD_K10.3_GCC4.8.5/x86_64-native-bsdapp-clang/d1f1def0ab3f48ecae99e77a82bbe165/dpdk/x86_64-native-bsdapp-clang/lib -d -warn-common -r -d -o contigmem.ko contigmem.o
:> export_syms
awk -f /sys/conf/kmod_syms.awk contigmem.ko  export_syms | xargs -J% objcopy % contigmem.ko
objcopy --strip-debug contigmem.ko
--
x86 -> /usr/src/sys/x86/include
awk -f @/tools/makeobjops.awk @/kern/device_if.m -h
== Build drivers/common/octeontx
awk -f @/tools/makeobjops.awk @/kern/bus_if.m -h
awk -f @/tools/makeobjops.awk @/dev/pci/pci_if.m -h
cc -Winline -Wall -Werror -include /tmp/FreeBSD_K10.3_GCC4.8.5/x86_64-native-bsdapp-clang/d1f1def0ab3f48ecae99e77a82bbe165/dpdk/x86_64-native-bsdapp-clang/include/rte_config.h  -Werror -D_KERNEL -DKLD_MODULE -nostdinc  -I/tmp/FreeBSD_K10.3_GCC4.8.5/x86_64-native-bsdapp-clang/d1f1def0ab3f48ecae99e77a82bbe165/dpdk/kernel/freebsd/nic_uio -I/tmp/FreeBSD_K10.3_GCC4.8.5/x86_64-native-bsdapp-clang/d1f1def0ab3f48ecae99e77a82bbe165/dpdk/x86_64-native-bsdapp-clang/include -I. -I@ -I@/contrib/altq -fno-common  -fno-omit-frame-pointer -mno-omit-leaf-frame-pointer  -mno-aes -mno-avx -mcmodel=kernel -mno-red-zone -mno-mmx -mno-sse -msoft-float  -fno-asynchronous-unwind-tables -ffreestanding -fstack-protector -std=iso9899:1999 -Qunused-arguments  -fstack-protector -Wall -Wredundant-decls -Wnested-externs -Wstrict-prototypes  -Wmissing-prototypes -Wpointer-arith -Winline -Wcast-qual  -Wundef -Wno-pointer-sign -fformat-extensions  -Wmissing-include-dirs -fdiagnostics-show-option  -Wno-error-tautological-compare -Wno-error-empty-body  -Wno-error-parentheses-equality -Wno-error-unused-function    -c nic_uio.c -o nic_uio.o
  CC octeontx_mbox.o
ld      -L/tmp/FreeBSD_K10.3_GCC4.8.5/x86_64-native-bsdapp-clang/d1f1def0ab3f48ecae99e77a82bbe165/dpdk/x86_64-native-bsdapp-clang/lib -d -warn-common -r -d -o nic_uio.ko nic_uio.o
:> export_syms
awk -f /sys/conf/kmod_syms.awk nic_uio.ko  export_syms | xargs -J% objcopy % nic_uio.ko
  AR librte_common_octeontx.a
--
  PMDINFO i40e_ethdev_vf.o.pmd.c
  CC i40e_ethdev_vf.o.pmd.o
  LD i40e_ethdev_vf.o
  CC i40e_fdir.o
  CC i40e_flow.o
/tmp/FreeBSD_K10.3_GCC4.8.5/x86_64-native-bsdapp-clang/d1f1def0ab3f48ecae99e77a82bbe165/dpdk/drivers/net/i40e/i40e_pf.c:1254:20: warning: missing terminating '"' character [-Winvalid-pp-token]
                PMD_DRV_LOG(ERR, "VF %d tried to request %d queues.
                                 ^
/tmp/FreeBSD_K10.3_GCC4.8.5/x86_64-native-bsdapp-clang/d1f1def0ab3f48ecae99e77a82bbe165/dpdk/drivers/net/i40e/i40e_pf.c:1255:19: warning: missing terminating '"' character [-Winvalid-pp-token]
                            Ignoring.\n", vf->vf_idx,
                                       ^
/tmp/FreeBSD_K10.3_GCC4.8.5/x86_64-native-bsdapp-clang/d1f1def0ab3f48ecae99e77a82bbe165/dpdk/drivers/net/i40e/i40e_pf.c:1254:20: error: expected ')'
                PMD_DRV_LOG(ERR, "VF %d tried to request %d queues.
                                 ^
/tmp/FreeBSD_K10.3_GCC4.8.5/x86_64-native-bsdapp-clang/d1f1def0ab3f48ecae99e77a82bbe165/dpdk/drivers/net/i40e/i40e_logs.h:41:25: note: expanded from macro 'PMD_DRV_LOG'
        PMD_DRV_LOG_RAW(level, fmt "\n", ## args)
                               ^
--
        PMD_DRV_LOG_RAW(level, fmt "\n", ## args)
        ^
/tmp/FreeBSD_K10.3_GCC4.8.5/x86_64-native-bsdapp-clang/d1f1def0ab3f48ecae99e77a82bbe165/dpdk/drivers/net/i40e/i40e_logs.h:37:9: note: expanded from macro 'PMD_DRV_LOG_RAW'
        rte_log(RTE_LOG_ ## level, i40e_logtype_driver, "%s(): " fmt, \
               ^
/tmp/FreeBSD_K10.3_GCC4.8.5/x86_64-native-bsdapp-clang/d1f1def0ab3f48ecae99e77a82bbe165/dpdk/drivers/net/i40e/i40e_pf.c:1258:20: warning: missing terminating '"' character [-Winvalid-pp-token]
                PMD_DRV_LOG(ERR, "VF %d tried to request more than
                                 ^
/tmp/FreeBSD_K10.3_GCC4.8.5/x86_64-native-bsdapp-clang/d1f1def0ab3f48ecae99e77a82bbe165/dpdk/drivers/net/i40e/i40e_pf.c:1259:20: warning: missing terminating '"' character [-Winvalid-pp-token]
                            %d queues.\n", vf->vf_idx,
                                        ^
/tmp/FreeBSD_K10.3_GCC4.8.5/x86_64-native-bsdapp-clang/d1f1def0ab3f48ecae99e77a82bbe165/dpdk/drivers/net/i40e/i40e_pf.c:1258:20: error: expected ')'
                PMD_DRV_LOG(ERR, "VF %d tried to request more than
                                 ^
/tmp/FreeBSD_K10.3_GCC4.8.5/x86_64-native-bsdapp-clang/d1f1def0ab3f48ecae99e77a82bbe165/dpdk/drivers/net/i40e/i40e_logs.h:41:25: note: expanded from macro 'PMD_DRV_LOG'
        PMD_DRV_LOG_RAW(level, fmt "\n", ## args)
                               ^
--
        PMD_DRV_LOG_RAW(level, fmt "\n", ## args)
        ^
/tmp/FreeBSD_K10.3_GCC4.8.5/x86_64-native-bsdapp-clang/d1f1def0ab3f48ecae99e77a82bbe165/dpdk/drivers/net/i40e/i40e_logs.h:37:9: note: expanded from macro 'PMD_DRV_LOG_RAW'
        rte_log(RTE_LOG_ ## level, i40e_logtype_driver, "%s(): " fmt, \
               ^
/tmp/FreeBSD_K10.3_GCC4.8.5/x86_64-native-bsdapp-clang/d1f1def0ab3f48ecae99e77a82bbe165/dpdk/drivers/net/i40e/i40e_pf.c:1263:20: warning: missing terminating '"' character [-Winvalid-pp-token]
                PMD_DRV_LOG(ERR, "VF %d requested %d more queues,
                                 ^
/tmp/FreeBSD_K10.3_GCC4.8.5/x86_64-native-bsdapp-clang/d1f1def0ab3f48ecae99e77a82bbe165/dpdk/drivers/net/i40e/i40e_pf.c:1264:26: warning: missing terminating '"' character [-Winvalid-pp-token]
                            but noly %d left\n", vf->vf_idx,
                                              ^
/tmp/FreeBSD_K10.3_GCC4.8.5/x86_64-native-bsdapp-clang/d1f1def0ab3f48ecae99e77a82bbe165/dpdk/drivers/net/i40e/i40e_pf.c:1263:20: error: expected ')'
                PMD_DRV_LOG(ERR, "VF %d requested %d more queues,
                                 ^
/tmp/FreeBSD_K10.3_GCC4.8.5/x86_64-native-bsdapp-clang/d1f1def0ab3f48ecae99e77a82bbe165/dpdk/drivers/net/i40e/i40e_logs.h:41:25: note: expanded from macro 'PMD_DRV_LOG'
        PMD_DRV_LOG_RAW(level, fmt "\n", ## args)
                               ^
--
        PMD_DRV_LOG_RAW(level, fmt "\n", ## args)
        ^
/tmp/FreeBSD_K10.3_GCC4.8.5/x86_64-native-bsdapp-clang/d1f1def0ab3f48ecae99e77a82bbe165/dpdk/drivers/net/i40e/i40e_logs.h:37:9: note: expanded from macro 'PMD_DRV_LOG_RAW'
        rte_log(RTE_LOG_ ## level, i40e_logtype_driver, "%s(): " fmt, \
               ^
6 warnings and 3 errors generated.
gmake[6]: *** [/tmp/FreeBSD_K10.3_GCC4.8.5/x86_64-native-bsdapp-clang/d1f1def0ab3f48ecae99e77a82bbe165/dpdk/mk/internal/rte.compile-pre.mk:116: i40e_pf.o] Error 1
gmake[6]: *** Waiting for unfinished jobs....
== Build drivers/net/ixgbe
  SYMLINK-FILE include/rte_pmd_ixgbe.h
  CC ixgbe_common.o

*Failed Build #11:
OS: FC25
Target: x86_64-native-linuxapp-gcc-debug
  PMDINFO i40e_ethdev_vf.o.pmd.c
  CC i40e_ethdev_vf.o.pmd.o
  LD i40e_ethdev_vf.o
  CC i40e_pf.o
/tmp/FC25_K4.8.6_GCC6.3.1/x86_64-native-linuxapp-gcc-debug/d1f1def0ab3f48ecae99e77a82bbe165/dpdk/drivers/net/i40e/i40e_pf.c: In function ‘i40e_pf_host_process_cmd_request_queues’:
/tmp/FC25_K4.8.6_GCC6.3.1/x86_64-native-linuxapp-gcc-debug/d1f1def0ab3f48ecae99e77a82bbe165/dpdk/drivers/net/i40e/i40e_pf.c:1254:20: warning: missing terminating " character
   PMD_DRV_LOG(ERR, "VF %d tried to request %d queues.
                    ^
/tmp/FC25_K4.8.6_GCC6.3.1/x86_64-native-linuxapp-gcc-debug/d1f1def0ab3f48ecae99e77a82bbe165/dpdk/drivers/net/i40e/i40e_pf.c:1255:19: warning: missing terminating " character
        Ignoring.\n", vf->vf_idx,
                   ^
In file included from /tmp/FC25_K4.8.6_GCC6.3.1/x86_64-native-linuxapp-gcc-debug/d1f1def0ab3f48ecae99e77a82bbe165/dpdk/drivers/net/i40e/i40e_pf.c:21:0:
/tmp/FC25_K4.8.6_GCC6.3.1/x86_64-native-linuxapp-gcc-debug/d1f1def0ab3f48ecae99e77a82bbe165/dpdk/drivers/net/i40e/i40e_pf.c:1254:20: error: missing terminating " character
   PMD_DRV_LOG(ERR, "VF %d tried to request %d queues.
                    ^
/tmp/FC25_K4.8.6_GCC6.3.1/x86_64-native-linuxapp-gcc-debug/d1f1def0ab3f48ecae99e77a82bbe165/dpdk/drivers/net/i40e/i40e_logs.h:37:59: note: in definition of macro ‘PMD_DRV_LOG_RAW’
  rte_log(RTE_LOG_ ## level, i40e_logtype_driver, "%s(): " fmt, \
                                                           ^~~
/tmp/FC25_K4.8.6_GCC6.3.1/x86_64-native-linuxapp-gcc-debug/d1f1def0ab3f48ecae99e77a82bbe165/dpdk/drivers/net/i40e/i40e_pf.c:1254:3: note: in expansion of macro ‘PMD_DRV_LOG’
   PMD_DRV_LOG(ERR, "VF %d tried to request %d queues.
   ^~~~~~~~~~~
/tmp/FC25_K4.8.6_GCC6.3.1/x86_64-native-linuxapp-gcc-debug/d1f1def0ab3f48ecae99e77a82bbe165/dpdk/drivers/net/i40e/i40e_pf.c:1255:8: error: expected ‘)’ before ‘Ignoring’
        Ignoring.\n", vf->vf_idx,
        ^
/tmp/FC25_K4.8.6_GCC6.3.1/x86_64-native-linuxapp-gcc-debug/d1f1def0ab3f48ecae99e77a82bbe165/dpdk/drivers/net/i40e/i40e_logs.h:37:59: note: in definition of macro ‘PMD_DRV_LOG_RAW’
  rte_log(RTE_LOG_ ## level, i40e_logtype_driver, "%s(): " fmt, \
                                                           ^~~
/tmp/FC25_K4.8.6_GCC6.3.1/x86_64-native-linuxapp-gcc-debug/d1f1def0ab3f48ecae99e77a82bbe165/dpdk/drivers/net/i40e/i40e_pf.c:1254:3: note: in expansion of macro ‘PMD_DRV_LOG’
   PMD_DRV_LOG(ERR, "VF %d tried to request %d queues.
   ^~~~~~~~~~~
/tmp/FC25_K4.8.6_GCC6.3.1/x86_64-native-linuxapp-gcc-debug/d1f1def0ab3f48ecae99e77a82bbe165/dpdk/drivers/net/i40e/i40e_pf.c:1255:17: error: stray ‘\’ in program
        Ignoring.\n", vf->vf_idx,
                 ^
/tmp/FC25_K4.8.6_GCC6.3.1/x86_64-native-linuxapp-gcc-debug/d1f1def0ab3f48ecae99e77a82bbe165/dpdk/drivers/net/i40e/i40e_logs.h:37:59: note: in definition of macro ‘PMD_DRV_LOG_RAW’
  rte_log(RTE_LOG_ ## level, i40e_logtype_driver, "%s(): " fmt, \
                                                           ^~~
/tmp/FC25_K4.8.6_GCC6.3.1/x86_64-native-linuxapp-gcc-debug/d1f1def0ab3f48ecae99e77a82bbe165/dpdk/drivers/net/i40e/i40e_pf.c:1254:3: note: in expansion of macro ‘PMD_DRV_LOG’
   PMD_DRV_LOG(ERR, "VF %d tried to request %d queues.
   ^~~~~~~~~~~
/tmp/FC25_K4.8.6_GCC6.3.1/x86_64-native-linuxapp-gcc-debug/d1f1def0ab3f48ecae99e77a82bbe165/dpdk/drivers/net/i40e/i40e_pf.c:1255:19: error: missing terminating " character
        Ignoring.\n", vf->vf_idx,
                   ^
/tmp/FC25_K4.8.6_GCC6.3.1/x86_64-native-linuxapp-gcc-debug/d1f1def0ab3f48ecae99e77a82bbe165/dpdk/drivers/net/i40e/i40e_logs.h:37:59: note: in definition of macro ‘PMD_DRV_LOG_RAW’
  rte_log(RTE_LOG_ ## level, i40e_logtype_driver, "%s(): " fmt, \
                                                           ^~~
/tmp/FC25_K4.8.6_GCC6.3.1/x86_64-native-linuxapp-gcc-debug/d1f1def0ab3f48ecae99e77a82bbe165/dpdk/drivers/net/i40e/i40e_pf.c:1254:3: note: in expansion of macro ‘PMD_DRV_LOG’
   PMD_DRV_LOG(ERR, "VF %d tried to request %d queues.
   ^~~~~~~~~~~
/tmp/FC25_K4.8.6_GCC6.3.1/x86_64-native-linuxapp-gcc-debug/d1f1def0ab3f48ecae99e77a82bbe165/dpdk/drivers/net/i40e/i40e_logs.h:37:50: warning: format ‘%s’ expects a matching ‘char *’ argument [-Wformat=]
  rte_log(RTE_LOG_ ## level, i40e_logtype_driver, "%s(): " fmt, \
                                                  ^
/tmp/FC25_K4.8.6_GCC6.3.1/x86_64-native-linuxapp-gcc-debug/d1f1def0ab3f48ecae99e77a82bbe165/dpdk/drivers/net/i40e/i40e_logs.h:41:2: note: in expansion of macro ‘PMD_DRV_LOG_RAW’
  PMD_DRV_LOG_RAW(level, fmt "\n", ## args)
  ^~~~~~~~~~~~~~~
/tmp/FC25_K4.8.6_GCC6.3.1/x86_64-native-linuxapp-gcc-debug/d1f1def0ab3f48ecae99e77a82bbe165/dpdk/drivers/net/i40e/i40e_pf.c:1254:3: note: in expansion of macro ‘PMD_DRV_LOG’
   PMD_DRV_LOG(ERR, "VF %d tried to request %d queues.
   ^~~~~~~~~~~
/tmp/FC25_K4.8.6_GCC6.3.1/x86_64-native-linuxapp-gcc-debug/d1f1def0ab3f48ecae99e77a82bbe165/dpdk/drivers/net/i40e/i40e_pf.c:1258:20: warning: missing terminating " character
   PMD_DRV_LOG(ERR, "VF %d tried to request more than
                    ^
/tmp/FC25_K4.8.6_GCC6.3.1/x86_64-native-linuxapp-gcc-debug/d1f1def0ab3f48ecae99e77a82bbe165/dpdk/drivers/net/i40e/i40e_pf.c:1259:20: warning: missing terminating " character
        %d queues.\n", vf->vf_idx,
                    ^
In file included from /tmp/FC25_K4.8.6_GCC6.3.1/x86_64-native-linuxapp-gcc-debug/d1f1def0ab3f48ecae99e77a82bbe165/dpdk/drivers/net/i40e/i40e_pf.c:21:0:
/tmp/FC25_K4.8.6_GCC6.3.1/x86_64-native-linuxapp-gcc-debug/d1f1def0ab3f48ecae99e77a82bbe165/dpdk/drivers/net/i40e/i40e_pf.c:1258:20: error: missing terminating " character
   PMD_DRV_LOG(ERR, "VF %d tried to request more than
                    ^
/tmp/FC25_K4.8.6_GCC6.3.1/x86_64-native-linuxapp-gcc-debug/d1f1def0ab3f48ecae99e77a82bbe165/dpdk/drivers/net/i40e/i40e_logs.h:37:59: note: in definition of macro ‘PMD_DRV_LOG_RAW’
  rte_log(RTE_LOG_ ## level, i40e_logtype_driver, "%s(): " fmt, \
                                                           ^~~
/tmp/FC25_K4.8.6_GCC6.3.1/x86_64-native-linuxapp-gcc-debug/d1f1def0ab3f48ecae99e77a82bbe165/dpdk/drivers/net/i40e/i40e_pf.c:1258:3: note: in expansion of macro ‘PMD_DRV_LOG’
   PMD_DRV_LOG(ERR, "VF %d tried to request more than
   ^~~~~~~~~~~
/tmp/FC25_K4.8.6_GCC6.3.1/x86_64-native-linuxapp-gcc-debug/d1f1def0ab3f48ecae99e77a82bbe165/dpdk/drivers/net/i40e/i40e_pf.c:1259:9: error: ‘d’ undeclared (first use in this function)
        %d queues.\n", vf->vf_idx,
         ^
/tmp/FC25_K4.8.6_GCC6.3.1/x86_64-native-linuxapp-gcc-debug/d1f1def0ab3f48ecae99e77a82bbe165/dpdk/drivers/net/i40e/i40e_logs.h:37:59: note: in definition of macro ‘PMD_DRV_LOG_RAW’
  rte_log(RTE_LOG_ ## level, i40e_logtype_driver, "%s(): " fmt, \
                                                           ^~~
--
  rte_log(RTE_LOG_ ## level, i40e_logtype_driver, "%s(): " fmt, \
                                                           ^~~
/tmp/FC25_K4.8.6_GCC6.3.1/x86_64-native-linuxapp-gcc-debug/d1f1def0ab3f48ecae99e77a82bbe165/dpdk/drivers/net/i40e/i40e_pf.c:1258:3: note: in expansion of macro ‘PMD_DRV_LOG’
   PMD_DRV_LOG(ERR, "VF %d tried to request more than
   ^~~~~~~~~~~
/tmp/FC25_K4.8.6_GCC6.3.1/x86_64-native-linuxapp-gcc-debug/d1f1def0ab3f48ecae99e77a82bbe165/dpdk/drivers/net/i40e/i40e_pf.c:1259:11: error: expected ‘)’ before ‘queues’
        %d queues.\n", vf->vf_idx,
           ^
/tmp/FC25_K4.8.6_GCC6.3.1/x86_64-native-linuxapp-gcc-debug/d1f1def0ab3f48ecae99e77a82bbe165/dpdk/drivers/net/i40e/i40e_logs.h:37:59: note: in definition of macro ‘PMD_DRV_LOG_RAW’
  rte_log(RTE_LOG_ ## level, i40e_logtype_driver, "%s(): " fmt, \
                                                           ^~~
/tmp/FC25_K4.8.6_GCC6.3.1/x86_64-native-linuxapp-gcc-debug/d1f1def0ab3f48ecae99e77a82bbe165/dpdk/drivers/net/i40e/i40e_pf.c:1258:3: note: in expansion of macro ‘PMD_DRV_LOG’
   PMD_DRV_LOG(ERR, "VF %d tried to request more than
   ^~~~~~~~~~~
/tmp/FC25_K4.8.6_GCC6.3.1/x86_64-native-linuxapp-gcc-debug/d1f1def0ab3f48ecae99e77a82bbe165/dpdk/drivers/net/i40e/i40e_pf.c:1259:18: error: stray ‘\’ in program
        %d queues.\n", vf->vf_idx,
                  ^
/tmp/FC25_K4.8.6_GCC6.3.1/x86_64-native-linuxapp-gcc-debug/d1f1def0ab3f48ecae99e77a82bbe165/dpdk/drivers/net/i40e/i40e_logs.h:37:59: note: in definition of macro ‘PMD_DRV_LOG_RAW’
  rte_log(RTE_LOG_ ## level, i40e_logtype_driver, "%s(): " fmt, \
                                                           ^~~
/tmp/FC25_K4.8.6_GCC6.3.1/x86_64-native-linuxapp-gcc-debug/d1f1def0ab3f48ecae99e77a82bbe165/dpdk/drivers/net/i40e/i40e_pf.c:1258:3: note: in expansion of macro ‘PMD_DRV_LOG’
   PMD_DRV_LOG(ERR, "VF %d tried to request more than
   ^~~~~~~~~~~
/tmp/FC25_K4.8.6_GCC6.3.1/x86_64-native-linuxapp-gcc-debug/d1f1def0ab3f48ecae99e77a82bbe165/dpdk/drivers/net/i40e/i40e_pf.c:1259:20: error: missing terminating " character
        %d queues.\n", vf->vf_idx,
                    ^
/tmp/FC25_K4.8.6_GCC6.3.1/x86_64-native-linuxapp-gcc-debug/d1f1def0ab3f48ecae99e77a82bbe165/dpdk/drivers/net/i40e/i40e_logs.h:37:59: note: in definition of macro ‘PMD_DRV_LOG_RAW’
  rte_log(RTE_LOG_ ## level, i40e_logtype_driver, "%s(): " fmt, \
                                                           ^~~
/tmp/FC25_K4.8.6_GCC6.3.1/x86_64-native-linuxapp-gcc-debug/d1f1def0ab3f48ecae99e77a82bbe165/dpdk/drivers/net/i40e/i40e_pf.c:1258:3: note: in expansion of macro ‘PMD_DRV_LOG’
   PMD_DRV_LOG(ERR, "VF %d tried to request more than
   ^~~~~~~~~~~
/tmp/FC25_K4.8.6_GCC6.3.1/x86_64-native-linuxapp-gcc-debug/d1f1def0ab3f48ecae99e77a82bbe165/dpdk/drivers/net/i40e/i40e_pf.c:1263:20: warning: missing terminating " character
   PMD_DRV_LOG(ERR, "VF %d requested %d more queues,
                    ^
/tmp/FC25_K4.8.6_GCC6.3.1/x86_64-native-linuxapp-gcc-debug/d1f1def0ab3f48ecae99e77a82bbe165/dpdk/drivers/net/i40e/i40e_pf.c:1264:26: warning: missing terminating " character
        but noly %d left\n", vf->vf_idx,
                          ^
In file included from /tmp/FC25_K4.8.6_GCC6.3.1/x86_64-native-linuxapp-gcc-debug/d1f1def0ab3f48ecae99e77a82bbe165/dpdk/drivers/net/i40e/i40e_pf.c:21:0:
/tmp/FC25_K4.8.6_GCC6.3.1/x86_64-native-linuxapp-gcc-debug/d1f1def0ab3f48ecae99e77a82bbe165/dpdk/drivers/net/i40e/i40e_pf.c:1263:20: error: missing terminating " character
   PMD_DRV_LOG(ERR, "VF %d requested %d more queues,
                    ^
/tmp/FC25_K4.8.6_GCC6.3.1/x86_64-native-linuxapp-gcc-debug/d1f1def0ab3f48ecae99e77a82bbe165/dpdk/drivers/net/i40e/i40e_logs.h:37:59: note: in definition of macro ‘PMD_DRV_LOG_RAW’
  rte_log(RTE_LOG_ ## level, i40e_logtype_driver, "%s(): " fmt, \
                                                           ^~~
/tmp/FC25_K4.8.6_GCC6.3.1/x86_64-native-linuxapp-gcc-debug/d1f1def0ab3f48ecae99e77a82bbe165/dpdk/drivers/net/i40e/i40e_pf.c:1263:3: note: in expansion of macro ‘PMD_DRV_LOG’
   PMD_DRV_LOG(ERR, "VF %d requested %d more queues,
   ^~~~~~~~~~~
/tmp/FC25_K4.8.6_GCC6.3.1/x86_64-native-linuxapp-gcc-debug/d1f1def0ab3f48ecae99e77a82bbe165/dpdk/drivers/net/i40e/i40e_pf.c:1264:8: error: expected ‘)’ before ‘but’
        but noly %d left\n", vf->vf_idx,
        ^
/tmp/FC25_K4.8.6_GCC6.3.1/x86_64-native-linuxapp-gcc-debug/d1f1def0ab3f48ecae99e77a82bbe165/dpdk/drivers/net/i40e/i40e_logs.h:37:59: note: in definition of macro ‘PMD_DRV_LOG_RAW’
  rte_log(RTE_LOG_ ## level, i40e_logtype_driver, "%s(): " fmt, \
                                                           ^~~
/tmp/FC25_K4.8.6_GCC6.3.1/x86_64-native-linuxapp-gcc-debug/d1f1def0ab3f48ecae99e77a82bbe165/dpdk/drivers/net/i40e/i40e_pf.c:1263:3: note: in expansion of macro ‘PMD_DRV_LOG’
   PMD_DRV_LOG(ERR, "VF %d requested %d more queues,
   ^~~~~~~~~~~
/tmp/FC25_K4.8.6_GCC6.3.1/x86_64-native-linuxapp-gcc-debug/d1f1def0ab3f48ecae99e77a82bbe165/dpdk/drivers/net/i40e/i40e_pf.c:1264:24: error: stray ‘\’ in program
        but noly %d left\n", vf->vf_idx,
                        ^
/tmp/FC25_K4.8.6_GCC6.3.1/x86_64-native-linuxapp-gcc-debug/d1f1def0ab3f48ecae99e77a82bbe165/dpdk/drivers/net/i40e/i40e_logs.h:37:59: note: in definition of macro ‘PMD_DRV_LOG_RAW’
  rte_log(RTE_LOG_ ## level, i40e_logtype_driver, "%s(): " fmt, \
                                                           ^~~
/tmp/FC25_K4.8.6_GCC6.3.1/x86_64-native-linuxapp-gcc-debug/d1f1def0ab3f48ecae99e77a82bbe165/dpdk/drivers/net/i40e/i40e_pf.c:1263:3: note: in expansion of macro ‘PMD_DRV_LOG’
   PMD_DRV_LOG(ERR, "VF %d requested %d more queues,
   ^~~~~~~~~~~
/tmp/FC25_K4.8.6_GCC6.3.1/x86_64-native-linuxapp-gcc-debug/d1f1def0ab3f48ecae99e77a82bbe165/dpdk/drivers/net/i40e/i40e_pf.c:1264:26: error: missing terminating " character
        but noly %d left\n", vf->vf_idx,
                          ^
/tmp/FC25_K4.8.6_GCC6.3.1/x86_64-native-linuxapp-gcc-debug/d1f1def0ab3f48ecae99e77a82bbe165/dpdk/drivers/net/i40e/i40e_logs.h:37:59: note: in definition of macro ‘PMD_DRV_LOG_RAW’
  rte_log(RTE_LOG_ ## level, i40e_logtype_driver, "%s(): " fmt, \
                                                           ^~~
/tmp/FC25_K4.8.6_GCC6.3.1/x86_64-native-linuxapp-gcc-debug/d1f1def0ab3f48ecae99e77a82bbe165/dpdk/drivers/net/i40e/i40e_pf.c:1263:3: note: in expansion of macro ‘PMD_DRV_LOG’
   PMD_DRV_LOG(ERR, "VF %d requested %d more queues,
   ^~~~~~~~~~~
/tmp/FC25_K4.8.6_GCC6.3.1/x86_64-native-linuxapp-gcc-debug/d1f1def0ab3f48ecae99e77a82bbe165/dpdk/drivers/net/i40e/i40e_logs.h:37:50: warning: format ‘%s’ expects a matching ‘char *’ argument [-Wformat=]
  rte_log(RTE_LOG_ ## level, i40e_logtype_driver, "%s(): " fmt, \
                                                  ^
/tmp/FC25_K4.8.6_GCC6.3.1/x86_64-native-linuxapp-gcc-debug/d1f1def0ab3f48ecae99e77a82bbe165/dpdk/drivers/net/i40e/i40e_logs.h:41:2: note: in expansion of macro ‘PMD_DRV_LOG_RAW’
  PMD_DRV_LOG_RAW(level, fmt "\n", ## args)
  ^~~~~~~~~~~~~~~
/tmp/FC25_K4.8.6_GCC6.3.1/x86_64-native-linuxapp-gcc-debug/d1f1def0ab3f48ecae99e77a82bbe165/dpdk/drivers/net/i40e/i40e_pf.c:1263:3: note: in expansion of macro ‘PMD_DRV_LOG’
   PMD_DRV_LOG(ERR, "VF %d requested %d more queues,
   ^~~~~~~~~~~
/tmp/FC25_K4.8.6_GCC6.3.1/x86_64-native-linuxapp-gcc-debug/d1f1def0ab3f48ecae99e77a82bbe165/dpdk/mk/internal/rte.compile-pre.mk:114: recipe for target 'i40e_pf.o' failed
make[6]: *** [i40e_pf.o] Error 1
/tmp/FC25_K4.8.6_GCC6.3.1/x86_64-native-linuxapp-gcc-debug/d1f1def0ab3f48ecae99e77a82bbe165/dpdk/mk/rte.subdir.mk:35: recipe for target 'i40e' failed
make[5]: *** [i40e] Error 2
make[5]: *** Waiting for unfinished jobs....
  CC ixgbe_ethdev.o
  CC ixgbe_fdir.o
  CC ixgbe_pf.o
--
  CC rte_pmd_ixgbe.o
  CC ixgbe_tm.o
  CC ixgbe_vf_representor.o
  AR librte_pmd_ixgbe.a
  INSTALL-LIB librte_pmd_ixgbe.a
/tmp/FC25_K4.8.6_GCC6.3.1/x86_64-native-linuxapp-gcc-debug/d1f1def0ab3f48ecae99e77a82bbe165/dpdk/mk/rte.subdir.mk:35: recipe for target 'net' failed
make[4]: *** [net] Error 2
/tmp/FC25_K4.8.6_GCC6.3.1/x86_64-native-linuxapp-gcc-debug/d1f1def0ab3f48ecae99e77a82bbe165/dpdk/mk/rte.sdkbuild.mk:49: recipe for target 'drivers' failed
make[3]: *** [drivers] Error 2
/tmp/FC25_K4.8.6_GCC6.3.1/x86_64-native-linuxapp-gcc-debug/d1f1def0ab3f48ecae99e77a82bbe165/dpdk/mk/rte.sdkroot.mk:100: recipe for target 'all' failed
make[2]: *** [all] Error 2
/tmp/FC25_K4.8.6_GCC6.3.1/x86_64-native-linuxapp-gcc-debug/d1f1def0ab3f48ecae99e77a82bbe165/dpdk/mk/rte.sdkinstall.mk:57: recipe for target 'pre_install' failed
make[1]: *** [pre_install] Error 2
/tmp/FC25_K4.8.6_GCC6.3.1/x86_64-native-linuxapp-gcc-debug/d1f1def0ab3f48ecae99e77a82bbe165/dpdk/mk/rte.sdkroot.mk:79: recipe for target 'install' failed
make: *** [install] Error 2

*Failed Build #12:
OS: FC24
Target: x86_64-native-linuxapp-gcc-shared
  CC i40e_ethdev_vf.o.pmd.o
  LD i40e_ethdev_vf.o
  CC i40e_pf.o
  CC ixgbe_rxtx.o
/tmp/FC24_K4.9.13_GCC6.2.1/x86_64-native-linuxapp-gcc-shared/d1f1def0ab3f48ecae99e77a82bbe165/dpdk/drivers/net/i40e/i40e_pf.c: In function ‘i40e_pf_host_process_cmd_request_queues’:
/tmp/FC24_K4.9.13_GCC6.2.1/x86_64-native-linuxapp-gcc-shared/d1f1def0ab3f48ecae99e77a82bbe165/dpdk/drivers/net/i40e/i40e_pf.c:1254:20: warning: missing terminating " character
   PMD_DRV_LOG(ERR, "VF %d tried to request %d queues.
                    ^
/tmp/FC24_K4.9.13_GCC6.2.1/x86_64-native-linuxapp-gcc-shared/d1f1def0ab3f48ecae99e77a82bbe165/dpdk/drivers/net/i40e/i40e_pf.c:1255:19: warning: missing terminating " character
        Ignoring.\n", vf->vf_idx,
                   ^
In file included from /tmp/FC24_K4.9.13_GCC6.2.1/x86_64-native-linuxapp-gcc-shared/d1f1def0ab3f48ecae99e77a82bbe165/dpdk/drivers/net/i40e/i40e_pf.c:21:0:
/tmp/FC24_K4.9.13_GCC6.2.1/x86_64-native-linuxapp-gcc-shared/d1f1def0ab3f48ecae99e77a82bbe165/dpdk/drivers/net/i40e/i40e_pf.c:1254:20: error: missing terminating " character
   PMD_DRV_LOG(ERR, "VF %d tried to request %d queues.
                    ^
/tmp/FC24_K4.9.13_GCC6.2.1/x86_64-native-linuxapp-gcc-shared/d1f1def0ab3f48ecae99e77a82bbe165/dpdk/drivers/net/i40e/i40e_logs.h:37:59: note: in definition of macro ‘PMD_DRV_LOG_RAW’
  rte_log(RTE_LOG_ ## level, i40e_logtype_driver, "%s(): " fmt, \
                                                           ^~~
/tmp/FC24_K4.9.13_GCC6.2.1/x86_64-native-linuxapp-gcc-shared/d1f1def0ab3f48ecae99e77a82bbe165/dpdk/drivers/net/i40e/i40e_pf.c:1254:3: note: in expansion of macro ‘PMD_DRV_LOG’
   PMD_DRV_LOG(ERR, "VF %d tried to request %d queues.
   ^~~~~~~~~~~
/tmp/FC24_K4.9.13_GCC6.2.1/x86_64-native-linuxapp-gcc-shared/d1f1def0ab3f48ecae99e77a82bbe165/dpdk/drivers/net/i40e/i40e_pf.c:1255:8: error: expected ‘)’ before ‘Ignoring’
        Ignoring.\n", vf->vf_idx,
        ^
/tmp/FC24_K4.9.13_GCC6.2.1/x86_64-native-linuxapp-gcc-shared/d1f1def0ab3f48ecae99e77a82bbe165/dpdk/drivers/net/i40e/i40e_logs.h:37:59: note: in definition of macro ‘PMD_DRV_LOG_RAW’
  rte_log(RTE_LOG_ ## level, i40e_logtype_driver, "%s(): " fmt, \
                                                           ^~~
/tmp/FC24_K4.9.13_GCC6.2.1/x86_64-native-linuxapp-gcc-shared/d1f1def0ab3f48ecae99e77a82bbe165/dpdk/drivers/net/i40e/i40e_pf.c:1254:3: note: in expansion of macro ‘PMD_DRV_LOG’
   PMD_DRV_LOG(ERR, "VF %d tried to request %d queues.
   ^~~~~~~~~~~
/tmp/FC24_K4.9.13_GCC6.2.1/x86_64-native-linuxapp-gcc-shared/d1f1def0ab3f48ecae99e77a82bbe165/dpdk/drivers/net/i40e/i40e_pf.c:1255:17: error: stray ‘\’ in program
        Ignoring.\n", vf->vf_idx,
                 ^
/tmp/FC24_K4.9.13_GCC6.2.1/x86_64-native-linuxapp-gcc-shared/d1f1def0ab3f48ecae99e77a82bbe165/dpdk/drivers/net/i40e/i40e_logs.h:37:59: note: in definition of macro ‘PMD_DRV_LOG_RAW’
  rte_log(RTE_LOG_ ## level, i40e_logtype_driver, "%s(): " fmt, \
                                                           ^~~
/tmp/FC24_K4.9.13_GCC6.2.1/x86_64-native-linuxapp-gcc-shared/d1f1def0ab3f48ecae99e77a82bbe165/dpdk/drivers/net/i40e/i40e_pf.c:1254:3: note: in expansion of macro ‘PMD_DRV_LOG’
   PMD_DRV_LOG(ERR, "VF %d tried to request %d queues.
   ^~~~~~~~~~~
/tmp/FC24_K4.9.13_GCC6.2.1/x86_64-native-linuxapp-gcc-shared/d1f1def0ab3f48ecae99e77a82bbe165/dpdk/drivers/net/i40e/i40e_pf.c:1255:19: error: missing terminating " character
        Ignoring.\n", vf->vf_idx,
                   ^
/tmp/FC24_K4.9.13_GCC6.2.1/x86_64-native-linuxapp-gcc-shared/d1f1def0ab3f48ecae99e77a82bbe165/dpdk/drivers/net/i40e/i40e_logs.h:37:59: note: in definition of macro ‘PMD_DRV_LOG_RAW’
  rte_log(RTE_LOG_ ## level, i40e_logtype_driver, "%s(): " fmt, \
                                                           ^~~
/tmp/FC24_K4.9.13_GCC6.2.1/x86_64-native-linuxapp-gcc-shared/d1f1def0ab3f48ecae99e77a82bbe165/dpdk/drivers/net/i40e/i40e_pf.c:1254:3: note: in expansion of macro ‘PMD_DRV_LOG’
   PMD_DRV_LOG(ERR, "VF %d tried to request %d queues.
   ^~~~~~~~~~~
/tmp/FC24_K4.9.13_GCC6.2.1/x86_64-native-linuxapp-gcc-shared/d1f1def0ab3f48ecae99e77a82bbe165/dpdk/drivers/net/i40e/i40e_logs.h:37:50: warning: format ‘%s’ expects a matching ‘char *’ argument [-Wformat=]
  rte_log(RTE_LOG_ ## level, i40e_logtype_driver, "%s(): " fmt, \
                                                  ^
/tmp/FC24_K4.9.13_GCC6.2.1/x86_64-native-linuxapp-gcc-shared/d1f1def0ab3f48ecae99e77a82bbe165/dpdk/drivers/net/i40e/i40e_logs.h:41:2: note: in expansion of macro ‘PMD_DRV_LOG_RAW’
  PMD_DRV_LOG_RAW(level, fmt "\n", ## args)
  ^~~~~~~~~~~~~~~
/tmp/FC24_K4.9.13_GCC6.2.1/x86_64-native-linuxapp-gcc-shared/d1f1def0ab3f48ecae99e77a82bbe165/dpdk/drivers/net/i40e/i40e_pf.c:1254:3: note: in expansion of macro ‘PMD_DRV_LOG’
   PMD_DRV_LOG(ERR, "VF %d tried to request %d queues.
   ^~~~~~~~~~~
/tmp/FC24_K4.9.13_GCC6.2.1/x86_64-native-linuxapp-gcc-shared/d1f1def0ab3f48ecae99e77a82bbe165/dpdk/drivers/net/i40e/i40e_pf.c:1258:20: warning: missing terminating " character
   PMD_DRV_LOG(ERR, "VF %d tried to request more than
                    ^
/tmp/FC24_K4.9.13_GCC6.2.1/x86_64-native-linuxapp-gcc-shared/d1f1def0ab3f48ecae99e77a82bbe165/dpdk/drivers/net/i40e/i40e_pf.c:1259:20: warning: missing terminating " character
        %d queues.\n", vf->vf_idx,
                    ^
In file included from /tmp/FC24_K4.9.13_GCC6.2.1/x86_64-native-linuxapp-gcc-shared/d1f1def0ab3f48ecae99e77a82bbe165/dpdk/drivers/net/i40e/i40e_pf.c:21:0:
/tmp/FC24_K4.9.13_GCC6.2.1/x86_64-native-linuxapp-gcc-shared/d1f1def0ab3f48ecae99e77a82bbe165/dpdk/drivers/net/i40e/i40e_pf.c:1258:20: error: missing terminating " character
   PMD_DRV_LOG(ERR, "VF %d tried to request more than
                    ^
/tmp/FC24_K4.9.13_GCC6.2.1/x86_64-native-linuxapp-gcc-shared/d1f1def0ab3f48ecae99e77a82bbe165/dpdk/drivers/net/i40e/i40e_logs.h:37:59: note: in definition of macro ‘PMD_DRV_LOG_RAW’
  rte_log(RTE_LOG_ ## level, i40e_logtype_driver, "%s(): " fmt, \
                                                           ^~~
/tmp/FC24_K4.9.13_GCC6.2.1/x86_64-native-linuxapp-gcc-shared/d1f1def0ab3f48ecae99e77a82bbe165/dpdk/drivers/net/i40e/i40e_pf.c:1258:3: note: in expansion of macro ‘PMD_DRV_LOG’
   PMD_DRV_LOG(ERR, "VF %d tried to request more than
   ^~~~~~~~~~~
/tmp/FC24_K4.9.13_GCC6.2.1/x86_64-native-linuxapp-gcc-shared/d1f1def0ab3f48ecae99e77a82bbe165/dpdk/drivers/net/i40e/i40e_pf.c:1259:9: error: ‘d’ undeclared (first use in this function)
        %d queues.\n", vf->vf_idx,
         ^
/tmp/FC24_K4.9.13_GCC6.2.1/x86_64-native-linuxapp-gcc-shared/d1f1def0ab3f48ecae99e77a82bbe165/dpdk/drivers/net/i40e/i40e_logs.h:37:59: note: in definition of macro ‘PMD_DRV_LOG_RAW’
  rte_log(RTE_LOG_ ## level, i40e_logtype_driver, "%s(): " fmt, \
                                                           ^~~
--
  rte_log(RTE_LOG_ ## level, i40e_logtype_driver, "%s(): " fmt, \
                                                           ^~~
/tmp/FC24_K4.9.13_GCC6.2.1/x86_64-native-linuxapp-gcc-shared/d1f1def0ab3f48ecae99e77a82bbe165/dpdk/drivers/net/i40e/i40e_pf.c:1258:3: note: in expansion of macro ‘PMD_DRV_LOG’
   PMD_DRV_LOG(ERR, "VF %d tried to request more than
   ^~~~~~~~~~~
/tmp/FC24_K4.9.13_GCC6.2.1/x86_64-native-linuxapp-gcc-shared/d1f1def0ab3f48ecae99e77a82bbe165/dpdk/drivers/net/i40e/i40e_pf.c:1259:11: error: expected ‘)’ before ‘queues’
        %d queues.\n", vf->vf_idx,
           ^
/tmp/FC24_K4.9.13_GCC6.2.1/x86_64-native-linuxapp-gcc-shared/d1f1def0ab3f48ecae99e77a82bbe165/dpdk/drivers/net/i40e/i40e_logs.h:37:59: note: in definition of macro ‘PMD_DRV_LOG_RAW’
  rte_log(RTE_LOG_ ## level, i40e_logtype_driver, "%s(): " fmt, \
                                                           ^~~
/tmp/FC24_K4.9.13_GCC6.2.1/x86_64-native-linuxapp-gcc-shared/d1f1def0ab3f48ecae99e77a82bbe165/dpdk/drivers/net/i40e/i40e_pf.c:1258:3: note: in expansion of macro ‘PMD_DRV_LOG’
   PMD_DRV_LOG(ERR, "VF %d tried to request more than
   ^~~~~~~~~~~
/tmp/FC24_K4.9.13_GCC6.2.1/x86_64-native-linuxapp-gcc-shared/d1f1def0ab3f48ecae99e77a82bbe165/dpdk/drivers/net/i40e/i40e_pf.c:1259:18: error: stray ‘\’ in program
        %d queues.\n", vf->vf_idx,
                  ^
/tmp/FC24_K4.9.13_GCC6.2.1/x86_64-native-linuxapp-gcc-shared/d1f1def0ab3f48ecae99e77a82bbe165/dpdk/drivers/net/i40e/i40e_logs.h:37:59: note: in definition of macro ‘PMD_DRV_LOG_RAW’
  rte_log(RTE_LOG_ ## level, i40e_logtype_driver, "%s(): " fmt, \
                                                           ^~~
/tmp/FC24_K4.9.13_GCC6.2.1/x86_64-native-linuxapp-gcc-shared/d1f1def0ab3f48ecae99e77a82bbe165/dpdk/drivers/net/i40e/i40e_pf.c:1258:3: note: in expansion of macro ‘PMD_DRV_LOG’
   PMD_DRV_LOG(ERR, "VF %d tried to request more than
   ^~~~~~~~~~~
/tmp/FC24_K4.9.13_GCC6.2.1/x86_64-native-linuxapp-gcc-shared/d1f1def0ab3f48ecae99e77a82bbe165/dpdk/drivers/net/i40e/i40e_pf.c:1259:20: error: missing terminating " character
        %d queues.\n", vf->vf_idx,
                    ^
/tmp/FC24_K4.9.13_GCC6.2.1/x86_64-native-linuxapp-gcc-shared/d1f1def0ab3f48ecae99e77a82bbe165/dpdk/drivers/net/i40e/i40e_logs.h:37:59: note: in definition of macro ‘PMD_DRV_LOG_RAW’
  rte_log(RTE_LOG_ ## level, i40e_logtype_driver, "%s(): " fmt, \
                                                           ^~~
/tmp/FC24_K4.9.13_GCC6.2.1/x86_64-native-linuxapp-gcc-shared/d1f1def0ab3f48ecae99e77a82bbe165/dpdk/drivers/net/i40e/i40e_pf.c:1258:3: note: in expansion of macro ‘PMD_DRV_LOG’
   PMD_DRV_LOG(ERR, "VF %d tried to request more than
   ^~~~~~~~~~~
/tmp/FC24_K4.9.13_GCC6.2.1/x86_64-native-linuxapp-gcc-shared/d1f1def0ab3f48ecae99e77a82bbe165/dpdk/drivers/net/i40e/i40e_pf.c:1263:20: warning: missing terminating " character
   PMD_DRV_LOG(ERR, "VF %d requested %d more queues,
                    ^
/tmp/FC24_K4.9.13_GCC6.2.1/x86_64-native-linuxapp-gcc-shared/d1f1def0ab3f48ecae99e77a82bbe165/dpdk/drivers/net/i40e/i40e_pf.c:1264:26: warning: missing terminating " character
        but noly %d left\n", vf->vf_idx,
                          ^
In file included from /tmp/FC24_K4.9.13_GCC6.2.1/x86_64-native-linuxapp-gcc-shared/d1f1def0ab3f48ecae99e77a82bbe165/dpdk/drivers/net/i40e/i40e_pf.c:21:0:
/tmp/FC24_K4.9.13_GCC6.2.1/x86_64-native-linuxapp-gcc-shared/d1f1def0ab3f48ecae99e77a82bbe165/dpdk/drivers/net/i40e/i40e_pf.c:1263:20: error: missing terminating " character
   PMD_DRV_LOG(ERR, "VF %d requested %d more queues,
                    ^
/tmp/FC24_K4.9.13_GCC6.2.1/x86_64-native-linuxapp-gcc-shared/d1f1def0ab3f48ecae99e77a82bbe165/dpdk/drivers/net/i40e/i40e_logs.h:37:59: note: in definition of macro ‘PMD_DRV_LOG_RAW’
  rte_log(RTE_LOG_ ## level, i40e_logtype_driver, "%s(): " fmt, \
                                                           ^~~
/tmp/FC24_K4.9.13_GCC6.2.1/x86_64-native-linuxapp-gcc-shared/d1f1def0ab3f48ecae99e77a82bbe165/dpdk/drivers/net/i40e/i40e_pf.c:1263:3: note: in expansion of macro ‘PMD_DRV_LOG’
   PMD_DRV_LOG(ERR, "VF %d requested %d more queues,
   ^~~~~~~~~~~
/tmp/FC24_K4.9.13_GCC6.2.1/x86_64-native-linuxapp-gcc-shared/d1f1def0ab3f48ecae99e77a82bbe165/dpdk/drivers/net/i40e/i40e_pf.c:1264:8: error: expected ‘)’ before ‘but’
        but noly %d left\n", vf->vf_idx,
        ^
/tmp/FC24_K4.9.13_GCC6.2.1/x86_64-native-linuxapp-gcc-shared/d1f1def0ab3f48ecae99e77a82bbe165/dpdk/drivers/net/i40e/i40e_logs.h:37:59: note: in definition of macro ‘PMD_DRV_LOG_RAW’
  rte_log(RTE_LOG_ ## level, i40e_logtype_driver, "%s(): " fmt, \
                                                           ^~~
/tmp/FC24_K4.9.13_GCC6.2.1/x86_64-native-linuxapp-gcc-shared/d1f1def0ab3f48ecae99e77a82bbe165/dpdk/drivers/net/i40e/i40e_pf.c:1263:3: note: in expansion of macro ‘PMD_DRV_LOG’
   PMD_DRV_LOG(ERR, "VF %d requested %d more queues,
   ^~~~~~~~~~~
/tmp/FC24_K4.9.13_GCC6.2.1/x86_64-native-linuxapp-gcc-shared/d1f1def0ab3f48ecae99e77a82bbe165/dpdk/drivers/net/i40e/i40e_pf.c:1264:24: error: stray ‘\’ in program
        but noly %d left\n", vf->vf_idx,
                        ^
/tmp/FC24_K4.9.13_GCC6.2.1/x86_64-native-linuxapp-gcc-shared/d1f1def0ab3f48ecae99e77a82bbe165/dpdk/drivers/net/i40e/i40e_logs.h:37:59: note: in definition of macro ‘PMD_DRV_LOG_RAW’
  rte_log(RTE_LOG_ ## level, i40e_logtype_driver, "%s(): " fmt, \
                                                           ^~~
/tmp/FC24_K4.9.13_GCC6.2.1/x86_64-native-linuxapp-gcc-shared/d1f1def0ab3f48ecae99e77a82bbe165/dpdk/drivers/net/i40e/i40e_pf.c:1263:3: note: in expansion of macro ‘PMD_DRV_LOG’
   PMD_DRV_LOG(ERR, "VF %d requested %d more queues,
   ^~~~~~~~~~~
/tmp/FC24_K4.9.13_GCC6.2.1/x86_64-native-linuxapp-gcc-shared/d1f1def0ab3f48ecae99e77a82bbe165/dpdk/drivers/net/i40e/i40e_pf.c:1264:26: error: missing terminating " character
        but noly %d left\n", vf->vf_idx,
                          ^
/tmp/FC24_K4.9.13_GCC6.2.1/x86_64-native-linuxapp-gcc-shared/d1f1def0ab3f48ecae99e77a82bbe165/dpdk/drivers/net/i40e/i40e_logs.h:37:59: note: in definition of macro ‘PMD_DRV_LOG_RAW’
  rte_log(RTE_LOG_ ## level, i40e_logtype_driver, "%s(): " fmt, \
                                                           ^~~
/tmp/FC24_K4.9.13_GCC6.2.1/x86_64-native-linuxapp-gcc-shared/d1f1def0ab3f48ecae99e77a82bbe165/dpdk/drivers/net/i40e/i40e_pf.c:1263:3: note: in expansion of macro ‘PMD_DRV_LOG’
   PMD_DRV_LOG(ERR, "VF %d requested %d more queues,
   ^~~~~~~~~~~
/tmp/FC24_K4.9.13_GCC6.2.1/x86_64-native-linuxapp-gcc-shared/d1f1def0ab3f48ecae99e77a82bbe165/dpdk/drivers/net/i40e/i40e_logs.h:37:50: warning: format ‘%s’ expects a matching ‘char *’ argument [-Wformat=]
  rte_log(RTE_LOG_ ## level, i40e_logtype_driver, "%s(): " fmt, \
                                                  ^
/tmp/FC24_K4.9.13_GCC6.2.1/x86_64-native-linuxapp-gcc-shared/d1f1def0ab3f48ecae99e77a82bbe165/dpdk/drivers/net/i40e/i40e_logs.h:41:2: note: in expansion of macro ‘PMD_DRV_LOG_RAW’
  PMD_DRV_LOG_RAW(level, fmt "\n", ## args)
  ^~~~~~~~~~~~~~~
/tmp/FC24_K4.9.13_GCC6.2.1/x86_64-native-linuxapp-gcc-shared/d1f1def0ab3f48ecae99e77a82bbe165/dpdk/drivers/net/i40e/i40e_pf.c:1263:3: note: in expansion of macro ‘PMD_DRV_LOG’
   PMD_DRV_LOG(ERR, "VF %d requested %d more queues,
   ^~~~~~~~~~~
/tmp/FC24_K4.9.13_GCC6.2.1/x86_64-native-linuxapp-gcc-shared/d1f1def0ab3f48ecae99e77a82bbe165/dpdk/mk/internal/rte.compile-pre.mk:114: recipe for target 'i40e_pf.o' failed
make[6]: *** [i40e_pf.o] Error 1
/tmp/FC24_K4.9.13_GCC6.2.1/x86_64-native-linuxapp-gcc-shared/d1f1def0ab3f48ecae99e77a82bbe165/dpdk/mk/rte.subdir.mk:35: recipe for target 'i40e' failed
make[5]: *** [i40e] Error 2
make[5]: *** Waiting for unfinished jobs....
  CC ixgbe_ethdev.o
  CC ixgbe_fdir.o
  PMDINFO ixgbe_ethdev.o.pmd.c
--
  CC rte_pmd_ixgbe.o
  CC ixgbe_tm.o
  CC ixgbe_vf_representor.o
  LD librte_pmd_ixgbe.so.2.1
  INSTALL-LIB librte_pmd_ixgbe.so.2.1
/tmp/FC24_K4.9.13_GCC6.2.1/x86_64-native-linuxapp-gcc-shared/d1f1def0ab3f48ecae99e77a82bbe165/dpdk/mk/rte.subdir.mk:35: recipe for target 'net' failed
make[4]: *** [net] Error 2
/tmp/FC24_K4.9.13_GCC6.2.1/x86_64-native-linuxapp-gcc-shared/d1f1def0ab3f48ecae99e77a82bbe165/dpdk/mk/rte.sdkbuild.mk:49: recipe for target 'drivers' failed
make[3]: *** [drivers] Error 2
/tmp/FC24_K4.9.13_GCC6.2.1/x86_64-native-linuxapp-gcc-shared/d1f1def0ab3f48ecae99e77a82bbe165/dpdk/mk/rte.sdkroot.mk:100: recipe for target 'all' failed
make[2]: *** [all] Error 2
/tmp/FC24_K4.9.13_GCC6.2.1/x86_64-native-linuxapp-gcc-shared/d1f1def0ab3f48ecae99e77a82bbe165/dpdk/mk/rte.sdkinstall.mk:57: recipe for target 'pre_install' failed
make[1]: *** [pre_install] Error 2
/tmp/FC24_K4.9.13_GCC6.2.1/x86_64-native-linuxapp-gcc-shared/d1f1def0ab3f48ecae99e77a82bbe165/dpdk/mk/rte.sdkroot.mk:79: recipe for target 'install' failed
make: *** [install] Error 2

*Failed Build #13:
OS: FC24
Target: x86_64-native-linuxapp-clang
  CC ixgbe_ethdev.o
  PMDINFO i40e_ethdev_vf.o.pmd.c
  CC i40e_ethdev_vf.o.pmd.o
  LD i40e_ethdev_vf.o
  CC i40e_pf.o
/tmp/FC24_K4.9.13_GCC6.2.1/x86_64-native-linuxapp-clang/d1f1def0ab3f48ecae99e77a82bbe165/dpdk/drivers/net/i40e/i40e_pf.c:1254:20: warning: missing terminating '"' character [-Winvalid-pp-token]
                PMD_DRV_LOG(ERR, "VF %d tried to request %d queues.
                                 ^
/tmp/FC24_K4.9.13_GCC6.2.1/x86_64-native-linuxapp-clang/d1f1def0ab3f48ecae99e77a82bbe165/dpdk/drivers/net/i40e/i40e_pf.c:1255:19: warning: missing terminating '"' character [-Winvalid-pp-token]
                            Ignoring.\n", vf->vf_idx,
                                       ^
/tmp/FC24_K4.9.13_GCC6.2.1/x86_64-native-linuxapp-clang/d1f1def0ab3f48ecae99e77a82bbe165/dpdk/drivers/net/i40e/i40e_pf.c:1254:20: error: expected ')'
                PMD_DRV_LOG(ERR, "VF %d tried to request %d queues.
                                 ^
/tmp/FC24_K4.9.13_GCC6.2.1/x86_64-native-linuxapp-clang/d1f1def0ab3f48ecae99e77a82bbe165/dpdk/drivers/net/i40e/i40e_pf.c:1254:3: note: to match this '('
                PMD_DRV_LOG(ERR, "VF %d tried to request %d queues.
                ^
--
        PMD_DRV_LOG_RAW(level, fmt "\n", ## args)
        ^
/tmp/FC24_K4.9.13_GCC6.2.1/x86_64-native-linuxapp-clang/d1f1def0ab3f48ecae99e77a82bbe165/dpdk/drivers/net/i40e/base/../i40e_logs.h:37:9: note: expanded from macro 'PMD_DRV_LOG_RAW'
        rte_log(RTE_LOG_ ## level, i40e_logtype_driver, "%s(): " fmt, \
               ^
/tmp/FC24_K4.9.13_GCC6.2.1/x86_64-native-linuxapp-clang/d1f1def0ab3f48ecae99e77a82bbe165/dpdk/drivers/net/i40e/i40e_pf.c:1258:20: warning: missing terminating '"' character [-Winvalid-pp-token]
                PMD_DRV_LOG(ERR, "VF %d tried to request more than
                                 ^
/tmp/FC24_K4.9.13_GCC6.2.1/x86_64-native-linuxapp-clang/d1f1def0ab3f48ecae99e77a82bbe165/dpdk/drivers/net/i40e/i40e_pf.c:1259:20: warning: missing terminating '"' character [-Winvalid-pp-token]
                            %d queues.\n", vf->vf_idx,
                                        ^
/tmp/FC24_K4.9.13_GCC6.2.1/x86_64-native-linuxapp-clang/d1f1def0ab3f48ecae99e77a82bbe165/dpdk/drivers/net/i40e/i40e_pf.c:1258:20: error: expected ')'
                PMD_DRV_LOG(ERR, "VF %d tried to request more than
                                 ^
/tmp/FC24_K4.9.13_GCC6.2.1/x86_64-native-linuxapp-clang/d1f1def0ab3f48ecae99e77a82bbe165/dpdk/drivers/net/i40e/i40e_pf.c:1258:3: note: to match this '('
                PMD_DRV_LOG(ERR, "VF %d tried to request more than
                ^
--
        PMD_DRV_LOG_RAW(level, fmt "\n", ## args)
        ^
/tmp/FC24_K4.9.13_GCC6.2.1/x86_64-native-linuxapp-clang/d1f1def0ab3f48ecae99e77a82bbe165/dpdk/drivers/net/i40e/base/../i40e_logs.h:37:9: note: expanded from macro 'PMD_DRV_LOG_RAW'
        rte_log(RTE_LOG_ ## level, i40e_logtype_driver, "%s(): " fmt, \
               ^
/tmp/FC24_K4.9.13_GCC6.2.1/x86_64-native-linuxapp-clang/d1f1def0ab3f48ecae99e77a82bbe165/dpdk/drivers/net/i40e/i40e_pf.c:1263:20: warning: missing terminating '"' character [-Winvalid-pp-token]
                PMD_DRV_LOG(ERR, "VF %d requested %d more queues,
                                 ^
/tmp/FC24_K4.9.13_GCC6.2.1/x86_64-native-linuxapp-clang/d1f1def0ab3f48ecae99e77a82bbe165/dpdk/drivers/net/i40e/i40e_pf.c:1264:26: warning: missing terminating '"' character [-Winvalid-pp-token]
                            but noly %d left\n", vf->vf_idx,
                                              ^
/tmp/FC24_K4.9.13_GCC6.2.1/x86_64-native-linuxapp-clang/d1f1def0ab3f48ecae99e77a82bbe165/dpdk/drivers/net/i40e/i40e_pf.c:1263:20: error: expected ')'
                PMD_DRV_LOG(ERR, "VF %d requested %d more queues,
                                 ^
/tmp/FC24_K4.9.13_GCC6.2.1/x86_64-native-linuxapp-clang/d1f1def0ab3f48ecae99e77a82bbe165/dpdk/drivers/net/i40e/i40e_pf.c:1263:3: note: to match this '('
                PMD_DRV_LOG(ERR, "VF %d requested %d more queues,
                ^
--
        PMD_DRV_LOG_RAW(level, fmt "\n", ## args)
        ^
/tmp/FC24_K4.9.13_GCC6.2.1/x86_64-native-linuxapp-clang/d1f1def0ab3f48ecae99e77a82bbe165/dpdk/drivers/net/i40e/base/../i40e_logs.h:37:9: note: expanded from macro 'PMD_DRV_LOG_RAW'
        rte_log(RTE_LOG_ ## level, i40e_logtype_driver, "%s(): " fmt, \
               ^
6 warnings and 3 errors generated.
/tmp/FC24_K4.9.13_GCC6.2.1/x86_64-native-linuxapp-clang/d1f1def0ab3f48ecae99e77a82bbe165/dpdk/mk/internal/rte.compile-pre.mk:114: recipe for target 'i40e_pf.o' failed
make[6]: *** [i40e_pf.o] Error 1
/tmp/FC24_K4.9.13_GCC6.2.1/x86_64-native-linuxapp-clang/d1f1def0ab3f48ecae99e77a82bbe165/dpdk/mk/rte.subdir.mk:35: recipe for target 'i40e' failed
make[5]: *** [i40e] Error 2
make[5]: *** Waiting for unfinished jobs....
  CC ixgbe_fdir.o
  PMDINFO ixgbe_ethdev.o.pmd.c
  CC ixgbe_ethdev.o.pmd.o
--
  CC rte_pmd_ixgbe.o
  CC ixgbe_tm.o
  CC ixgbe_vf_representor.o
  AR librte_pmd_ixgbe.a
  INSTALL-LIB librte_pmd_ixgbe.a
/tmp/FC24_K4.9.13_GCC6.2.1/x86_64-native-linuxapp-clang/d1f1def0ab3f48ecae99e77a82bbe165/dpdk/mk/rte.subdir.mk:35: recipe for target 'net' failed
make[4]: *** [net] Error 2
/tmp/FC24_K4.9.13_GCC6.2.1/x86_64-native-linuxapp-clang/d1f1def0ab3f48ecae99e77a82bbe165/dpdk/mk/rte.sdkbuild.mk:49: recipe for target 'drivers' failed
make[3]: *** [drivers] Error 2
/tmp/FC24_K4.9.13_GCC6.2.1/x86_64-native-linuxapp-clang/d1f1def0ab3f48ecae99e77a82bbe165/dpdk/mk/rte.sdkroot.mk:100: recipe for target 'all' failed
make[2]: *** [all] Error 2
/tmp/FC24_K4.9.13_GCC6.2.1/x86_64-native-linuxapp-clang/d1f1def0ab3f48ecae99e77a82bbe165/dpdk/mk/rte.sdkinstall.mk:57: recipe for target 'pre_install' failed
make[1]: *** [pre_install] Error 2
/tmp/FC24_K4.9.13_GCC6.2.1/x86_64-native-linuxapp-clang/d1f1def0ab3f48ecae99e77a82bbe165/dpdk/mk/rte.sdkroot.mk:79: recipe for target 'install' failed
make: *** [install] Error 2

*Failed Build #14:
OS: FreeBSD
Target: x86_64-native-bsdapp-gcc
@ -> /usr/src/sys
machine -> /usr/src/sys/amd64/include
x86 -> /usr/src/sys/x86/include
awk -f @/tools/makeobjops.awk @/kern/device_if.m -h
awk -f @/tools/makeobjops.awk @/kern/bus_if.m -h
cc -Winline -Wall -Werror -include /tmp/FreeBSD_K10.3_GCC4.8.5/x86_64-native-bsdapp-gcc/d1f1def0ab3f48ecae99e77a82bbe165/dpdk/x86_64-native-bsdapp-gcc/include/rte_config.h  -Werror -D_KERNEL -DKLD_MODULE -nostdinc  -I/tmp/FreeBSD_K10.3_GCC4.8.5/x86_64-native-bsdapp-gcc/d1f1def0ab3f48ecae99e77a82bbe165/dpdk/kernel/freebsd/contigmem -I/tmp/FreeBSD_K10.3_GCC4.8.5/x86_64-native-bsdapp-gcc/d1f1def0ab3f48ecae99e77a82bbe165/dpdk/x86_64-native-bsdapp-gcc/include -I. -I@ -I@/contrib/altq -fno-common  -fno-omit-frame-pointer -mno-omit-leaf-frame-pointer  -mno-aes -mno-avx -mcmodel=kernel -mno-red-zone -mno-mmx -mno-sse -msoft-float  -fno-asynchronous-unwind-tables -ffreestanding -fstack-protector -std=iso9899:1999 -Qunused-arguments  -fstack-protector -Wall -Wredundant-decls -Wnested-externs -Wstrict-prototypes  -Wmissing-prototypes -Wpointer-arith -Winline -Wcast-qual  -Wundef -Wno-pointer-sign -fformat-extensions  -Wmissing-include-dirs -fdiagnostics-show-option  -Wno-error-tautological-compare -Wno-error-empty-body  -Wno-error-parentheses-equality -Wno-error-unused-function    -c contigmem.c -o contigmem.o
Warning: Object directory not changed from original /tmp/FreeBSD_K10.3_GCC4.8.5/x86_64-native-bsdapp-gcc/d1f1def0ab3f48ecae99e77a82bbe165/dpdk/x86_64-native-bsdapp-gcc/build/kernel/freebsd/nic_uio
@ -> /usr/src/sys
machine -> /usr/src/sys/amd64/include
x86 -> /usr/src/sys/x86/include
awk -f @/tools/makeobjops.awk @/kern/device_if.m -h
awk -f @/tools/makeobjops.awk @/kern/bus_if.m -h
ld      -L/tmp/FreeBSD_K10.3_GCC4.8.5/x86_64-native-bsdapp-gcc/d1f1def0ab3f48ecae99e77a82bbe165/dpdk/x86_64-native-bsdapp-gcc/lib -d -warn-common -r -d -o contigmem.ko contigmem.o
awk -f @/tools/makeobjops.awk @/dev/pci/pci_if.m -h
:> export_syms
awk -f /sys/conf/kmod_syms.awk contigmem.ko  export_syms | xargs -J% objcopy % contigmem.ko
cc -Winline -Wall -Werror -include /tmp/FreeBSD_K10.3_GCC4.8.5/x86_64-native-bsdapp-gcc/d1f1def0ab3f48ecae99e77a82bbe165/dpdk/x86_64-native-bsdapp-gcc/include/rte_config.h  -Werror -D_KERNEL -DKLD_MODULE -nostdinc  -I/tmp/FreeBSD_K10.3_GCC4.8.5/x86_64-native-bsdapp-gcc/d1f1def0ab3f48ecae99e77a82bbe165/dpdk/kernel/freebsd/nic_uio -I/tmp/FreeBSD_K10.3_GCC4.8.5/x86_64-native-bsdapp-gcc/d1f1def0ab3f48ecae99e77a82bbe165/dpdk/x86_64-native-bsdapp-gcc/include -I. -I@ -I@/contrib/altq -fno-common  -fno-omit-frame-pointer -mno-omit-leaf-frame-pointer  -mno-aes -mno-avx -mcmodel=kernel -mno-red-zone -mno-mmx -mno-sse -msoft-float  -fno-asynchronous-unwind-tables -ffreestanding -fstack-protector -std=iso9899:1999 -Qunused-arguments  -fstack-protector -Wall -Wredundant-decls -Wnested-externs -Wstrict-prototypes  -Wmissing-prototypes -Wpointer-arith -Winline -Wcast-qual  -Wundef -Wno-pointer-sign -fformat-extensions  -Wmissing-include-dirs -fdiagnostics-show-option  -Wno-error-tautological-compare -Wno-error-empty-body  -Wno-error-parentheses-equality -Wno-error-unused-function    -c nic_uio.c -o nic_uio.o
objcopy --strip-debug contigmem.ko
INSTALL-MODULE contigmem.ko
== Build drivers
ld      -L/tmp/FreeBSD_K10.3_GCC4.8.5/x86_64-native-bsdapp-gcc/d1f1def0ab3f48ecae99e77a82bbe165/dpdk/x86_64-native-bsdapp-gcc/lib -d -warn-common -r -d -o nic_uio.ko nic_uio.o
:> export_syms
--
  PMDINFO i40e_ethdev_vf.o.pmd.c
  CC i40e_ethdev_vf.o.pmd.o
  LD i40e_ethdev_vf.o
  CC i40e_pf.o
/tmp/FreeBSD_K10.3_GCC4.8.5/x86_64-native-bsdapp-gcc/d1f1def0ab3f48ecae99e77a82bbe165/dpdk/drivers/net/i40e/i40e_pf.c: In function 'i40e_pf_host_process_cmd_request_queues':
/tmp/FreeBSD_K10.3_GCC4.8.5/x86_64-native-bsdapp-gcc/d1f1def0ab3f48ecae99e77a82bbe165/dpdk/drivers/net/i40e/i40e_pf.c:1254:20: warning: missing terminating " character
   PMD_DRV_LOG(ERR, "VF %d tried to request %d queues.
                    ^
/tmp/FreeBSD_K10.3_GCC4.8.5/x86_64-native-bsdapp-gcc/d1f1def0ab3f48ecae99e77a82bbe165/dpdk/drivers/net/i40e/i40e_pf.c:1255:19: warning: missing terminating " character
        Ignoring.\n", vf->vf_idx,
                   ^
In file included from /tmp/FreeBSD_K10.3_GCC4.8.5/x86_64-native-bsdapp-gcc/d1f1def0ab3f48ecae99e77a82bbe165/dpdk/drivers/net/i40e/i40e_pf.c:21:0:
/tmp/FreeBSD_K10.3_GCC4.8.5/x86_64-native-bsdapp-gcc/d1f1def0ab3f48ecae99e77a82bbe165/dpdk/drivers/net/i40e/i40e_pf.c:1254:20: error: missing terminating " character
   PMD_DRV_LOG(ERR, "VF %d tried to request %d queues.
                    ^
/tmp/FreeBSD_K10.3_GCC4.8.5/x86_64-native-bsdapp-gcc/d1f1def0ab3f48ecae99e77a82bbe165/dpdk/drivers/net/i40e/i40e_logs.h:37:59: note: in definition of macro 'PMD_DRV_LOG_RAW'
  rte_log(RTE_LOG_ ## level, i40e_logtype_driver, "%s(): " fmt, \
                                                           ^~~
/tmp/FreeBSD_K10.3_GCC4.8.5/x86_64-native-bsdapp-gcc/d1f1def0ab3f48ecae99e77a82bbe165/dpdk/drivers/net/i40e/i40e_pf.c:1254:3: note: in expansion of macro 'PMD_DRV_LOG'
   PMD_DRV_LOG(ERR, "VF %d tried to request %d queues.
   ^~~~~~~~~~~
/tmp/FreeBSD_K10.3_GCC4.8.5/x86_64-native-bsdapp-gcc/d1f1def0ab3f48ecae99e77a82bbe165/dpdk/drivers/net/i40e/i40e_pf.c:1255:8: error: expected ')' before 'Ignoring'
        Ignoring.\n", vf->vf_idx,
        ^
/tmp/FreeBSD_K10.3_GCC4.8.5/x86_64-native-bsdapp-gcc/d1f1def0ab3f48ecae99e77a82bbe165/dpdk/drivers/net/i40e/i40e_logs.h:37:59: note: in definition of macro 'PMD_DRV_LOG_RAW'
  rte_log(RTE_LOG_ ## level, i40e_logtype_driver, "%s(): " fmt, \
                                                           ^~~
/tmp/FreeBSD_K10.3_GCC4.8.5/x86_64-native-bsdapp-gcc/d1f1def0ab3f48ecae99e77a82bbe165/dpdk/drivers/net/i40e/i40e_pf.c:1254:3: note: in expansion of macro 'PMD_DRV_LOG'
   PMD_DRV_LOG(ERR, "VF %d tried to request %d queues.
   ^~~~~~~~~~~
/tmp/FreeBSD_K10.3_GCC4.8.5/x86_64-native-bsdapp-gcc/d1f1def0ab3f48ecae99e77a82bbe165/dpdk/drivers/net/i40e/i40e_pf.c:1255:17: error: stray '\' in program
        Ignoring.\n", vf->vf_idx,
                 ^
/tmp/FreeBSD_K10.3_GCC4.8.5/x86_64-native-bsdapp-gcc/d1f1def0ab3f48ecae99e77a82bbe165/dpdk/drivers/net/i40e/i40e_logs.h:37:59: note: in definition of macro 'PMD_DRV_LOG_RAW'
  rte_log(RTE_LOG_ ## level, i40e_logtype_driver, "%s(): " fmt, \
                                                           ^~~
/tmp/FreeBSD_K10.3_GCC4.8.5/x86_64-native-bsdapp-gcc/d1f1def0ab3f48ecae99e77a82bbe165/dpdk/drivers/net/i40e/i40e_pf.c:1254:3: note: in expansion of macro 'PMD_DRV_LOG'
   PMD_DRV_LOG(ERR, "VF %d tried to request %d queues.
   ^~~~~~~~~~~
/tmp/FreeBSD_K10.3_GCC4.8.5/x86_64-native-bsdapp-gcc/d1f1def0ab3f48ecae99e77a82bbe165/dpdk/drivers/net/i40e/i40e_pf.c:1255:19: error: missing terminating " character
        Ignoring.\n", vf->vf_idx,
                   ^
/tmp/FreeBSD_K10.3_GCC4.8.5/x86_64-native-bsdapp-gcc/d1f1def0ab3f48ecae99e77a82bbe165/dpdk/drivers/net/i40e/i40e_logs.h:37:59: note: in definition of macro 'PMD_DRV_LOG_RAW'
  rte_log(RTE_LOG_ ## level, i40e_logtype_driver, "%s(): " fmt, \
                                                           ^~~
/tmp/FreeBSD_K10.3_GCC4.8.5/x86_64-native-bsdapp-gcc/d1f1def0ab3f48ecae99e77a82bbe165/dpdk/drivers/net/i40e/i40e_pf.c:1254:3: note: in expansion of macro 'PMD_DRV_LOG'
   PMD_DRV_LOG(ERR, "VF %d tried to request %d queues.
   ^~~~~~~~~~~
/tmp/FreeBSD_K10.3_GCC4.8.5/x86_64-native-bsdapp-gcc/d1f1def0ab3f48ecae99e77a82bbe165/dpdk/drivers/net/i40e/i40e_logs.h:37:50: warning: format '%s' expects a matching 'char *' argument [-Wformat=]
  rte_log(RTE_LOG_ ## level, i40e_logtype_driver, "%s(): " fmt, \
                                                  ^
/tmp/FreeBSD_K10.3_GCC4.8.5/x86_64-native-bsdapp-gcc/d1f1def0ab3f48ecae99e77a82bbe165/dpdk/drivers/net/i40e/i40e_logs.h:41:2: note: in expansion of macro 'PMD_DRV_LOG_RAW'
  PMD_DRV_LOG_RAW(level, fmt "\n", ## args)
  ^~~~~~~~~~~~~~~
--
   PMD_DRV_LOG(ERR, "VF %d tried to request %d queues.
   ^~~~~~~~~~~
/tmp/FreeBSD_K10.3_GCC4.8.5/x86_64-native-bsdapp-gcc/d1f1def0ab3f48ecae99e77a82bbe165/dpdk/drivers/net/i40e/i40e_logs.h:37:52: note: format string is defined here
  rte_log(RTE_LOG_ ## level, i40e_logtype_driver, "%s(): " fmt, \
                                                   ~^
/tmp/FreeBSD_K10.3_GCC4.8.5/x86_64-native-bsdapp-gcc/d1f1def0ab3f48ecae99e77a82bbe165/dpdk/drivers/net/i40e/i40e_pf.c:1258:20: warning: missing terminating " character
   PMD_DRV_LOG(ERR, "VF %d tried to request more than
                    ^
/tmp/FreeBSD_K10.3_GCC4.8.5/x86_64-native-bsdapp-gcc/d1f1def0ab3f48ecae99e77a82bbe165/dpdk/drivers/net/i40e/i40e_pf.c:1259:20: warning: missing terminating " character
        %d queues.\n", vf->vf_idx,
                    ^
In file included from /tmp/FreeBSD_K10.3_GCC4.8.5/x86_64-native-bsdapp-gcc/d1f1def0ab3f48ecae99e77a82bbe165/dpdk/drivers/net/i40e/i40e_pf.c:21:0:
/tmp/FreeBSD_K10.3_GCC4.8.5/x86_64-native-bsdapp-gcc/d1f1def0ab3f48ecae99e77a82bbe165/dpdk/drivers/net/i40e/i40e_pf.c:1258:20: error: missing terminating " character
   PMD_DRV_LOG(ERR, "VF %d tried to request more than
                    ^
/tmp/FreeBSD_K10.3_GCC4.8.5/x86_64-native-bsdapp-gcc/d1f1def0ab3f48ecae99e77a82bbe165/dpdk/drivers/net/i40e/i40e_logs.h:37:59: note: in definition of macro 'PMD_DRV_LOG_RAW'
  rte_log(RTE_LOG_ ## level, i40e_logtype_driver, "%s(): " fmt, \
                                                           ^~~
/tmp/FreeBSD_K10.3_GCC4.8.5/x86_64-native-bsdapp-gcc/d1f1def0ab3f48ecae99e77a82bbe165/dpdk/drivers/net/i40e/i40e_pf.c:1258:3: note: in expansion of macro 'PMD_DRV_LOG'
   PMD_DRV_LOG(ERR, "VF %d tried to request more than
   ^~~~~~~~~~~
/tmp/FreeBSD_K10.3_GCC4.8.5/x86_64-native-bsdapp-gcc/d1f1def0ab3f48ecae99e77a82bbe165/dpdk/drivers/net/i40e/i40e_pf.c:1259:9: error: 'd' undeclared (first use in this function)
        %d queues.\n", vf->vf_idx,
         ^
/tmp/FreeBSD_K10.3_GCC4.8.5/x86_64-native-bsdapp-gcc/d1f1def0ab3f48ecae99e77a82bbe165/dpdk/drivers/net/i40e/i40e_logs.h:37:59: note: in definition of macro 'PMD_DRV_LOG_RAW'
  rte_log(RTE_LOG_ ## level, i40e_logtype_driver, "%s(): " fmt, \
                                                           ^~~
--
  rte_log(RTE_LOG_ ## level, i40e_logtype_driver, "%s(): " fmt, \
                                                           ^~~
/tmp/FreeBSD_K10.3_GCC4.8.5/x86_64-native-bsdapp-gcc/d1f1def0ab3f48ecae99e77a82bbe165/dpdk/drivers/net/i40e/i40e_pf.c:1258:3: note: in expansion of macro 'PMD_DRV_LOG'
   PMD_DRV_LOG(ERR, "VF %d tried to request more than
   ^~~~~~~~~~~
/tmp/FreeBSD_K10.3_GCC4.8.5/x86_64-native-bsdapp-gcc/d1f1def0ab3f48ecae99e77a82bbe165/dpdk/drivers/net/i40e/i40e_pf.c:1259:11: error: expected ')' before 'queues'
        %d queues.\n", vf->vf_idx,
           ^
/tmp/FreeBSD_K10.3_GCC4.8.5/x86_64-native-bsdapp-gcc/d1f1def0ab3f48ecae99e77a82bbe165/dpdk/drivers/net/i40e/i40e_logs.h:37:59: note: in definition of macro 'PMD_DRV_LOG_RAW'
  rte_log(RTE_LOG_ ## level, i40e_logtype_driver, "%s(): " fmt, \
                                                           ^~~
/tmp/FreeBSD_K10.3_GCC4.8.5/x86_64-native-bsdapp-gcc/d1f1def0ab3f48ecae99e77a82bbe165/dpdk/drivers/net/i40e/i40e_pf.c:1258:3: note: in expansion of macro 'PMD_DRV_LOG'
   PMD_DRV_LOG(ERR, "VF %d tried to request more than
   ^~~~~~~~~~~
/tmp/FreeBSD_K10.3_GCC4.8.5/x86_64-native-bsdapp-gcc/d1f1def0ab3f48ecae99e77a82bbe165/dpdk/drivers/net/i40e/i40e_pf.c:1259:18: error: stray '\' in program
        %d queues.\n", vf->vf_idx,
                  ^
/tmp/FreeBSD_K10.3_GCC4.8.5/x86_64-native-bsdapp-gcc/d1f1def0ab3f48ecae99e77a82bbe165/dpdk/drivers/net/i40e/i40e_logs.h:37:59: note: in definition of macro 'PMD_DRV_LOG_RAW'
  rte_log(RTE_LOG_ ## level, i40e_logtype_driver, "%s(): " fmt, \
                                                           ^~~
/tmp/FreeBSD_K10.3_GCC4.8.5/x86_64-native-bsdapp-gcc/d1f1def0ab3f48ecae99e77a82bbe165/dpdk/drivers/net/i40e/i40e_pf.c:1258:3: note: in expansion of macro 'PMD_DRV_LOG'
   PMD_DRV_LOG(ERR, "VF %d tried to request more than
   ^~~~~~~~~~~
/tmp/FreeBSD_K10.3_GCC4.8.5/x86_64-native-bsdapp-gcc/d1f1def0ab3f48ecae99e77a82bbe165/dpdk/drivers/net/i40e/i40e_pf.c:1259:20: error: missing terminating " character
        %d queues.\n", vf->vf_idx,
                    ^
/tmp/FreeBSD_K10.3_GCC4.8.5/x86_64-native-bsdapp-gcc/d1f1def0ab3f48ecae99e77a82bbe165/dpdk/drivers/net/i40e/i40e_logs.h:37:59: note: in definition of macro 'PMD_DRV_LOG_RAW'
  rte_log(RTE_LOG_ ## level, i40e_logtype_driver, "%s(): " fmt, \
                                                           ^~~
/tmp/FreeBSD_K10.3_GCC4.8.5/x86_64-native-bsdapp-gcc/d1f1def0ab3f48ecae99e77a82bbe165/dpdk/drivers/net/i40e/i40e_pf.c:1258:3: note: in expansion of macro 'PMD_DRV_LOG'
   PMD_DRV_LOG(ERR, "VF %d tried to request more than
   ^~~~~~~~~~~
/tmp/FreeBSD_K10.3_GCC4.8.5/x86_64-native-bsdapp-gcc/d1f1def0ab3f48ecae99e77a82bbe165/dpdk/drivers/net/i40e/i40e_pf.c:1263:20: warning: missing terminating " character
   PMD_DRV_LOG(ERR, "VF %d requested %d more queues,
                    ^
/tmp/FreeBSD_K10.3_GCC4.8.5/x86_64-native-bsdapp-gcc/d1f1def0ab3f48ecae99e77a82bbe165/dpdk/drivers/net/i40e/i40e_pf.c:1264:26: warning: missing terminating " character
        but noly %d left\n", vf->vf_idx,
                          ^
In file included from /tmp/FreeBSD_K10.3_GCC4.8.5/x86_64-native-bsdapp-gcc/d1f1def0ab3f48ecae99e77a82bbe165/dpdk/drivers/net/i40e/i40e_pf.c:21:0:
/tmp/FreeBSD_K10.3_GCC4.8.5/x86_64-native-bsdapp-gcc/d1f1def0ab3f48ecae99e77a82bbe165/dpdk/drivers/net/i40e/i40e_pf.c:1263:20: error: missing terminating " character
   PMD_DRV_LOG(ERR, "VF %d requested %d more queues,
                    ^
/tmp/FreeBSD_K10.3_GCC4.8.5/x86_64-native-bsdapp-gcc/d1f1def0ab3f48ecae99e77a82bbe165/dpdk/drivers/net/i40e/i40e_logs.h:37:59: note: in definition of macro 'PMD_DRV_LOG_RAW'
  rte_log(RTE_LOG_ ## level, i40e_logtype_driver, "%s(): " fmt, \
                                                           ^~~
/tmp/FreeBSD_K10.3_GCC4.8.5/x86_64-native-bsdapp-gcc/d1f1def0ab3f48ecae99e77a82bbe165/dpdk/drivers/net/i40e/i40e_pf.c:1263:3: note: in expansion of macro 'PMD_DRV_LOG'
   PMD_DRV_LOG(ERR, "VF %d requested %d more queues,
   ^~~~~~~~~~~
/tmp/FreeBSD_K10.3_GCC4.8.5/x86_64-native-bsdapp-gcc/d1f1def0ab3f48ecae99e77a82bbe165/dpdk/drivers/net/i40e/i40e_pf.c:1264:8: error: expected ')' before 'but'
        but noly %d left\n", vf->vf_idx,
        ^
/tmp/FreeBSD_K10.3_GCC4.8.5/x86_64-native-bsdapp-gcc/d1f1def0ab3f48ecae99e77a82bbe165/dpdk/drivers/net/i40e/i40e_logs.h:37:59: note: in definition of macro 'PMD_DRV_LOG_RAW'
  rte_log(RTE_LOG_ ## level, i40e_logtype_driver, "%s(): " fmt, \
                                                           ^~~
/tmp/FreeBSD_K10.3_GCC4.8.5/x86_64-native-bsdapp-gcc/d1f1def0ab3f48ecae99e77a82bbe165/dpdk/drivers/net/i40e/i40e_pf.c:1263:3: note: in expansion of macro 'PMD_DRV_LOG'
   PMD_DRV_LOG(ERR, "VF %d requested %d more queues,
   ^~~~~~~~~~~
/tmp/FreeBSD_K10.3_GCC4.8.5/x86_64-native-bsdapp-gcc/d1f1def0ab3f48ecae99e77a82bbe165/dpdk/drivers/net/i40e/i40e_pf.c:1264:24: error: stray '\' in program
        but noly %d left\n", vf->vf_idx,
                        ^
/tmp/FreeBSD_K10.3_GCC4.8.5/x86_64-native-bsdapp-gcc/d1f1def0ab3f48ecae99e77a82bbe165/dpdk/drivers/net/i40e/i40e_logs.h:37:59: note: in definition of macro 'PMD_DRV_LOG_RAW'
  rte_log(RTE_LOG_ ## level, i40e_logtype_driver, "%s(): " fmt, \
                                                           ^~~
/tmp/FreeBSD_K10.3_GCC4.8.5/x86_64-native-bsdapp-gcc/d1f1def0ab3f48ecae99e77a82bbe165/dpdk/drivers/net/i40e/i40e_pf.c:1263:3: note: in expansion of macro 'PMD_DRV_LOG'
   PMD_DRV_LOG(ERR, "VF %d requested %d more queues,
   ^~~~~~~~~~~
/tmp/FreeBSD_K10.3_GCC4.8.5/x86_64-native-bsdapp-gcc/d1f1def0ab3f48ecae99e77a82bbe165/dpdk/drivers/net/i40e/i40e_pf.c:1264:26: error: missing terminating " character
        but noly %d left\n", vf->vf_idx,
                          ^
/tmp/FreeBSD_K10.3_GCC4.8.5/x86_64-native-bsdapp-gcc/d1f1def0ab3f48ecae99e77a82bbe165/dpdk/drivers/net/i40e/i40e_logs.h:37:59: note: in definition of macro 'PMD_DRV_LOG_RAW'
  rte_log(RTE_LOG_ ## level, i40e_logtype_driver, "%s(): " fmt, \
                                                           ^~~
/tmp/FreeBSD_K10.3_GCC4.8.5/x86_64-native-bsdapp-gcc/d1f1def0ab3f48ecae99e77a82bbe165/dpdk/drivers/net/i40e/i40e_pf.c:1263:3: note: in expansion of macro 'PMD_DRV_LOG'
   PMD_DRV_LOG(ERR, "VF %d requested %d more queues,
   ^~~~~~~~~~~
/tmp/FreeBSD_K10.3_GCC4.8.5/x86_64-native-bsdapp-gcc/d1f1def0ab3f48ecae99e77a82bbe165/dpdk/drivers/net/i40e/i40e_logs.h:37:50: warning: format '%s' expects a matching 'char *' argument [-Wformat=]
  rte_log(RTE_LOG_ ## level, i40e_logtype_driver, "%s(): " fmt, \
                                                  ^
/tmp/FreeBSD_K10.3_GCC4.8.5/x86_64-native-bsdapp-gcc/d1f1def0ab3f48ecae99e77a82bbe165/dpdk/drivers/net/i40e/i40e_logs.h:41:2: note: in expansion of macro 'PMD_DRV_LOG_RAW'
  PMD_DRV_LOG_RAW(level, fmt "\n", ## args)
  ^~~~~~~~~~~~~~~

*Failed Build #15:
OS: FC24
Target: i686-native-linuxapp-gcc
  PMDINFO i40e_ethdev.o.pmd.c
  CC i40e_ethdev.o.pmd.o
  LD i40e_ethdev.o
  CC i40e_pf.o
/tmp/FC24_K4.5.5_GCC6.1.1/i686-native-linuxapp-gcc/d1f1def0ab3f48ecae99e77a82bbe165/dpdk/drivers/net/i40e/i40e_pf.c: In function ‘i40e_pf_host_process_cmd_request_queues’:
/tmp/FC24_K4.5.5_GCC6.1.1/i686-native-linuxapp-gcc/d1f1def0ab3f48ecae99e77a82bbe165/dpdk/drivers/net/i40e/i40e_pf.c:1254:20: warning: missing terminating " character
   PMD_DRV_LOG(ERR, "VF %d tried to request %d queues.
                    ^
/tmp/FC24_K4.5.5_GCC6.1.1/i686-native-linuxapp-gcc/d1f1def0ab3f48ecae99e77a82bbe165/dpdk/drivers/net/i40e/i40e_pf.c:1255:19: warning: missing terminating " character
        Ignoring.\n", vf->vf_idx,
                   ^
In file included from /tmp/FC24_K4.5.5_GCC6.1.1/i686-native-linuxapp-gcc/d1f1def0ab3f48ecae99e77a82bbe165/dpdk/drivers/net/i40e/i40e_pf.c:21:0:
/tmp/FC24_K4.5.5_GCC6.1.1/i686-native-linuxapp-gcc/d1f1def0ab3f48ecae99e77a82bbe165/dpdk/drivers/net/i40e/i40e_pf.c:1254:20: error: missing terminating " character
   PMD_DRV_LOG(ERR, "VF %d tried to request %d queues.
                    ^
/tmp/FC24_K4.5.5_GCC6.1.1/i686-native-linuxapp-gcc/d1f1def0ab3f48ecae99e77a82bbe165/dpdk/drivers/net/i40e/i40e_logs.h:37:59: note: in definition of macro ‘PMD_DRV_LOG_RAW’
  rte_log(RTE_LOG_ ## level, i40e_logtype_driver, "%s(): " fmt, \
                                                           ^~~
/tmp/FC24_K4.5.5_GCC6.1.1/i686-native-linuxapp-gcc/d1f1def0ab3f48ecae99e77a82bbe165/dpdk/drivers/net/i40e/i40e_pf.c:1254:3: note: in expansion of macro ‘PMD_DRV_LOG’
   PMD_DRV_LOG(ERR, "VF %d tried to request %d queues.
   ^~~~~~~~~~~
/tmp/FC24_K4.5.5_GCC6.1.1/i686-native-linuxapp-gcc/d1f1def0ab3f48ecae99e77a82bbe165/dpdk/drivers/net/i40e/i40e_pf.c:1255:8: error: expected ‘)’ before ‘Ignoring’
        Ignoring.\n", vf->vf_idx,
        ^
/tmp/FC24_K4.5.5_GCC6.1.1/i686-native-linuxapp-gcc/d1f1def0ab3f48ecae99e77a82bbe165/dpdk/drivers/net/i40e/i40e_logs.h:37:59: note: in definition of macro ‘PMD_DRV_LOG_RAW’
  rte_log(RTE_LOG_ ## level, i40e_logtype_driver, "%s(): " fmt, \
                                                           ^~~
/tmp/FC24_K4.5.5_GCC6.1.1/i686-native-linuxapp-gcc/d1f1def0ab3f48ecae99e77a82bbe165/dpdk/drivers/net/i40e/i40e_pf.c:1254:3: note: in expansion of macro ‘PMD_DRV_LOG’
   PMD_DRV_LOG(ERR, "VF %d tried to request %d queues.
   ^~~~~~~~~~~
/tmp/FC24_K4.5.5_GCC6.1.1/i686-native-linuxapp-gcc/d1f1def0ab3f48ecae99e77a82bbe165/dpdk/drivers/net/i40e/i40e_pf.c:1255:17: error: stray ‘\’ in program
        Ignoring.\n", vf->vf_idx,
                 ^
/tmp/FC24_K4.5.5_GCC6.1.1/i686-native-linuxapp-gcc/d1f1def0ab3f48ecae99e77a82bbe165/dpdk/drivers/net/i40e/i40e_logs.h:37:59: note: in definition of macro ‘PMD_DRV_LOG_RAW’
  rte_log(RTE_LOG_ ## level, i40e_logtype_driver, "%s(): " fmt, \
                                                           ^~~
/tmp/FC24_K4.5.5_GCC6.1.1/i686-native-linuxapp-gcc/d1f1def0ab3f48ecae99e77a82bbe165/dpdk/drivers/net/i40e/i40e_pf.c:1254:3: note: in expansion of macro ‘PMD_DRV_LOG’
   PMD_DRV_LOG(ERR, "VF %d tried to request %d queues.
   ^~~~~~~~~~~
/tmp/FC24_K4.5.5_GCC6.1.1/i686-native-linuxapp-gcc/d1f1def0ab3f48ecae99e77a82bbe165/dpdk/drivers/net/i40e/i40e_pf.c:1255:19: error: missing terminating " character
        Ignoring.\n", vf->vf_idx,
                   ^
/tmp/FC24_K4.5.5_GCC6.1.1/i686-native-linuxapp-gcc/d1f1def0ab3f48ecae99e77a82bbe165/dpdk/drivers/net/i40e/i40e_logs.h:37:59: note: in definition of macro ‘PMD_DRV_LOG_RAW’
  rte_log(RTE_LOG_ ## level, i40e_logtype_driver, "%s(): " fmt, \
                                                           ^~~
/tmp/FC24_K4.5.5_GCC6.1.1/i686-native-linuxapp-gcc/d1f1def0ab3f48ecae99e77a82bbe165/dpdk/drivers/net/i40e/i40e_pf.c:1254:3: note: in expansion of macro ‘PMD_DRV_LOG’
   PMD_DRV_LOG(ERR, "VF %d tried to request %d queues.
   ^~~~~~~~~~~
/tmp/FC24_K4.5.5_GCC6.1.1/i686-native-linuxapp-gcc/d1f1def0ab3f48ecae99e77a82bbe165/dpdk/drivers/net/i40e/i40e_logs.h:37:50: warning: format ‘%s’ expects a matching ‘char *’ argument [-Wformat=]
  rte_log(RTE_LOG_ ## level, i40e_logtype_driver, "%s(): " fmt, \
                                                  ^
/tmp/FC24_K4.5.5_GCC6.1.1/i686-native-linuxapp-gcc/d1f1def0ab3f48ecae99e77a82bbe165/dpdk/drivers/net/i40e/i40e_logs.h:41:2: note: in expansion of macro ‘PMD_DRV_LOG_RAW’
  PMD_DRV_LOG_RAW(level, fmt "\n", ## args)
  ^~~~~~~~~~~~~~~
/tmp/FC24_K4.5.5_GCC6.1.1/i686-native-linuxapp-gcc/d1f1def0ab3f48ecae99e77a82bbe165/dpdk/drivers/net/i40e/i40e_pf.c:1254:3: note: in expansion of macro ‘PMD_DRV_LOG’
   PMD_DRV_LOG(ERR, "VF %d tried to request %d queues.
   ^~~~~~~~~~~
/tmp/FC24_K4.5.5_GCC6.1.1/i686-native-linuxapp-gcc/d1f1def0ab3f48ecae99e77a82bbe165/dpdk/drivers/net/i40e/i40e_pf.c:1258:20: warning: missing terminating " character
   PMD_DRV_LOG(ERR, "VF %d tried to request more than
                    ^
/tmp/FC24_K4.5.5_GCC6.1.1/i686-native-linuxapp-gcc/d1f1def0ab3f48ecae99e77a82bbe165/dpdk/drivers/net/i40e/i40e_pf.c:1259:20: warning: missing terminating " character
        %d queues.\n", vf->vf_idx,
                    ^
In file included from /tmp/FC24_K4.5.5_GCC6.1.1/i686-native-linuxapp-gcc/d1f1def0ab3f48ecae99e77a82bbe165/dpdk/drivers/net/i40e/i40e_pf.c:21:0:
/tmp/FC24_K4.5.5_GCC6.1.1/i686-native-linuxapp-gcc/d1f1def0ab3f48ecae99e77a82bbe165/dpdk/drivers/net/i40e/i40e_pf.c:1258:20: error: missing terminating " character
   PMD_DRV_LOG(ERR, "VF %d tried to request more than
                    ^
/tmp/FC24_K4.5.5_GCC6.1.1/i686-native-linuxapp-gcc/d1f1def0ab3f48ecae99e77a82bbe165/dpdk/drivers/net/i40e/i40e_logs.h:37:59: note: in definition of macro ‘PMD_DRV_LOG_RAW’
  rte_log(RTE_LOG_ ## level, i40e_logtype_driver, "%s(): " fmt, \
                                                           ^~~
/tmp/FC24_K4.5.5_GCC6.1.1/i686-native-linuxapp-gcc/d1f1def0ab3f48ecae99e77a82bbe165/dpdk/drivers/net/i40e/i40e_pf.c:1258:3: note: in expansion of macro ‘PMD_DRV_LOG’
   PMD_DRV_LOG(ERR, "VF %d tried to request more than
   ^~~~~~~~~~~
/tmp/FC24_K4.5.5_GCC6.1.1/i686-native-linuxapp-gcc/d1f1def0ab3f48ecae99e77a82bbe165/dpdk/drivers/net/i40e/i40e_pf.c:1259:9: error: ‘d’ undeclared (first use in this function)
        %d queues.\n", vf->vf_idx,
         ^
/tmp/FC24_K4.5.5_GCC6.1.1/i686-native-linuxapp-gcc/d1f1def0ab3f48ecae99e77a82bbe165/dpdk/drivers/net/i40e/i40e_logs.h:37:59: note: in definition of macro ‘PMD_DRV_LOG_RAW’
  rte_log(RTE_LOG_ ## level, i40e_logtype_driver, "%s(): " fmt, \
                                                           ^~~
--
  rte_log(RTE_LOG_ ## level, i40e_logtype_driver, "%s(): " fmt, \
                                                           ^~~
/tmp/FC24_K4.5.5_GCC6.1.1/i686-native-linuxapp-gcc/d1f1def0ab3f48ecae99e77a82bbe165/dpdk/drivers/net/i40e/i40e_pf.c:1258:3: note: in expansion of macro ‘PMD_DRV_LOG’
   PMD_DRV_LOG(ERR, "VF %d tried to request more than
   ^~~~~~~~~~~
/tmp/FC24_K4.5.5_GCC6.1.1/i686-native-linuxapp-gcc/d1f1def0ab3f48ecae99e77a82bbe165/dpdk/drivers/net/i40e/i40e_pf.c:1259:11: error: expected ‘)’ before ‘queues’
        %d queues.\n", vf->vf_idx,
           ^
/tmp/FC24_K4.5.5_GCC6.1.1/i686-native-linuxapp-gcc/d1f1def0ab3f48ecae99e77a82bbe165/dpdk/drivers/net/i40e/i40e_logs.h:37:59: note: in definition of macro ‘PMD_DRV_LOG_RAW’
  rte_log(RTE_LOG_ ## level, i40e_logtype_driver, "%s(): " fmt, \
                                                           ^~~
/tmp/FC24_K4.5.5_GCC6.1.1/i686-native-linuxapp-gcc/d1f1def0ab3f48ecae99e77a82bbe165/dpdk/drivers/net/i40e/i40e_pf.c:1258:3: note: in expansion of macro ‘PMD_DRV_LOG’
   PMD_DRV_LOG(ERR, "VF %d tried to request more than
   ^~~~~~~~~~~
/tmp/FC24_K4.5.5_GCC6.1.1/i686-native-linuxapp-gcc/d1f1def0ab3f48ecae99e77a82bbe165/dpdk/drivers/net/i40e/i40e_pf.c:1259:18: error: stray ‘\’ in program
        %d queues.\n", vf->vf_idx,
                  ^
/tmp/FC24_K4.5.5_GCC6.1.1/i686-native-linuxapp-gcc/d1f1def0ab3f48ecae99e77a82bbe165/dpdk/drivers/net/i40e/i40e_logs.h:37:59: note: in definition of macro ‘PMD_DRV_LOG_RAW’
  rte_log(RTE_LOG_ ## level, i40e_logtype_driver, "%s(): " fmt, \
                                                           ^~~
/tmp/FC24_K4.5.5_GCC6.1.1/i686-native-linuxapp-gcc/d1f1def0ab3f48ecae99e77a82bbe165/dpdk/drivers/net/i40e/i40e_pf.c:1258:3: note: in expansion of macro ‘PMD_DRV_LOG’
   PMD_DRV_LOG(ERR, "VF %d tried to request more than
   ^~~~~~~~~~~
/tmp/FC24_K4.5.5_GCC6.1.1/i686-native-linuxapp-gcc/d1f1def0ab3f48ecae99e77a82bbe165/dpdk/drivers/net/i40e/i40e_pf.c:1259:20: error: missing terminating " character
        %d queues.\n", vf->vf_idx,
                    ^
/tmp/FC24_K4.5.5_GCC6.1.1/i686-native-linuxapp-gcc/d1f1def0ab3f48ecae99e77a82bbe165/dpdk/drivers/net/i40e/i40e_logs.h:37:59: note: in definition of macro ‘PMD_DRV_LOG_RAW’
  rte_log(RTE_LOG_ ## level, i40e_logtype_driver, "%s(): " fmt, \
                                                           ^~~
/tmp/FC24_K4.5.5_GCC6.1.1/i686-native-linuxapp-gcc/d1f1def0ab3f48ecae99e77a82bbe165/dpdk/drivers/net/i40e/i40e_pf.c:1258:3: note: in expansion of macro ‘PMD_DRV_LOG’
   PMD_DRV_LOG(ERR, "VF %d tried to request more than
   ^~~~~~~~~~~
/tmp/FC24_K4.5.5_GCC6.1.1/i686-native-linuxapp-gcc/d1f1def0ab3f48ecae99e77a82bbe165/dpdk/drivers/net/i40e/i40e_pf.c:1263:20: warning: missing terminating " character
   PMD_DRV_LOG(ERR, "VF %d requested %d more queues,
                    ^
/tmp/FC24_K4.5.5_GCC6.1.1/i686-native-linuxapp-gcc/d1f1def0ab3f48ecae99e77a82bbe165/dpdk/drivers/net/i40e/i40e_pf.c:1264:26: warning: missing terminating " character
        but noly %d left\n", vf->vf_idx,
                          ^
In file included from /tmp/FC24_K4.5.5_GCC6.1.1/i686-native-linuxapp-gcc/d1f1def0ab3f48ecae99e77a82bbe165/dpdk/drivers/net/i40e/i40e_pf.c:21:0:
/tmp/FC24_K4.5.5_GCC6.1.1/i686-native-linuxapp-gcc/d1f1def0ab3f48ecae99e77a82bbe165/dpdk/drivers/net/i40e/i40e_pf.c:1263:20: error: missing terminating " character
   PMD_DRV_LOG(ERR, "VF %d requested %d more queues,
                    ^
/tmp/FC24_K4.5.5_GCC6.1.1/i686-native-linuxapp-gcc/d1f1def0ab3f48ecae99e77a82bbe165/dpdk/drivers/net/i40e/i40e_logs.h:37:59: note: in definition of macro ‘PMD_DRV_LOG_RAW’
  rte_log(RTE_LOG_ ## level, i40e_logtype_driver, "%s(): " fmt, \
                                                           ^~~
/tmp/FC24_K4.5.5_GCC6.1.1/i686-native-linuxapp-gcc/d1f1def0ab3f48ecae99e77a82bbe165/dpdk/drivers/net/i40e/i40e_pf.c:1263:3: note: in expansion of macro ‘PMD_DRV_LOG’
   PMD_DRV_LOG(ERR, "VF %d requested %d more queues,
   ^~~~~~~~~~~
/tmp/FC24_K4.5.5_GCC6.1.1/i686-native-linuxapp-gcc/d1f1def0ab3f48ecae99e77a82bbe165/dpdk/drivers/net/i40e/i40e_pf.c:1264:8: error: expected ‘)’ before ‘but’
        but noly %d left\n", vf->vf_idx,
        ^
/tmp/FC24_K4.5.5_GCC6.1.1/i686-native-linuxapp-gcc/d1f1def0ab3f48ecae99e77a82bbe165/dpdk/drivers/net/i40e/i40e_logs.h:37:59: note: in definition of macro ‘PMD_DRV_LOG_RAW’
  rte_log(RTE_LOG_ ## level, i40e_logtype_driver, "%s(): " fmt, \
                                                           ^~~
/tmp/FC24_K4.5.5_GCC6.1.1/i686-native-linuxapp-gcc/d1f1def0ab3f48ecae99e77a82bbe165/dpdk/drivers/net/i40e/i40e_pf.c:1263:3: note: in expansion of macro ‘PMD_DRV_LOG’
   PMD_DRV_LOG(ERR, "VF %d requested %d more queues,
   ^~~~~~~~~~~
/tmp/FC24_K4.5.5_GCC6.1.1/i686-native-linuxapp-gcc/d1f1def0ab3f48ecae99e77a82bbe165/dpdk/drivers/net/i40e/i40e_pf.c:1264:24: error: stray ‘\’ in program
        but noly %d left\n", vf->vf_idx,
                        ^
/tmp/FC24_K4.5.5_GCC6.1.1/i686-native-linuxapp-gcc/d1f1def0ab3f48ecae99e77a82bbe165/dpdk/drivers/net/i40e/i40e_logs.h:37:59: note: in definition of macro ‘PMD_DRV_LOG_RAW’
  rte_log(RTE_LOG_ ## level, i40e_logtype_driver, "%s(): " fmt, \
                                                           ^~~
/tmp/FC24_K4.5.5_GCC6.1.1/i686-native-linuxapp-gcc/d1f1def0ab3f48ecae99e77a82bbe165/dpdk/drivers/net/i40e/i40e_pf.c:1263:3: note: in expansion of macro ‘PMD_DRV_LOG’
   PMD_DRV_LOG(ERR, "VF %d requested %d more queues,
   ^~~~~~~~~~~
/tmp/FC24_K4.5.5_GCC6.1.1/i686-native-linuxapp-gcc/d1f1def0ab3f48ecae99e77a82bbe165/dpdk/drivers/net/i40e/i40e_pf.c:1264:26: error: missing terminating " character
        but noly %d left\n", vf->vf_idx,
                          ^
/tmp/FC24_K4.5.5_GCC6.1.1/i686-native-linuxapp-gcc/d1f1def0ab3f48ecae99e77a82bbe165/dpdk/drivers/net/i40e/i40e_logs.h:37:59: note: in definition of macro ‘PMD_DRV_LOG_RAW’
  rte_log(RTE_LOG_ ## level, i40e_logtype_driver, "%s(): " fmt, \
                                                           ^~~
/tmp/FC24_K4.5.5_GCC6.1.1/i686-native-linuxapp-gcc/d1f1def0ab3f48ecae99e77a82bbe165/dpdk/drivers/net/i40e/i40e_pf.c:1263:3: note: in expansion of macro ‘PMD_DRV_LOG’
   PMD_DRV_LOG(ERR, "VF %d requested %d more queues,
   ^~~~~~~~~~~
/tmp/FC24_K4.5.5_GCC6.1.1/i686-native-linuxapp-gcc/d1f1def0ab3f48ecae99e77a82bbe165/dpdk/drivers/net/i40e/i40e_logs.h:37:50: warning: format ‘%s’ expects a matching ‘char *’ argument [-Wformat=]
  rte_log(RTE_LOG_ ## level, i40e_logtype_driver, "%s(): " fmt, \
                                                  ^
/tmp/FC24_K4.5.5_GCC6.1.1/i686-native-linuxapp-gcc/d1f1def0ab3f48ecae99e77a82bbe165/dpdk/drivers/net/i40e/i40e_logs.h:41:2: note: in expansion of macro ‘PMD_DRV_LOG_RAW’
  PMD_DRV_LOG_RAW(level, fmt "\n", ## args)
  ^~~~~~~~~~~~~~~
/tmp/FC24_K4.5.5_GCC6.1.1/i686-native-linuxapp-gcc/d1f1def0ab3f48ecae99e77a82bbe165/dpdk/drivers/net/i40e/i40e_pf.c:1263:3: note: in expansion of macro ‘PMD_DRV_LOG’
   PMD_DRV_LOG(ERR, "VF %d requested %d more queues,
   ^~~~~~~~~~~
/tmp/FC24_K4.5.5_GCC6.1.1/i686-native-linuxapp-gcc/d1f1def0ab3f48ecae99e77a82bbe165/dpdk/mk/internal/rte.compile-pre.mk:114: recipe for target 'i40e_pf.o' failed
make[6]: *** [i40e_pf.o] Error 1
make[6]: *** Waiting for unfinished jobs....
== Build drivers/net/ixgbe
  SYMLINK-FILE include/rte_pmd_ixgbe.h
  CC ixgbe_common.o
  PMDINFO i40e_ethdev_vf.o.pmd.c
  CC i40e_ethdev_vf.o.pmd.o
  LD i40e_ethdev_vf.o
/tmp/FC24_K4.5.5_GCC6.1.1/i686-native-linuxapp-gcc/d1f1def0ab3f48ecae99e77a82bbe165/dpdk/mk/rte.subdir.mk:35: recipe for target 'i40e' failed
make[5]: *** [i40e] Error 2
make[5]: *** Waiting for unfinished jobs....
  CC ixgbe_82598.o
  CC ixgbe_82599.o
  CC ixgbe_x540.o
--
  CC rte_pmd_ixgbe.o
  CC ixgbe_tm.o
  CC ixgbe_vf_representor.o
  AR librte_pmd_ixgbe.a
  INSTALL-LIB librte_pmd_ixgbe.a
/tmp/FC24_K4.5.5_GCC6.1.1/i686-native-linuxapp-gcc/d1f1def0ab3f48ecae99e77a82bbe165/dpdk/mk/rte.subdir.mk:35: recipe for target 'net' failed
make[4]: *** [net] Error 2
/tmp/FC24_K4.5.5_GCC6.1.1/i686-native-linuxapp-gcc/d1f1def0ab3f48ecae99e77a82bbe165/dpdk/mk/rte.sdkbuild.mk:49: recipe for target 'drivers' failed
make[3]: *** [drivers] Error 2
/tmp/FC24_K4.5.5_GCC6.1.1/i686-native-linuxapp-gcc/d1f1def0ab3f48ecae99e77a82bbe165/dpdk/mk/rte.sdkroot.mk:100: recipe for target 'all' failed
make[2]: *** [all] Error 2
/tmp/FC24_K4.5.5_GCC6.1.1/i686-native-linuxapp-gcc/d1f1def0ab3f48ecae99e77a82bbe165/dpdk/mk/rte.sdkinstall.mk:57: recipe for target 'pre_install' failed
make[1]: *** [pre_install] Error 2
/tmp/FC24_K4.5.5_GCC6.1.1/i686-native-linuxapp-gcc/d1f1def0ab3f48ecae99e77a82bbe165/dpdk/mk/rte.sdkroot.mk:79: recipe for target 'install' failed
make: *** [install] Error 2

DPDK STV team


More information about the test-report mailing list