[dpdk-test-report] |FAILURE| pw49228[2/4] test/extmem: extend autotest to test without IOVA table

sys_stv at intel.com sys_stv at intel.com
Fri Dec 21 12:23:27 CET 2018


Test-Label: Intel-compilation
Test-Status: FAILURE
http://dpdk.org/patch/49228

_Compilation issues_

Submitter: Anatoly Burakov <anatoly.burakov at intel.com>
Date: 2018-12-21 11:09:13
DPDK git baseline: Repo:dpdk-master, CommitID: dafc04c15174e84ca04a7f4ebe67b10c059a5c0c

Build Summary: 15 Builds Done, 14 Successful, 1 Failures

Test environment and configuration as below:

OS: FC25
	Kernel Version: 4.5.5-300.fc24.x86_64
	CPU info: Intel(R) Xeon(R) CPU E5-2699 v3 @ 2.30GHz
	GCC Version: gcc (GCC) 6.1.1 20160510 (Red Hat 6.1.1-2)
	Clang Version: 3.8.0 (tags/RELEASE_380/final)
	x86_64-native-linuxapp-gcc
	x86_64-native-linuxapp-gcc-debug

OS: FC24
	Kernel Version: 4.9.13-100.fc24.x86_64
	CPU info: Intel(R) Xeon(R) CPU E5-2699 v3 @ 2.30GHz
	GCC Version: gcc (GCC) 6.3.1 20161221 (Red Hat 6.3.1-1)
	Clang Version: 3.8.1 (tags/RELEASE_381/final)
	x86_64-native-linuxapp-gcc-shared
	i686-native-linuxapp-gcc
	x86_64-native-linuxapp-clang

OS: CENTOS
	Kernel Version: 3.10.0-514.10.2.el7.x86_64
	CPU info: Intel(R) Xeon(R) CPU E5-2699 v3 @ 2.30GHz
	GCC Version: gcc (GCC) 4.8.5 20150623 (Red Hat 4.8.5-36)
	Clang Version: 3.4.2 (tags/RELEASE_34/dot2-final)
	x86_64-native-linuxapp-clang
	x86_64-native-linuxapp-gcc
	i686-native-linuxapp-gcc
	x86_64-native-linuxapp-gcc-shared

OS: UB1604
	Kernel Version: 4.4.0-78-generic
	CPU info: Intel(R) Xeon(R) CPU E5-2699 v3 @ 2.30GHz
	GCC Version: gcc (Ubuntu 5.4.0-6ubuntu1~16.04.10) 5.4.0 20160609
	Clang Version: 3.8.0-2ubuntu4 (tags/RELEASE_380/final)
	x86_64-native-linuxapp-gcc
	x86_64-native-linuxapp-gcc-shared
	x86_64-native-linuxapp-clang
	i686-native-linuxapp-gcc

OS: FreeBSD
	Kernel Version: 10.3-RELEASE
	CPU info: Intel(R) Xeon(R) CPU E5-2699 v3 @ 2.30GHz (2294.75-MHz K8-class CPU)
	GCC Version: gcc (FreeBSD Ports Collection) 7.3.0
	Clang Version: 3.4.1 (tags/RELEASE_34/dot1-final 208032) 20140512
	x86_64-native-bsdapp-clang
	x86_64-native-bsdapp-gcc

*Failed Build #1:
OS: UB1604
Target: x86_64-native-linuxapp-gcc-shared
/root/regression_ci/extra.sh: 29: /root/regression_ci/extra.sh: [[: not found
/root/regression_ci/extra.sh: 33: [: x86_64-native-linuxapp-gcc-shared: unexpected operator
/root/regression_ci/extra.sh: 37: [: x86_64-native-linuxapp-gcc-shared: unexpected operator
/root/regression_ci/extra.sh: 43: /root/regression_ci/extra.sh: [[: not found
make[3]: *** No rule to make target '/tmp/UB1604_K4.4.0_GCC5.4.0/x86_64-native-linuxapp-gcc-shared/690b34bc37c84b14bde79ca1e069a920/dpdk/config/defconfig_x86_64-native-linuxapp-gcc-shared', needed by '/tmp/UB1604_K4.4.0_GCC5.4.0/x86_64-native-linuxapp-gcc-shared/690b34bc37c84b14bde79ca1e069a920/dpdk/x86_64-native-linuxapp-gcc-shared/.config'.  Stop.
/tmp/UB1604_K4.4.0_GCC5.4.0/x86_64-native-linuxapp-gcc-shared/690b34bc37c84b14bde79ca1e069a920/dpdk/mk/rte.sdkroot.mk:65: recipe for target 'config' failed
make[2]: *** [config] Error 2
/tmp/UB1604_K4.4.0_GCC5.4.0/x86_64-native-linuxapp-gcc-shared/690b34bc37c84b14bde79ca1e069a920/dpdk/mk/rte.sdkinstall.mk:57: recipe for target 'pre_install' failed
make[1]: *** [pre_install] Error 2
/tmp/UB1604_K4.4.0_GCC5.4.0/x86_64-native-linuxapp-gcc-shared/690b34bc37c84b14bde79ca1e069a920/dpdk/mk/rte.sdkroot.mk:79: recipe for target 'install' failed
make: *** [install] Error 2

DPDK STV team


More information about the test-report mailing list