[dpdk-test-report] |FAILURE| pw40765[dpdk-dev, 21/22] net/vhost: enable port detach on secondary process

sys_stv at intel.com sys_stv at intel.com
Thu Jun 7 14:49:51 CEST 2018


Test-Label: Intel-compilation
Test-Status: FAILURE
http://dpdk.org/patch/40765

_Compilation issues_

Submitter: Qi Zhang <qi.z.zhang at intel.com>
Date: 2018-06-07 12:38:48
DPDK git baseline: Repo:dpdk-master, CommitID: b259da7b24e75b967e63f549177e507163719d1a

Build Summary: 15 Builds Done, 12 Successful, 3 Failures

Test environment and configuration as below:

OS: FC25
	Kernel Version: 4.9.13-100.fc24.x86_64
	CPU info: Intel(R) Xeon(R) CPU E5-2699 v3 @ 2.30GHz
	GCC Version: gcc (GCC) 6.2.1 20160916 (Red Hat 6.2.1-2)
	Clang Version: 3.8.0 (tags/RELEASE_380/final)
	x86_64-native-linuxapp-gcc
	x86_64-native-linuxapp-gcc-debug

OS: FC24
	Kernel Version: 4.5.5-300.fc24.x86_64
	CPU info: Intel(R) Xeon(R) CPU E5-2699 v3 @ 2.30GHz
	GCC Version: gcc (GCC) 6.1.1 20160510 (Red Hat 6.1.1-2)
	Clang Version: 3.8.0 (tags/RELEASE_380/final)
	x86_64-native-linuxapp-gcc-shared
	x86_64-native-linuxapp-clang
	i686-native-linuxapp-gcc

OS: CENTOS
	Kernel Version: 3.10.0-327.el7.x86_64
	CPU info: Intel(R) Xeon(R) CPU E5-2699 v3 @ 2.30GHz
	GCC Version: gcc (GCC) 4.8.5 20150623 (Red Hat 4.8.5-4)
	Clang Version: NA
	x86_64-native-linuxapp-gcc-shared
	x86_64-native-linuxapp-clang
	x86_64-native-linuxapp-gcc
	i686-native-linuxapp-gcc

OS: UB1604
	Kernel Version: 4.4.0-81-generic
	CPU info: Intel(R) Xeon(R) CPU E5-2699 v3 @ 2.30GHz
	GCC Version: gcc (Ubuntu 5.4.0-6ubuntu1~16.04.9) 5.4.0 20160609
	Clang Version: 3.8.0-2ubuntu4 (tags/RELEASE_380/final)
	x86_64-native-linuxapp-gcc
	x86_64-native-linuxapp-gcc-shared
	i686-native-linuxapp-gcc
	x86_64-native-linuxapp-clang

OS: FreeBSD
	Kernel Version: 10.3-RELEASE
	CPU info: Intel(R) Xeon(R) CPU E5-2699 v3 @ 2.30GHz (2294.75-MHz K8-class CPU)
	GCC Version: gcc (FreeBSD Ports Collection) 4.8.5
	Clang Version: 3.4.1 (tags/RELEASE_34/dot1-final 208032) 20140512
	x86_64-native-bsdapp-clang
	x86_64-native-bsdapp-gcc

*Failed Build #1:
OS: CENTOS
Target: x86_64-native-linuxapp-gcc-shared
  CC rte_spinlock.o
  CC rte_cycles.o
  LD librte_eal.so.7.1
eal.o: In function `rte_eal_init':
eal.c:(.text+0x19cd): undefined reference to `rte_eth_dev_mp_init'
collect2: error: ld returned 1 exit status
make[7]: *** [librte_eal.so.7.1] Error 1
make[6]: *** [eal] Error 2
make[5]: *** [linuxapp] Error 2
make[4]: *** [librte_eal] Error 2
make[3]: *** [lib] Error 2

*Failed Build #2:
OS: UB1604
Target: x86_64-native-linuxapp-gcc-shared
  CC rte_spinlock.o
  CC rte_cycles.o
  LD librte_eal.so.7.1
eal.o: In function `rte_eal_init':
eal.c:(.text+0x1b12): undefined reference to `rte_eth_dev_mp_init'
collect2: error: ld returned 1 exit status
/tmp/UB1604_K4.4.0_GCC5.4.0/x86_64-native-linuxapp-gcc-shared/7b630c9537394ae682f88b13f564d2c9/dpdk/mk/rte.lib.mk:98: recipe for target 'librte_eal.so.7.1' failed
make[7]: *** [librte_eal.so.7.1] Error 1
/tmp/UB1604_K4.4.0_GCC5.4.0/x86_64-native-linuxapp-gcc-shared/7b630c9537394ae682f88b13f564d2c9/dpdk/mk/rte.subdir.mk:35: recipe for target 'eal' failed
make[6]: *** [eal] Error 2
/tmp/UB1604_K4.4.0_GCC5.4.0/x86_64-native-linuxapp-gcc-shared/7b630c9537394ae682f88b13f564d2c9/dpdk/mk/rte.subdir.mk:35: recipe for target 'linuxapp' failed
make[5]: *** [linuxapp] Error 2
/tmp/UB1604_K4.4.0_GCC5.4.0/x86_64-native-linuxapp-gcc-shared/7b630c9537394ae682f88b13f564d2c9/dpdk/mk/rte.subdir.mk:35: recipe for target 'librte_eal' failed
make[4]: *** [librte_eal] Error 2
/tmp/UB1604_K4.4.0_GCC5.4.0/x86_64-native-linuxapp-gcc-shared/7b630c9537394ae682f88b13f564d2c9/dpdk/mk/rte.sdkbuild.mk:49: recipe for target 'lib' failed
make[3]: *** [lib] Error 2
/tmp/UB1604_K4.4.0_GCC5.4.0/x86_64-native-linuxapp-gcc-shared/7b630c9537394ae682f88b13f564d2c9/dpdk/mk/rte.sdkroot.mk:100: recipe for target 'all' failed
make[2]: *** [all] Error 2
/tmp/UB1604_K4.4.0_GCC5.4.0/x86_64-native-linuxapp-gcc-shared/7b630c9537394ae682f88b13f564d2c9/dpdk/mk/rte.sdkinstall.mk:57: recipe for target 'pre_install' failed
make[1]: *** [pre_install] Error 2
/tmp/UB1604_K4.4.0_GCC5.4.0/x86_64-native-linuxapp-gcc-shared/7b630c9537394ae682f88b13f564d2c9/dpdk/mk/rte.sdkroot.mk:79: recipe for target 'install' failed
make: *** [install] Error 2

*Failed Build #3:
OS: FC24
Target: x86_64-native-linuxapp-gcc-shared
  CC rte_spinlock.o
  CC rte_cycles.o
  LD librte_eal.so.7.1
eal.o: In function `rte_eal_init':
eal.c:(.text+0x1a47): undefined reference to `rte_eth_dev_mp_init'
collect2: error: ld returned 1 exit status
/tmp/FC24_K4.9.13_GCC6.2.1/x86_64-native-linuxapp-gcc-shared/7b630c9537394ae682f88b13f564d2c9/dpdk/mk/rte.lib.mk:98: recipe for target 'librte_eal.so.7.1' failed
make[7]: *** [librte_eal.so.7.1] Error 1
/tmp/FC24_K4.9.13_GCC6.2.1/x86_64-native-linuxapp-gcc-shared/7b630c9537394ae682f88b13f564d2c9/dpdk/mk/rte.subdir.mk:35: recipe for target 'eal' failed
make[6]: *** [eal] Error 2
/tmp/FC24_K4.9.13_GCC6.2.1/x86_64-native-linuxapp-gcc-shared/7b630c9537394ae682f88b13f564d2c9/dpdk/mk/rte.subdir.mk:35: recipe for target 'linuxapp' failed
make[5]: *** [linuxapp] Error 2
/tmp/FC24_K4.9.13_GCC6.2.1/x86_64-native-linuxapp-gcc-shared/7b630c9537394ae682f88b13f564d2c9/dpdk/mk/rte.subdir.mk:35: recipe for target 'librte_eal' failed
make[4]: *** [librte_eal] Error 2
/tmp/FC24_K4.9.13_GCC6.2.1/x86_64-native-linuxapp-gcc-shared/7b630c9537394ae682f88b13f564d2c9/dpdk/mk/rte.sdkbuild.mk:49: recipe for target 'lib' failed
make[3]: *** [lib] Error 2
/tmp/FC24_K4.9.13_GCC6.2.1/x86_64-native-linuxapp-gcc-shared/7b630c9537394ae682f88b13f564d2c9/dpdk/mk/rte.sdkroot.mk:100: recipe for target 'all' failed
make[2]: *** [all] Error 2
/tmp/FC24_K4.9.13_GCC6.2.1/x86_64-native-linuxapp-gcc-shared/7b630c9537394ae682f88b13f564d2c9/dpdk/mk/rte.sdkinstall.mk:57: recipe for target 'pre_install' failed
make[1]: *** [pre_install] Error 2
/tmp/FC24_K4.9.13_GCC6.2.1/x86_64-native-linuxapp-gcc-shared/7b630c9537394ae682f88b13f564d2c9/dpdk/mk/rte.sdkroot.mk:79: recipe for target 'install' failed
make: *** [install] Error 2

DPDK STV team


More information about the test-report mailing list