[dpdk-test-report] |FAILURE| pw38832 [PATCH v2 2/5] eal: allow symbolic log levels

sys_stv at intel.com sys_stv at intel.com
Mon May 7 16:07:00 CEST 2018


Test-Label: Intel-compilation
Test-Status: FAILURE
http://dpdk.org/patch/38832

_apply patch file failure_

Submitter: Stephen Hemminger <stephen at networkplumber.org>
Date: Tue, 24 Apr 2018 09:58:04 -0700
DPDK git baseline: Repo:dpdk-next-eventdev, Branch:master, CommitID:fcde84b5f85b3c1a5d5564299fd49c58ca20370d
                   Repo:dpdk-next-crypto, Branch:master, CommitID:ee73f98ef481f61eab2f7289f033c6f9113eee8a
                   Repo:dpdk-next-net, Branch:master, CommitID:29f4ab844cdb61d7241f7241fe860779516b9012
                   Repo:dpdk-next-virtio, Branch:master, CommitID:037c0996bc927342f157426739e0cb63f2db8689
                   Repo:dpdk, Branch:master, CommitID:ee73f98ef481f61eab2f7289f033c6f9113eee8a
                   
Apply patch file failed:
Repo: dpdk
38832:
patching file lib/librte_eal/common/eal_common_options.c
Hunk #1 FAILED at 917.
Hunk #2 FAILED at 934.
Hunk #3 FAILED at 972.
3 out of 3 hunks FAILED -- saving rejects to file lib/librte_eal/common/eal_common_options.c.rej

Repo: dpdk-next-crypto
38832:
patching file lib/librte_eal/common/eal_common_options.c
Hunk #1 FAILED at 917.
Hunk #2 FAILED at 934.
Hunk #3 FAILED at 972.
3 out of 3 hunks FAILED -- saving rejects to file lib/librte_eal/common/eal_common_options.c.rej

Repo: dpdk-next-net
38832:
patching file lib/librte_eal/common/eal_common_options.c
Hunk #1 FAILED at 917.
Hunk #2 FAILED at 934.
Hunk #3 FAILED at 972.
3 out of 3 hunks FAILED -- saving rejects to file lib/librte_eal/common/eal_common_options.c.rej

Repo: dpdk-next-virtio
38832:
patching file lib/librte_eal/common/eal_common_options.c
Hunk #1 FAILED at 917.
Hunk #2 FAILED at 934.
Hunk #3 FAILED at 972.
3 out of 3 hunks FAILED -- saving rejects to file lib/librte_eal/common/eal_common_options.c.rej

Repo: dpdk-next-eventdev
38832:
patching file lib/librte_eal/common/eal_common_options.c
Hunk #1 FAILED at 917.
Hunk #2 FAILED at 934.
Hunk #3 FAILED at 972.
3 out of 3 hunks FAILED -- saving rejects to file lib/librte_eal/common/eal_common_options.c.rej


DPDK STV team


More information about the test-report mailing list