[dpdk-test-report] |FAILURE| pw47642net/ixgbe: check jumbo frame enable parameter

sys_stv at intel.com sys_stv at intel.com
Thu Nov 1 09:12:28 CET 2018


Test-Label: Intel-compilation
Test-Status: FAILURE
http://dpdk.org/patch/47642

_Compilation issues_

Submitter: wei zhao <wei.zhao1 at intel.com>
Date: 2018-11-01 07:55:26
DPDK git baseline: Repo:dpdk-master, CommitID: 55e411b301c31ec8a0096f0f8d92cb544bd8274b

Build Summary: 15 Builds Done, 0 Successful, 15 Failures

Test environment and configuration as below:

OS: FC25
	Kernel Version: 4.5.5-300.fc24.x86_64
	CPU info: Intel(R) Xeon(R) CPU E5-2699 v3 @ 2.30GHz
	GCC Version: gcc (GCC) 6.1.1 20160510 (Red Hat 6.1.1-2)
	Clang Version: 3.8.0 (tags/RELEASE_380/final)
	x86_64-native-linuxapp-gcc
	x86_64-native-linuxapp-gcc-debug

OS: FC24
	Kernel Version: 4.9.13-100.fc24.x86_64
	CPU info: Intel(R) Xeon(R) CPU E5-2699 v3 @ 2.30GHz
	GCC Version: gcc (GCC) 6.2.1 20160916 (Red Hat 6.2.1-2)
	Clang Version: 3.8.0 (tags/RELEASE_380/final)
	x86_64-native-linuxapp-gcc-shared
	i686-native-linuxapp-gcc
	x86_64-native-linuxapp-clang

OS: CENTOS
	Kernel Version: 3.10.0-514.10.2.el7.x86_64
	CPU info: Intel(R) Xeon(R) CPU E5-2699 v3 @ 2.30GHz
	GCC Version: gcc (GCC) 4.8.5 20150623 (Red Hat 4.8.5-4)
	Clang Version: 3.4.2 (tags/RELEASE_34/dot2-final)
	x86_64-native-linuxapp-clang
	x86_64-native-linuxapp-gcc-shared
	i686-native-linuxapp-gcc
	x86_64-native-linuxapp-gcc

OS: UB1604
	Kernel Version: 4.4.0-78-generic
	CPU info: Intel(R) Xeon(R) CPU E5-2699 v3 @ 2.30GHz
	GCC Version: gcc (Ubuntu 5.4.0-6ubuntu1~16.04.10) 5.4.0 20160609
	Clang Version: 3.8.0-2ubuntu4 (tags/RELEASE_380/final)
	x86_64-native-linuxapp-gcc
	x86_64-native-linuxapp-gcc-shared
	x86_64-native-linuxapp-clang
	i686-native-linuxapp-gcc

OS: FreeBSD
	Kernel Version: 10.3-RELEASE
	CPU info: Intel(R) Xeon(R) CPU E5-2699 v3 @ 2.30GHz (2294.75-MHz K8-class CPU)
	GCC Version: gcc (FreeBSD Ports Collection) 7.3.0
	Clang Version: 3.4.1 (tags/RELEASE_34/dot1-final 208032) 20140512
	x86_64-native-bsdapp-clang
	x86_64-native-bsdapp-gcc

*Failed Build #1:
OS: FC25
Target: x86_64-native-linuxapp-gcc
  PMDINFO i40e_ethdev.o.pmd.c
  CC i40e_ethdev.o.pmd.o
  CC ixgbe_rxtx.o
  LD i40e_ethdev.o
  CC i40e_rxtx.o
/tmp/FC25_K4.8.6_GCC6.3.1/x86_64-native-linuxapp-gcc/6a5d6530fe8c4eb1949478e15e09272a/dpdk/drivers/net/ixgbe/ixgbe_rxtx.c:4818:1: warning: no previous prototype for ‘ixgbe_dev_jumboenable_check’ [-Wmissing-prototypes]
 ixgbe_dev_jumboenable_check(struct rte_eth_dev *dev,
 ^~~~~~~~~~~~~~~~~~~~~~~~~~~
/tmp/FC25_K4.8.6_GCC6.3.1/x86_64-native-linuxapp-gcc/6a5d6530fe8c4eb1949478e15e09272a/dpdk/drivers/net/ixgbe/ixgbe_rxtx.c: In function ‘ixgbe_dev_jumboenable_check’:
/tmp/FC25_K4.8.6_GCC6.3.1/x86_64-native-linuxapp-gcc/6a5d6530fe8c4eb1949478e15e09272a/dpdk/drivers/net/ixgbe/ixgbe_rxtx.c:4823:2: warning: implicit declaration of function ‘ixgbe_dev_info_get’ [-Wimplicit-function-declaration]
  ixgbe_dev_info_get(dev, &dev_info);
  ^~~~~~~~~~~~~~~~~~
/tmp/FC25_K4.8.6_GCC6.3.1/x86_64-native-linuxapp-gcc/6a5d6530fe8c4eb1949478e15e09272a/dpdk/drivers/net/ixgbe/ixgbe_rxtx.c:4823:2: warning: nested extern declaration of ‘ixgbe_dev_info_get’ [-Wnested-externs]
  CC i40e_rxtx_vec_sse.o
  CC ixgbe_ethdev.o
  CC i40e_ethdev_vf.o
  PMDINFO i40e_ethdev_vf.o.pmd.c
  CC i40e_ethdev_vf.o.pmd.o
--
  AR librte_pmd_dpaa2_qdma.a
  INSTALL-LIB librte_pmd_dpaa2_qdma.a
  CC ifpga_fme.o
  CC ifpga_fme_iperf.o
  CC ifpga_fme_dperf.o
  CC ifpga_fme_error.o
  CC ifpga_port.o
  CC ifpga_port_error.o
  CC opae_hw_api.o
  CC opae_ifpga_hw_api.o
  CC opae_debug.o
  CC ifpga_fme_pr.o
  CC ifpga_rawdev.o
--
  CC main.o
  CC testpmd.o
  LD dpdk-procinfo
/tmp/FC25_K4.8.6_GCC6.3.1/x86_64-native-linuxapp-gcc/6a5d6530fe8c4eb1949478e15e09272a/dpdk/x86_64-native-linuxapp-gcc/lib/librte_pmd_ixgbe.a(ixgbe_rxtx.o): In function `ixgbe_dev_jumboenable_check':
ixgbe_rxtx.c:(.text.unlikely+0x1206): undefined reference to `ixgbe_dev_info_get'
collect2: error: ld returned 1 exit status
/tmp/FC25_K4.8.6_GCC6.3.1/x86_64-native-linuxapp-gcc/6a5d6530fe8c4eb1949478e15e09272a/dpdk/mk/rte.app.mk:392: recipe for target 'dpdk-procinfo' failed
make[5]: *** [dpdk-procinfo] Error 1
/tmp/FC25_K4.8.6_GCC6.3.1/x86_64-native-linuxapp-gcc/6a5d6530fe8c4eb1949478e15e09272a/dpdk/mk/rte.subdir.mk:35: recipe for target 'proc-info' failed
make[4]: *** [proc-info] Error 2
make[4]: *** Waiting for unfinished jobs....
  CC parameters.o
  CC cmdline.o
  CC cmdline_flow.o
--
  CC util.o
  CC softnicfwd.o
  LD testpmd
/tmp/FC25_K4.8.6_GCC6.3.1/x86_64-native-linuxapp-gcc/6a5d6530fe8c4eb1949478e15e09272a/dpdk/x86_64-native-linuxapp-gcc/lib/librte_pmd_ixgbe.a(ixgbe_rxtx.o): In function `ixgbe_dev_jumboenable_check':
ixgbe_rxtx.c:(.text.unlikely+0x1206): undefined reference to `ixgbe_dev_info_get'
collect2: error: ld returned 1 exit status
/tmp/FC25_K4.8.6_GCC6.3.1/x86_64-native-linuxapp-gcc/6a5d6530fe8c4eb1949478e15e09272a/dpdk/mk/rte.app.mk:392: recipe for target 'testpmd' failed
make[5]: *** [testpmd] Error 1
/tmp/FC25_K4.8.6_GCC6.3.1/x86_64-native-linuxapp-gcc/6a5d6530fe8c4eb1949478e15e09272a/dpdk/mk/rte.subdir.mk:35: recipe for target 'test-pmd' failed
make[4]: *** [test-pmd] Error 2
/tmp/FC25_K4.8.6_GCC6.3.1/x86_64-native-linuxapp-gcc/6a5d6530fe8c4eb1949478e15e09272a/dpdk/mk/rte.sdkbuild.mk:49: recipe for target 'app' failed
make[3]: *** [app] Error 2
/tmp/FC25_K4.8.6_GCC6.3.1/x86_64-native-linuxapp-gcc/6a5d6530fe8c4eb1949478e15e09272a/dpdk/mk/rte.sdkroot.mk:100: recipe for target 'all' failed
make[2]: *** [all] Error 2
/tmp/FC25_K4.8.6_GCC6.3.1/x86_64-native-linuxapp-gcc/6a5d6530fe8c4eb1949478e15e09272a/dpdk/mk/rte.sdkinstall.mk:57: recipe for target 'pre_install' failed
make[1]: *** [pre_install] Error 2
/tmp/FC25_K4.8.6_GCC6.3.1/x86_64-native-linuxapp-gcc/6a5d6530fe8c4eb1949478e15e09272a/dpdk/mk/rte.sdkroot.mk:79: recipe for target 'install' failed
make: *** [install] Error 2

*Failed Build #2:
OS: UB1604
Target: x86_64-native-linuxapp-gcc
  CC ixgbe_rxtx.o
  PMDINFO i40e_ethdev.o.pmd.c
  CC i40e_ethdev.o.pmd.o
  LD i40e_ethdev.o
  CC i40e_rxtx.o
/tmp/UB1604_K4.8.0_GCC6.2.0/x86_64-native-linuxapp-gcc/6a5d6530fe8c4eb1949478e15e09272a/dpdk/drivers/net/ixgbe/ixgbe_rxtx.c:4818:1: warning: no previous prototype for ‘ixgbe_dev_jumboenable_check’ [-Wmissing-prototypes]
 ixgbe_dev_jumboenable_check(struct rte_eth_dev *dev,
 ^~~~~~~~~~~~~~~~~~~~~~~~~~~
/tmp/UB1604_K4.8.0_GCC6.2.0/x86_64-native-linuxapp-gcc/6a5d6530fe8c4eb1949478e15e09272a/dpdk/drivers/net/ixgbe/ixgbe_rxtx.c: In function ‘ixgbe_dev_jumboenable_check’:
/tmp/UB1604_K4.8.0_GCC6.2.0/x86_64-native-linuxapp-gcc/6a5d6530fe8c4eb1949478e15e09272a/dpdk/drivers/net/ixgbe/ixgbe_rxtx.c:4823:2: warning: implicit declaration of function ‘ixgbe_dev_info_get’ [-Wimplicit-function-declaration]
  ixgbe_dev_info_get(dev, &dev_info);
  ^~~~~~~~~~~~~~~~~~
/tmp/UB1604_K4.8.0_GCC6.2.0/x86_64-native-linuxapp-gcc/6a5d6530fe8c4eb1949478e15e09272a/dpdk/drivers/net/ixgbe/ixgbe_rxtx.c:4823:2: warning: nested extern declaration of ‘ixgbe_dev_info_get’ [-Wnested-externs]
  CC ixgbe_ethdev.o
  CC i40e_rxtx_vec_sse.o
  CC i40e_ethdev_vf.o
  PMDINFO i40e_ethdev_vf.o.pmd.c
  CC i40e_ethdev_vf.o.pmd.o
--
  CC ifpga_enumerate.o
  CC ifpga_feature_dev.o
  CC ifpga_fme.o
  CC ifpga_fme_iperf.o
  CC ifpga_fme_dperf.o
  CC ifpga_fme_error.o
  CC ifpga_port.o
  CC ifpga_port_error.o
  CC opae_hw_api.o
  CC opae_ifpga_hw_api.o
  CC opae_debug.o
  CC ifpga_fme_pr.o
  CC ifpga_rawdev.o
--
  CC main.o
  CC testpmd.o
  LD dpdk-procinfo
/tmp/UB1604_K4.8.0_GCC6.2.0/x86_64-native-linuxapp-gcc/6a5d6530fe8c4eb1949478e15e09272a/dpdk/x86_64-native-linuxapp-gcc/lib/librte_pmd_ixgbe.a(ixgbe_rxtx.o): In function `ixgbe_dev_jumboenable_check':
ixgbe_rxtx.c:(.text.unlikely+0x1371): undefined reference to `ixgbe_dev_info_get'
collect2: error: ld returned 1 exit status
/tmp/UB1604_K4.8.0_GCC6.2.0/x86_64-native-linuxapp-gcc/6a5d6530fe8c4eb1949478e15e09272a/dpdk/mk/rte.app.mk:392: recipe for target 'dpdk-procinfo' failed
make[5]: *** [dpdk-procinfo] Error 1
/tmp/UB1604_K4.8.0_GCC6.2.0/x86_64-native-linuxapp-gcc/6a5d6530fe8c4eb1949478e15e09272a/dpdk/mk/rte.subdir.mk:35: recipe for target 'proc-info' failed
make[4]: *** [proc-info] Error 2
make[4]: *** Waiting for unfinished jobs....
  CC parameters.o
  CC cmdline.o
  CC cmdline_flow.o
--
  CC util.o
  CC softnicfwd.o
  LD testpmd
/tmp/UB1604_K4.8.0_GCC6.2.0/x86_64-native-linuxapp-gcc/6a5d6530fe8c4eb1949478e15e09272a/dpdk/x86_64-native-linuxapp-gcc/lib/librte_pmd_ixgbe.a(ixgbe_rxtx.o): In function `ixgbe_dev_jumboenable_check':
ixgbe_rxtx.c:(.text.unlikely+0x1371): undefined reference to `ixgbe_dev_info_get'
collect2: error: ld returned 1 exit status
/tmp/UB1604_K4.8.0_GCC6.2.0/x86_64-native-linuxapp-gcc/6a5d6530fe8c4eb1949478e15e09272a/dpdk/mk/rte.app.mk:392: recipe for target 'testpmd' failed
make[5]: *** [testpmd] Error 1
/tmp/UB1604_K4.8.0_GCC6.2.0/x86_64-native-linuxapp-gcc/6a5d6530fe8c4eb1949478e15e09272a/dpdk/mk/rte.subdir.mk:35: recipe for target 'test-pmd' failed
make[4]: *** [test-pmd] Error 2
/tmp/UB1604_K4.8.0_GCC6.2.0/x86_64-native-linuxapp-gcc/6a5d6530fe8c4eb1949478e15e09272a/dpdk/mk/rte.sdkbuild.mk:49: recipe for target 'app' failed
make[3]: *** [app] Error 2
/tmp/UB1604_K4.8.0_GCC6.2.0/x86_64-native-linuxapp-gcc/6a5d6530fe8c4eb1949478e15e09272a/dpdk/mk/rte.sdkroot.mk:100: recipe for target 'all' failed
make[2]: *** [all] Error 2
/tmp/UB1604_K4.8.0_GCC6.2.0/x86_64-native-linuxapp-gcc/6a5d6530fe8c4eb1949478e15e09272a/dpdk/mk/rte.sdkinstall.mk:57: recipe for target 'pre_install' failed
make[1]: *** [pre_install] Error 2
/tmp/UB1604_K4.8.0_GCC6.2.0/x86_64-native-linuxapp-gcc/6a5d6530fe8c4eb1949478e15e09272a/dpdk/mk/rte.sdkroot.mk:79: recipe for target 'install' failed
make: *** [install] Error 2

*Failed Build #3:
OS: CENTOS
Target: x86_64-native-linuxapp-clang
  CC i40e_rxtx_vec_sse.o
  CC ixgbe_dcb_82598.o
  CC ixgbe_mbx.o
  CC i40e_ethdev_vf.o
  CC ixgbe_rxtx.o
/tmp/CENTOS_K3.10.0_GCC4.8.5/x86_64-native-linuxapp-clang/6a5d6530fe8c4eb1949478e15e09272a/dpdk/drivers/net/ixgbe/ixgbe_rxtx.c:4818:1: warning: no previous prototype for function 'ixgbe_dev_jumboenable_check' [-Wmissing-prototypes]
ixgbe_dev_jumboenable_check(struct rte_eth_dev *dev,
^
/tmp/CENTOS_K3.10.0_GCC4.8.5/x86_64-native-linuxapp-clang/6a5d6530fe8c4eb1949478e15e09272a/dpdk/drivers/net/ixgbe/ixgbe_rxtx.c:4823:2: warning: implicit declaration of function 'ixgbe_dev_info_get' is invalid in C99 [-Wimplicit-function-declaration]
        ixgbe_dev_info_get(dev, &dev_info);
        ^
  PMDINFO i40e_ethdev_vf.o.pmd.c
  CC i40e_ethdev_vf.o.pmd.o
  LD i40e_ethdev_vf.o
  CC i40e_pf.o
  CC i40e_fdir.o
2 warnings generated.
  CC ixgbe_ethdev.o
  CC i40e_flow.o
  CC rte_pmd_i40e.o
  PMDINFO ixgbe_ethdev.o.pmd.c
  CC ixgbe_ethdev.o.pmd.o
--
  CC ifpga_fme.o
  AR librte_pmd_dpaa2_qdma.a
  INSTALL-LIB librte_pmd_dpaa2_qdma.a
  CC ifpga_fme_iperf.o
  CC ifpga_fme_dperf.o
  CC ifpga_fme_error.o
  CC ifpga_port.o
  CC ifpga_port_error.o
  CC opae_hw_api.o
  CC opae_ifpga_hw_api.o
  CC opae_debug.o
  CC ifpga_fme_pr.o
  CC ifpga_rawdev.o
--
  CC main.o
  CC testpmd.o
  LD dpdk-procinfo
/tmp/CENTOS_K3.10.0_GCC4.8.5/x86_64-native-linuxapp-clang/6a5d6530fe8c4eb1949478e15e09272a/dpdk/x86_64-native-linuxapp-clang/lib/librte_pmd_ixgbe.a(ixgbe_rxtx.o): In function `ixgbe_dev_jumboenable_check':
/tmp/CENTOS_K3.10.0_GCC4.8.5/x86_64-native-linuxapp-clang/6a5d6530fe8c4eb1949478e15e09272a/dpdk/drivers/net/ixgbe/ixgbe_rxtx.c:(.text+0x5b26): undefined reference to `ixgbe_dev_info_get'
clang: error: linker command failed with exit code 1 (use -v to see invocation)
make[5]: *** [dpdk-procinfo] Error 1
make[4]: *** [proc-info] Error 2
make[4]: *** Waiting for unfinished jobs....
  CC parameters.o
  CC cmdline.o
--
  CC util.o
  CC softnicfwd.o
  LD testpmd
/tmp/CENTOS_K3.10.0_GCC4.8.5/x86_64-native-linuxapp-clang/6a5d6530fe8c4eb1949478e15e09272a/dpdk/x86_64-native-linuxapp-clang/lib/librte_pmd_ixgbe.a(ixgbe_rxtx.o): In function `ixgbe_dev_jumboenable_check':
/tmp/CENTOS_K3.10.0_GCC4.8.5/x86_64-native-linuxapp-clang/6a5d6530fe8c4eb1949478e15e09272a/dpdk/drivers/net/ixgbe/ixgbe_rxtx.c:(.text+0x5b26): undefined reference to `ixgbe_dev_info_get'
clang: error: linker command failed with exit code 1 (use -v to see invocation)
make[5]: *** [testpmd] Error 1
make[4]: *** [test-pmd] Error 2
make[3]: *** [app] Error 2
make[2]: *** [all] Error 2
make[1]: *** [pre_install] Error 2

*Failed Build #4:
OS: CENTOS
Target: x86_64-native-linuxapp-gcc-shared
  CC i40e_pf.o
  CC ixgbe_dcb_82598.o
  CC ixgbe_mbx.o
  CC i40e_fdir.o
  CC ixgbe_rxtx.o
/tmp/CENTOS_K3.10.0_GCC4.8.5/x86_64-native-linuxapp-gcc-shared/6a5d6530fe8c4eb1949478e15e09272a/dpdk/drivers/net/ixgbe/ixgbe_rxtx.c:4818:1: warning: no previous prototype for ‘ixgbe_dev_jumboenable_check’ [-Wmissing-prototypes]
 ixgbe_dev_jumboenable_check(struct rte_eth_dev *dev,
 ^
/tmp/CENTOS_K3.10.0_GCC4.8.5/x86_64-native-linuxapp-gcc-shared/6a5d6530fe8c4eb1949478e15e09272a/dpdk/drivers/net/ixgbe/ixgbe_rxtx.c: In function ‘ixgbe_dev_jumboenable_check’:
/tmp/CENTOS_K3.10.0_GCC4.8.5/x86_64-native-linuxapp-gcc-shared/6a5d6530fe8c4eb1949478e15e09272a/dpdk/drivers/net/ixgbe/ixgbe_rxtx.c:4823:2: warning: implicit declaration of function ‘ixgbe_dev_info_get’ [-Wimplicit-function-declaration]
  ixgbe_dev_info_get(dev, &dev_info);
  ^
/tmp/CENTOS_K3.10.0_GCC4.8.5/x86_64-native-linuxapp-gcc-shared/6a5d6530fe8c4eb1949478e15e09272a/dpdk/drivers/net/ixgbe/ixgbe_rxtx.c:4823:2: warning: nested extern declaration of ‘ixgbe_dev_info_get’ [-Wnested-externs]
  CC i40e_flow.o
  CC rte_pmd_i40e.o
  CC ixgbe_ethdev.o
  CC i40e_tm.o
  CC i40e_vf_representor.o
--
  CC ixgbe_vf_representor.o
  CC hn_vf.o
  LD librte_pmd_ixgbe.so.2.1
ixgbe_rxtx.o: In function `ixgbe_dev_jumboenable_check':
ixgbe_rxtx.c:(.text.unlikely+0x1034): undefined reference to `ixgbe_dev_info_get'
collect2: error: ld returned 1 exit status
make[6]: *** [librte_pmd_ixgbe.so.2.1] Error 1
make[5]: *** [ixgbe] Error 2
make[5]: *** Waiting for unfinished jobs....
  LD librte_pmd_netvsc.so.1.1
  INSTALL-LIB librte_pmd_netvsc.so.1.1

*Failed Build #5:
OS: CENTOS
Target: i686-native-linuxapp-gcc
  CC ixgbe_dcb_82599.o
  CC ixgbe_dcb_82598.o
  CC i40e_fdir.o
  CC ixgbe_mbx.o
  CC ixgbe_rxtx.o
/tmp/CENTOS_K3.10.0_GCC4.8.5/i686-native-linuxapp-gcc/6a5d6530fe8c4eb1949478e15e09272a/dpdk/drivers/net/ixgbe/ixgbe_rxtx.c:4818:1: warning: no previous prototype for ‘ixgbe_dev_jumboenable_check’ [-Wmissing-prototypes]
 ixgbe_dev_jumboenable_check(struct rte_eth_dev *dev,
 ^
/tmp/CENTOS_K3.10.0_GCC4.8.5/i686-native-linuxapp-gcc/6a5d6530fe8c4eb1949478e15e09272a/dpdk/drivers/net/ixgbe/ixgbe_rxtx.c: In function ‘ixgbe_dev_jumboenable_check’:
/tmp/CENTOS_K3.10.0_GCC4.8.5/i686-native-linuxapp-gcc/6a5d6530fe8c4eb1949478e15e09272a/dpdk/drivers/net/ixgbe/ixgbe_rxtx.c:4823:2: warning: implicit declaration of function ‘ixgbe_dev_info_get’ [-Wimplicit-function-declaration]
  ixgbe_dev_info_get(dev, &dev_info);
  ^
/tmp/CENTOS_K3.10.0_GCC4.8.5/i686-native-linuxapp-gcc/6a5d6530fe8c4eb1949478e15e09272a/dpdk/drivers/net/ixgbe/ixgbe_rxtx.c:4823:2: warning: nested extern declaration of ‘ixgbe_dev_info_get’ [-Wnested-externs]
  CC i40e_flow.o
  CC rte_pmd_i40e.o
  CC ixgbe_ethdev.o
  CC i40e_tm.o
  CC i40e_vf_representor.o
--
  INSTALL-LIB librte_pmd_dpaa2_qdma.a
  CC ifpga_feature_dev.o
  CC ifpga_fme.o
  CC ifpga_fme_iperf.o
  CC ifpga_fme_dperf.o
  CC ifpga_fme_error.o
  CC ifpga_port.o
  CC ifpga_port_error.o
  CC opae_hw_api.o
  CC opae_ifpga_hw_api.o
  CC opae_debug.o
  CC ifpga_fme_pr.o
  CC ifpga_rawdev.o
--
  CC main.o
  CC testpmd.o
  LD dpdk-procinfo
/tmp/CENTOS_K3.10.0_GCC4.8.5/i686-native-linuxapp-gcc/6a5d6530fe8c4eb1949478e15e09272a/dpdk/i686-native-linuxapp-gcc/lib/librte_pmd_ixgbe.a(ixgbe_rxtx.o): In function `ixgbe_dev_jumboenable_check':
ixgbe_rxtx.c:(.text.unlikely+0xf96): undefined reference to `ixgbe_dev_info_get'
collect2: error: ld returned 1 exit status
make[5]: *** [dpdk-procinfo] Error 1
make[4]: *** [proc-info] Error 2
make[4]: *** Waiting for unfinished jobs....
  CC parameters.o
  CC cmdline.o
--
  CC util.o
  CC softnicfwd.o
  LD testpmd
/tmp/CENTOS_K3.10.0_GCC4.8.5/i686-native-linuxapp-gcc/6a5d6530fe8c4eb1949478e15e09272a/dpdk/i686-native-linuxapp-gcc/lib/librte_pmd_ixgbe.a(ixgbe_rxtx.o): In function `ixgbe_dev_jumboenable_check':
ixgbe_rxtx.c:(.text.unlikely+0xf96): undefined reference to `ixgbe_dev_info_get'
collect2: error: ld returned 1 exit status
make[5]: *** [testpmd] Error 1
make[4]: *** [test-pmd] Error 2
make[3]: *** [app] Error 2
make[2]: *** [all] Error 2
make[1]: *** [pre_install] Error 2

*Failed Build #6:
OS: CENTOS
Target: x86_64-native-linuxapp-gcc
  CC ixgbe_dcb_82599.o
  CC ixgbe_dcb_82598.o
  CC i40e_ethdev_vf.o
  CC ixgbe_mbx.o
  CC ixgbe_rxtx.o
/tmp/CENTOS_K3.10.0_GCC4.8.5/x86_64-native-linuxapp-gcc/6a5d6530fe8c4eb1949478e15e09272a/dpdk/drivers/net/ixgbe/ixgbe_rxtx.c:4818:1: warning: no previous prototype for ‘ixgbe_dev_jumboenable_check’ [-Wmissing-prototypes]
 ixgbe_dev_jumboenable_check(struct rte_eth_dev *dev,
 ^
/tmp/CENTOS_K3.10.0_GCC4.8.5/x86_64-native-linuxapp-gcc/6a5d6530fe8c4eb1949478e15e09272a/dpdk/drivers/net/ixgbe/ixgbe_rxtx.c: In function ‘ixgbe_dev_jumboenable_check’:
/tmp/CENTOS_K3.10.0_GCC4.8.5/x86_64-native-linuxapp-gcc/6a5d6530fe8c4eb1949478e15e09272a/dpdk/drivers/net/ixgbe/ixgbe_rxtx.c:4823:2: warning: implicit declaration of function ‘ixgbe_dev_info_get’ [-Wimplicit-function-declaration]
  ixgbe_dev_info_get(dev, &dev_info);
  ^
/tmp/CENTOS_K3.10.0_GCC4.8.5/x86_64-native-linuxapp-gcc/6a5d6530fe8c4eb1949478e15e09272a/dpdk/drivers/net/ixgbe/ixgbe_rxtx.c:4823:2: warning: nested extern declaration of ‘ixgbe_dev_info_get’ [-Wnested-externs]
  PMDINFO i40e_ethdev_vf.o.pmd.c
  CC i40e_ethdev_vf.o.pmd.o
  LD i40e_ethdev_vf.o
  CC i40e_pf.o
  CC i40e_fdir.o
--
  INSTALL-LIB librte_pmd_dpaa2_qdma.a
  CC ifpga_feature_dev.o
  CC ifpga_fme.o
  CC ifpga_fme_iperf.o
  CC ifpga_fme_dperf.o
  CC ifpga_fme_error.o
  CC ifpga_port.o
  CC ifpga_port_error.o
  CC opae_hw_api.o
  CC opae_ifpga_hw_api.o
  CC opae_debug.o
  CC ifpga_fme_pr.o
  CC ifpga_rawdev.o
--
  CC testpmd.o
  CC main.o
  LD dpdk-procinfo
/tmp/CENTOS_K3.10.0_GCC4.8.5/x86_64-native-linuxapp-gcc/6a5d6530fe8c4eb1949478e15e09272a/dpdk/x86_64-native-linuxapp-gcc/lib/librte_pmd_ixgbe.a(ixgbe_rxtx.o): In function `ixgbe_dev_jumboenable_check':
ixgbe_rxtx.c:(.text.unlikely+0xf8b): undefined reference to `ixgbe_dev_info_get'
collect2: error: ld returned 1 exit status
make[5]: *** [dpdk-procinfo] Error 1
make[4]: *** [proc-info] Error 2
make[4]: *** Waiting for unfinished jobs....
  CC parameters.o
  CC cmdline.o
--
  CC util.o
  CC softnicfwd.o
  LD testpmd
/tmp/CENTOS_K3.10.0_GCC4.8.5/x86_64-native-linuxapp-gcc/6a5d6530fe8c4eb1949478e15e09272a/dpdk/x86_64-native-linuxapp-gcc/lib/librte_pmd_ixgbe.a(ixgbe_rxtx.o): In function `ixgbe_dev_jumboenable_check':
ixgbe_rxtx.c:(.text.unlikely+0xf8b): undefined reference to `ixgbe_dev_info_get'
collect2: error: ld returned 1 exit status
make[5]: *** [testpmd] Error 1
make[4]: *** [test-pmd] Error 2
make[3]: *** [app] Error 2
make[2]: *** [all] Error 2
make[1]: *** [pre_install] Error 2

*Failed Build #7:
OS: UB1604
Target: x86_64-native-linuxapp-gcc-shared
  CC ixgbe_dcb_82599.o
  CC ixgbe_dcb_82598.o
  CC ixgbe_mbx.o
  CC ixgbe_rxtx.o
  CC i40e_rxtx_vec_sse.o
/tmp/UB1604_K4.4.0_GCC5.4.0/x86_64-native-linuxapp-gcc-shared/6a5d6530fe8c4eb1949478e15e09272a/dpdk/drivers/net/ixgbe/ixgbe_rxtx.c:4818:1: warning: no previous prototype for ‘ixgbe_dev_jumboenable_check’ [-Wmissing-prototypes]
 ixgbe_dev_jumboenable_check(struct rte_eth_dev *dev,
 ^
/tmp/UB1604_K4.4.0_GCC5.4.0/x86_64-native-linuxapp-gcc-shared/6a5d6530fe8c4eb1949478e15e09272a/dpdk/drivers/net/ixgbe/ixgbe_rxtx.c: In function ‘ixgbe_dev_jumboenable_check’:
/tmp/UB1604_K4.4.0_GCC5.4.0/x86_64-native-linuxapp-gcc-shared/6a5d6530fe8c4eb1949478e15e09272a/dpdk/drivers/net/ixgbe/ixgbe_rxtx.c:4823:2: warning: implicit declaration of function ‘ixgbe_dev_info_get’ [-Wimplicit-function-declaration]
  ixgbe_dev_info_get(dev, &dev_info);
  ^
/tmp/UB1604_K4.4.0_GCC5.4.0/x86_64-native-linuxapp-gcc-shared/6a5d6530fe8c4eb1949478e15e09272a/dpdk/drivers/net/ixgbe/ixgbe_rxtx.c:4823:2: warning: nested extern declaration of ‘ixgbe_dev_info_get’ [-Wnested-externs]
  CC i40e_ethdev_vf.o
  PMDINFO i40e_ethdev_vf.o.pmd.c
  CC i40e_ethdev_vf.o.pmd.o
  LD i40e_ethdev_vf.o
  CC i40e_pf.o
--
  CC lio_rxtx.o
  CC ixgbe_vf_representor.o
  LD librte_pmd_ixgbe.so.2.1
ixgbe_rxtx.o: In function `ixgbe_dev_jumboenable_check':
ixgbe_rxtx.c:(.text.unlikely+0x13ef): undefined reference to `ixgbe_dev_info_get'
collect2: error: ld returned 1 exit status
/tmp/UB1604_K4.4.0_GCC5.4.0/x86_64-native-linuxapp-gcc-shared/6a5d6530fe8c4eb1949478e15e09272a/dpdk/mk/rte.lib.mk:98: recipe for target 'librte_pmd_ixgbe.so.2.1' failed
make[6]: *** [librte_pmd_ixgbe.so.2.1] Error 1
/tmp/UB1604_K4.4.0_GCC5.4.0/x86_64-native-linuxapp-gcc-shared/6a5d6530fe8c4eb1949478e15e09272a/dpdk/mk/rte.subdir.mk:35: recipe for target 'ixgbe' failed
make[5]: *** [ixgbe] Error 2
make[5]: *** Waiting for unfinished jobs....
  CC lio_23xx_vf.o
  CC lio_mbox.o
  LD librte_pmd_lio.so.1.1
  INSTALL-LIB librte_pmd_lio.so.1.1
/tmp/UB1604_K4.4.0_GCC5.4.0/x86_64-native-linuxapp-gcc-shared/6a5d6530fe8c4eb1949478e15e09272a/dpdk/mk/rte.subdir.mk:35: recipe for target 'net' failed
make[4]: *** [net] Error 2
/tmp/UB1604_K4.4.0_GCC5.4.0/x86_64-native-linuxapp-gcc-shared/6a5d6530fe8c4eb1949478e15e09272a/dpdk/mk/rte.sdkbuild.mk:49: recipe for target 'drivers' failed
make[3]: *** [drivers] Error 2
/tmp/UB1604_K4.4.0_GCC5.4.0/x86_64-native-linuxapp-gcc-shared/6a5d6530fe8c4eb1949478e15e09272a/dpdk/mk/rte.sdkroot.mk:100: recipe for target 'all' failed
make[2]: *** [all] Error 2
/tmp/UB1604_K4.4.0_GCC5.4.0/x86_64-native-linuxapp-gcc-shared/6a5d6530fe8c4eb1949478e15e09272a/dpdk/mk/rte.sdkinstall.mk:57: recipe for target 'pre_install' failed
make[1]: *** [pre_install] Error 2
/tmp/UB1604_K4.4.0_GCC5.4.0/x86_64-native-linuxapp-gcc-shared/6a5d6530fe8c4eb1949478e15e09272a/dpdk/mk/rte.sdkroot.mk:79: recipe for target 'install' failed
make: *** [install] Error 2

*Failed Build #8:
OS: UB1604
Target: x86_64-native-linuxapp-clang
  PMDINFO i40e_ethdev.o.pmd.c
  CC i40e_ethdev.o.pmd.o
  LD i40e_ethdev.o
  CC i40e_rxtx.o
  CC ixgbe_rxtx.o
/tmp/UB1604_K4.4.0_GCC5.4.0/x86_64-native-linuxapp-clang/6a5d6530fe8c4eb1949478e15e09272a/dpdk/drivers/net/ixgbe/ixgbe_rxtx.c:4823:2: warning: implicit declaration of function 'ixgbe_dev_info_get' is invalid in C99 [-Wimplicit-function-declaration]
        ixgbe_dev_info_get(dev, &dev_info);
        ^
/tmp/UB1604_K4.4.0_GCC5.4.0/x86_64-native-linuxapp-clang/6a5d6530fe8c4eb1949478e15e09272a/dpdk/drivers/net/ixgbe/ixgbe_rxtx.c:4818:1: warning: no previous prototype for function 'ixgbe_dev_jumboenable_check' [-Wmissing-prototypes]
ixgbe_dev_jumboenable_check(struct rte_eth_dev *dev,
^
  CC i40e_rxtx_vec_sse.o
2 warnings generated.
  CC ixgbe_ethdev.o
  CC i40e_ethdev_vf.o
  PMDINFO i40e_ethdev_vf.o.pmd.c
  CC i40e_ethdev_vf.o.pmd.o
  LD i40e_ethdev_vf.o
--
  AR librte_pmd_dpaa2_qdma.a
  INSTALL-LIB librte_pmd_dpaa2_qdma.a
  CC ifpga_fme.o
  CC ifpga_fme_iperf.o
  CC ifpga_fme_dperf.o
  CC ifpga_fme_error.o
  CC ifpga_port.o
  CC ifpga_port_error.o
  CC opae_hw_api.o
  CC opae_ifpga_hw_api.o
  CC opae_debug.o
  CC ifpga_fme_pr.o
  CC ifpga_rawdev.o
--
  CC main.o
  CC testpmd.o
  LD dpdk-procinfo
/tmp/UB1604_K4.4.0_GCC5.4.0/x86_64-native-linuxapp-clang/6a5d6530fe8c4eb1949478e15e09272a/dpdk/x86_64-native-linuxapp-clang/lib/librte_pmd_ixgbe.a(ixgbe_rxtx.o): In function `ixgbe_dev_jumboenable_check':
/tmp/UB1604_K4.4.0_GCC5.4.0/x86_64-native-linuxapp-clang/6a5d6530fe8c4eb1949478e15e09272a/dpdk/drivers/net/ixgbe/ixgbe_rxtx.c:(.text+0x64a5): undefined reference to `ixgbe_dev_info_get'
clang: error: linker command failed with exit code 1 (use -v to see invocation)
/tmp/UB1604_K4.4.0_GCC5.4.0/x86_64-native-linuxapp-clang/6a5d6530fe8c4eb1949478e15e09272a/dpdk/mk/rte.app.mk:392: recipe for target 'dpdk-procinfo' failed
make[5]: *** [dpdk-procinfo] Error 1
/tmp/UB1604_K4.4.0_GCC5.4.0/x86_64-native-linuxapp-clang/6a5d6530fe8c4eb1949478e15e09272a/dpdk/mk/rte.subdir.mk:35: recipe for target 'proc-info' failed
make[4]: *** [proc-info] Error 2
make[4]: *** Waiting for unfinished jobs....
  CC parameters.o
  CC cmdline.o
  CC cmdline_flow.o
--
  CC util.o
  CC softnicfwd.o
  LD testpmd
/tmp/UB1604_K4.4.0_GCC5.4.0/x86_64-native-linuxapp-clang/6a5d6530fe8c4eb1949478e15e09272a/dpdk/x86_64-native-linuxapp-clang/lib/librte_pmd_ixgbe.a(ixgbe_rxtx.o): In function `ixgbe_dev_jumboenable_check':
/tmp/UB1604_K4.4.0_GCC5.4.0/x86_64-native-linuxapp-clang/6a5d6530fe8c4eb1949478e15e09272a/dpdk/drivers/net/ixgbe/ixgbe_rxtx.c:(.text+0x64a5): undefined reference to `ixgbe_dev_info_get'
clang: error: linker command failed with exit code 1 (use -v to see invocation)
/tmp/UB1604_K4.4.0_GCC5.4.0/x86_64-native-linuxapp-clang/6a5d6530fe8c4eb1949478e15e09272a/dpdk/mk/rte.app.mk:392: recipe for target 'testpmd' failed
make[5]: *** [testpmd] Error 1
/tmp/UB1604_K4.4.0_GCC5.4.0/x86_64-native-linuxapp-clang/6a5d6530fe8c4eb1949478e15e09272a/dpdk/mk/rte.subdir.mk:35: recipe for target 'test-pmd' failed
make[4]: *** [test-pmd] Error 2
/tmp/UB1604_K4.4.0_GCC5.4.0/x86_64-native-linuxapp-clang/6a5d6530fe8c4eb1949478e15e09272a/dpdk/mk/rte.sdkbuild.mk:49: recipe for target 'app' failed
make[3]: *** [app] Error 2
/tmp/UB1604_K4.4.0_GCC5.4.0/x86_64-native-linuxapp-clang/6a5d6530fe8c4eb1949478e15e09272a/dpdk/mk/rte.sdkroot.mk:100: recipe for target 'all' failed
make[2]: *** [all] Error 2
/tmp/UB1604_K4.4.0_GCC5.4.0/x86_64-native-linuxapp-clang/6a5d6530fe8c4eb1949478e15e09272a/dpdk/mk/rte.sdkinstall.mk:57: recipe for target 'pre_install' failed
make[1]: *** [pre_install] Error 2
/tmp/UB1604_K4.4.0_GCC5.4.0/x86_64-native-linuxapp-clang/6a5d6530fe8c4eb1949478e15e09272a/dpdk/mk/rte.sdkroot.mk:79: recipe for target 'install' failed
make: *** [install] Error 2

*Failed Build #9:
OS: UB1604
Target: i686-native-linuxapp-gcc
  PMDINFO i40e_ethdev.o.pmd.c
  CC i40e_ethdev.o.pmd.o
  LD i40e_ethdev.o
  CC i40e_rxtx.o
  CC ixgbe_rxtx.o
/tmp/UB1604_K4.4.0_GCC5.4.0/i686-native-linuxapp-gcc/6a5d6530fe8c4eb1949478e15e09272a/dpdk/drivers/net/ixgbe/ixgbe_rxtx.c:4818:1: warning: no previous prototype for ‘ixgbe_dev_jumboenable_check’ [-Wmissing-prototypes]
 ixgbe_dev_jumboenable_check(struct rte_eth_dev *dev,
 ^
/tmp/UB1604_K4.4.0_GCC5.4.0/i686-native-linuxapp-gcc/6a5d6530fe8c4eb1949478e15e09272a/dpdk/drivers/net/ixgbe/ixgbe_rxtx.c: In function ‘ixgbe_dev_jumboenable_check’:
/tmp/UB1604_K4.4.0_GCC5.4.0/i686-native-linuxapp-gcc/6a5d6530fe8c4eb1949478e15e09272a/dpdk/drivers/net/ixgbe/ixgbe_rxtx.c:4823:2: warning: implicit declaration of function ‘ixgbe_dev_info_get’ [-Wimplicit-function-declaration]
  ixgbe_dev_info_get(dev, &dev_info);
  ^
/tmp/UB1604_K4.4.0_GCC5.4.0/i686-native-linuxapp-gcc/6a5d6530fe8c4eb1949478e15e09272a/dpdk/drivers/net/ixgbe/ixgbe_rxtx.c:4823:2: warning: nested extern declaration of ‘ixgbe_dev_info_get’ [-Wnested-externs]
  CC i40e_rxtx_vec_sse.o
  CC ixgbe_ethdev.o
  CC i40e_ethdev_vf.o
  PMDINFO i40e_ethdev_vf.o.pmd.c
  CC i40e_ethdev_vf.o.pmd.o
--
  INSTALL-LIB librte_pmd_dpaa2_qdma.a
  CC ifpga_feature_dev.o
  CC ifpga_fme.o
  CC ifpga_fme_iperf.o
  CC ifpga_fme_dperf.o
  CC ifpga_fme_error.o
  CC ifpga_port.o
  CC ifpga_port_error.o
  CC opae_hw_api.o
  CC opae_ifpga_hw_api.o
  CC opae_debug.o
  CC ifpga_fme_pr.o
  CC ifpga_rawdev.o
--
  CC main.o
  CC testpmd.o
  LD dpdk-procinfo
/tmp/UB1604_K4.4.0_GCC5.4.0/i686-native-linuxapp-gcc/6a5d6530fe8c4eb1949478e15e09272a/dpdk/i686-native-linuxapp-gcc/lib/librte_pmd_ixgbe.a(ixgbe_rxtx.o): In function `ixgbe_dev_jumboenable_check':
ixgbe_rxtx.c:(.text.unlikely+0x117f): undefined reference to `ixgbe_dev_info_get'
collect2: error: ld returned 1 exit status
/tmp/UB1604_K4.4.0_GCC5.4.0/i686-native-linuxapp-gcc/6a5d6530fe8c4eb1949478e15e09272a/dpdk/mk/rte.app.mk:392: recipe for target 'dpdk-procinfo' failed
make[5]: *** [dpdk-procinfo] Error 1
/tmp/UB1604_K4.4.0_GCC5.4.0/i686-native-linuxapp-gcc/6a5d6530fe8c4eb1949478e15e09272a/dpdk/mk/rte.subdir.mk:35: recipe for target 'proc-info' failed
make[4]: *** [proc-info] Error 2
make[4]: *** Waiting for unfinished jobs....
  CC parameters.o
  CC cmdline.o
  CC cmdline_flow.o
--
  CC util.o
  CC softnicfwd.o
  LD testpmd
/tmp/UB1604_K4.4.0_GCC5.4.0/i686-native-linuxapp-gcc/6a5d6530fe8c4eb1949478e15e09272a/dpdk/i686-native-linuxapp-gcc/lib/librte_pmd_ixgbe.a(ixgbe_rxtx.o): In function `ixgbe_dev_jumboenable_check':
ixgbe_rxtx.c:(.text.unlikely+0x117f): undefined reference to `ixgbe_dev_info_get'
collect2: error: ld returned 1 exit status
/tmp/UB1604_K4.4.0_GCC5.4.0/i686-native-linuxapp-gcc/6a5d6530fe8c4eb1949478e15e09272a/dpdk/mk/rte.app.mk:392: recipe for target 'testpmd' failed
make[5]: *** [testpmd] Error 1
/tmp/UB1604_K4.4.0_GCC5.4.0/i686-native-linuxapp-gcc/6a5d6530fe8c4eb1949478e15e09272a/dpdk/mk/rte.subdir.mk:35: recipe for target 'test-pmd' failed
make[4]: *** [test-pmd] Error 2
/tmp/UB1604_K4.4.0_GCC5.4.0/i686-native-linuxapp-gcc/6a5d6530fe8c4eb1949478e15e09272a/dpdk/mk/rte.sdkbuild.mk:49: recipe for target 'app' failed
make[3]: *** [app] Error 2
/tmp/UB1604_K4.4.0_GCC5.4.0/i686-native-linuxapp-gcc/6a5d6530fe8c4eb1949478e15e09272a/dpdk/mk/rte.sdkroot.mk:100: recipe for target 'all' failed
make[2]: *** [all] Error 2
/tmp/UB1604_K4.4.0_GCC5.4.0/i686-native-linuxapp-gcc/6a5d6530fe8c4eb1949478e15e09272a/dpdk/mk/rte.sdkinstall.mk:57: recipe for target 'pre_install' failed
make[1]: *** [pre_install] Error 2
/tmp/UB1604_K4.4.0_GCC5.4.0/i686-native-linuxapp-gcc/6a5d6530fe8c4eb1949478e15e09272a/dpdk/mk/rte.sdkroot.mk:79: recipe for target 'install' failed
make: *** [install] Error 2

*Failed Build #10:
OS: FreeBSD
Target: x86_64-native-bsdapp-clang
machine -> /usr/src/sys/amd64/include
x86 -> /usr/src/sys/x86/include
awk -f @/tools/makeobjops.awk @/kern/device_if.m -h
  INSTALL-HOSTAPP dpdk-pmdinfogen
awk -f @/tools/makeobjops.awk @/kern/bus_if.m -h
cc -Winline -Wall -Werror -include /tmp/FreeBSD_K10.3_GCC4.8.5/x86_64-native-bsdapp-clang/6a5d6530fe8c4eb1949478e15e09272a/dpdk/x86_64-native-bsdapp-clang/include/rte_config.h  -Werror -D_KERNEL -DKLD_MODULE -nostdinc  -I/tmp/FreeBSD_K10.3_GCC4.8.5/x86_64-native-bsdapp-clang/6a5d6530fe8c4eb1949478e15e09272a/dpdk/kernel/freebsd/contigmem -I/tmp/FreeBSD_K10.3_GCC4.8.5/x86_64-native-bsdapp-clang/6a5d6530fe8c4eb1949478e15e09272a/dpdk/x86_64-native-bsdapp-clang/include -I. -I@ -I@/contrib/altq -fno-common  -fno-omit-frame-pointer -mno-omit-leaf-frame-pointer  -mno-aes -mno-avx -mcmodel=kernel -mno-red-zone -mno-mmx -mno-sse -msoft-float  -fno-asynchronous-unwind-tables -ffreestanding -fstack-protector -std=iso9899:1999 -Qunused-arguments  -fstack-protector -Wall -Wredundant-decls -Wnested-externs -Wstrict-prototypes  -Wmissing-prototypes -Wpointer-arith -Winline -Wcast-qual  -Wundef -Wno-pointer-sign -fformat-extensions  -Wmissing-include-dirs -fdiagnostics-show-option  -Wno-error-tautological-compare -Wno-error-empty-body  -Wno-error-parentheses-equality -Wno-error-unused-function    -c contigmem.c -o contigmem.o
== Build kernel/freebsd/nic_uio
Warning: Object directory not changed from original /tmp/FreeBSD_K10.3_GCC4.8.5/x86_64-native-bsdapp-clang/6a5d6530fe8c4eb1949478e15e09272a/dpdk/x86_64-native-bsdapp-clang/build/kernel/freebsd/nic_uio
@ -> /usr/src/sys
ld      -L/tmp/FreeBSD_K10.3_GCC4.8.5/x86_64-native-bsdapp-clang/6a5d6530fe8c4eb1949478e15e09272a/dpdk/x86_64-native-bsdapp-clang/lib -d -warn-common -r -d -o contigmem.ko contigmem.o
:> export_syms
--
objcopy --strip-debug contigmem.ko
INSTALL-MODULE contigmem.ko
awk -f @/tools/makeobjops.awk @/kern/bus_if.m -h
== Build drivers
awk -f @/tools/makeobjops.awk @/dev/pci/pci_if.m -h
cc -Winline -Wall -Werror -include /tmp/FreeBSD_K10.3_GCC4.8.5/x86_64-native-bsdapp-clang/6a5d6530fe8c4eb1949478e15e09272a/dpdk/x86_64-native-bsdapp-clang/include/rte_config.h  -Werror -D_KERNEL -DKLD_MODULE -nostdinc  -I/tmp/FreeBSD_K10.3_GCC4.8.5/x86_64-native-bsdapp-clang/6a5d6530fe8c4eb1949478e15e09272a/dpdk/kernel/freebsd/nic_uio -I/tmp/FreeBSD_K10.3_GCC4.8.5/x86_64-native-bsdapp-clang/6a5d6530fe8c4eb1949478e15e09272a/dpdk/x86_64-native-bsdapp-clang/include -I. -I@ -I@/contrib/altq -fno-common  -fno-omit-frame-pointer -mno-omit-leaf-frame-pointer  -mno-aes -mno-avx -mcmodel=kernel -mno-red-zone -mno-mmx -mno-sse -msoft-float  -fno-asynchronous-unwind-tables -ffreestanding -fstack-protector -std=iso9899:1999 -Qunused-arguments  -fstack-protector -Wall -Wredundant-decls -Wnested-externs -Wstrict-prototypes  -Wmissing-prototypes -Wpointer-arith -Winline -Wcast-qual  -Wundef -Wno-pointer-sign -fformat-extensions  -Wmissing-include-dirs -fdiagnostics-show-option  -Wno-error-tautological-compare -Wno-error-empty-body  -Wno-error-parentheses-equality -Wno-error-unused-function    -c nic_uio.c -o nic_uio.o
== Build drivers/common
== Build drivers/common/cpt
ld      -L/tmp/FreeBSD_K10.3_GCC4.8.5/x86_64-native-bsdapp-clang/6a5d6530fe8c4eb1949478e15e09272a/dpdk/x86_64-native-bsdapp-clang/lib -d -warn-common -r -d -o nic_uio.ko nic_uio.o
:> export_syms
awk -f /sys/conf/kmod_syms.awk nic_uio.ko  export_syms | xargs -J% objcopy % nic_uio.ko
--
  CC i40e_pf.o
  CC ixgbe_dcb_82598.o
  CC ixgbe_mbx.o
  CC i40e_fdir.o
  CC ixgbe_rxtx.o
/tmp/FreeBSD_K10.3_GCC4.8.5/x86_64-native-bsdapp-clang/6a5d6530fe8c4eb1949478e15e09272a/dpdk/drivers/net/ixgbe/ixgbe_rxtx.c:4818:1: warning: no previous prototype for function 'ixgbe_dev_jumboenable_check' [-Wmissing-prototypes]
ixgbe_dev_jumboenable_check(struct rte_eth_dev *dev,
^
/tmp/FreeBSD_K10.3_GCC4.8.5/x86_64-native-bsdapp-clang/6a5d6530fe8c4eb1949478e15e09272a/dpdk/drivers/net/ixgbe/ixgbe_rxtx.c:4823:2: warning: implicit declaration of function 'ixgbe_dev_info_get' is invalid in C99 [-Wimplicit-function-declaration]
        ixgbe_dev_info_get(dev, &dev_info);
        ^
  CC i40e_flow.o
  CC rte_pmd_i40e.o
2 warnings generated.
  CC ixgbe_ethdev.o
  CC i40e_tm.o
  CC i40e_vf_representor.o
  CC i40e_rxtx_vec_avx2.o
  PMDINFO ixgbe_ethdev.o.pmd.c
--
  AR librte_pmd_skeleton_rawdev.a
  INSTALL-LIB librte_pmd_skeleton_rawdev.a
  CC ifpga_fme.o
  CC ifpga_fme_iperf.o
  CC ifpga_fme_dperf.o
  CC ifpga_fme_error.o
  CC ifpga_port.o
  CC ifpga_port_error.o
  CC opae_hw_api.o
  CC opae_ifpga_hw_api.o
  CC opae_debug.o
  CC ifpga_fme_pr.o
  CC ifpga_rawdev.o
--
  CC main.o
  CC testpmd.o
  LD dpdk-pdump
/tmp/FreeBSD_K10.3_GCC4.8.5/x86_64-native-bsdapp-clang/6a5d6530fe8c4eb1949478e15e09272a/dpdk/x86_64-native-bsdapp-clang/lib/librte_pmd_ixgbe.a(ixgbe_rxtx.o): In function `ixgbe_dev_jumboenable_check':
/tmp/FreeBSD_K10.3_GCC4.8.5/x86_64-native-bsdapp-clang/6a5d6530fe8c4eb1949478e15e09272a/dpdk/drivers/net/ixgbe/ixgbe_rxtx.c:(.text+0x5dbe): undefined reference to `ixgbe_dev_info_get'
clang: error: linker command failed with exit code 1 (use -v to see invocation)
gmake[5]: *** [/tmp/FreeBSD_K10.3_GCC4.8.5/x86_64-native-bsdapp-clang/6a5d6530fe8c4eb1949478e15e09272a/dpdk/mk/rte.app.mk:394: dpdk-pdump] Error 1
gmake[4]: *** [/tmp/FreeBSD_K10.3_GCC4.8.5/x86_64-native-bsdapp-clang/6a5d6530fe8c4eb1949478e15e09272a/dpdk/mk/rte.subdir.mk:37: pdump] Error 2
gmake[4]: *** Waiting for unfinished jobs....
  CC parameters.o
  CC cmdline.o
--
  CC bpf_cmd.o
  CC util.o
  LD testpmd
/tmp/FreeBSD_K10.3_GCC4.8.5/x86_64-native-bsdapp-clang/6a5d6530fe8c4eb1949478e15e09272a/dpdk/x86_64-native-bsdapp-clang/lib/librte_pmd_ixgbe.a(ixgbe_rxtx.o): In function `ixgbe_dev_jumboenable_check':
/tmp/FreeBSD_K10.3_GCC4.8.5/x86_64-native-bsdapp-clang/6a5d6530fe8c4eb1949478e15e09272a/dpdk/drivers/net/ixgbe/ixgbe_rxtx.c:(.text+0x5dbe): undefined reference to `ixgbe_dev_info_get'
clang: error: linker command failed with exit code 1 (use -v to see invocation)
gmake[5]: *** [/tmp/FreeBSD_K10.3_GCC4.8.5/x86_64-native-bsdapp-clang/6a5d6530fe8c4eb1949478e15e09272a/dpdk/mk/rte.app.mk:394: testpmd] Error 1
gmake[4]: *** [/tmp/FreeBSD_K10.3_GCC4.8.5/x86_64-native-bsdapp-clang/6a5d6530fe8c4eb1949478e15e09272a/dpdk/mk/rte.subdir.mk:37: test-pmd] Error 2
gmake[3]: *** [/tmp/FreeBSD_K10.3_GCC4.8.5/x86_64-native-bsdapp-clang/6a5d6530fe8c4eb1949478e15e09272a/dpdk/mk/rte.sdkbuild.mk:51: app] Error 2
gmake[2]: *** [/tmp/FreeBSD_K10.3_GCC4.8.5/x86_64-native-bsdapp-clang/6a5d6530fe8c4eb1949478e15e09272a/dpdk/mk/rte.sdkroot.mk:101: all] Error 2
gmake[1]: *** [/tmp/FreeBSD_K10.3_GCC4.8.5/x86_64-native-bsdapp-clang/6a5d6530fe8c4eb1949478e15e09272a/dpdk/mk/rte.sdkinstall.mk:58: pre_install] Error 2

*Failed Build #11:
OS: FC24
Target: x86_64-native-linuxapp-gcc-shared
  CC i40e_ethdev.o.pmd.o
  LD i40e_ethdev.o
  CC i40e_rxtx.o
  CC ixgbe_mbx.o
  CC ixgbe_rxtx.o
/tmp/FC24_K4.9.13_GCC6.2.1/x86_64-native-linuxapp-gcc-shared/6a5d6530fe8c4eb1949478e15e09272a/dpdk/drivers/net/ixgbe/ixgbe_rxtx.c:4818:1: warning: no previous prototype for ‘ixgbe_dev_jumboenable_check’ [-Wmissing-prototypes]
 ixgbe_dev_jumboenable_check(struct rte_eth_dev *dev,
 ^~~~~~~~~~~~~~~~~~~~~~~~~~~
/tmp/FC24_K4.9.13_GCC6.2.1/x86_64-native-linuxapp-gcc-shared/6a5d6530fe8c4eb1949478e15e09272a/dpdk/drivers/net/ixgbe/ixgbe_rxtx.c: In function ‘ixgbe_dev_jumboenable_check’:
/tmp/FC24_K4.9.13_GCC6.2.1/x86_64-native-linuxapp-gcc-shared/6a5d6530fe8c4eb1949478e15e09272a/dpdk/drivers/net/ixgbe/ixgbe_rxtx.c:4823:2: warning: implicit declaration of function ‘ixgbe_dev_info_get’ [-Wimplicit-function-declaration]
  ixgbe_dev_info_get(dev, &dev_info);
  ^~~~~~~~~~~~~~~~~~
/tmp/FC24_K4.9.13_GCC6.2.1/x86_64-native-linuxapp-gcc-shared/6a5d6530fe8c4eb1949478e15e09272a/dpdk/drivers/net/ixgbe/ixgbe_rxtx.c:4823:2: warning: nested extern declaration of ‘ixgbe_dev_info_get’ [-Wnested-externs]
  CC i40e_rxtx_vec_sse.o
  CC ixgbe_ethdev.o
  CC i40e_ethdev_vf.o
  PMDINFO i40e_ethdev_vf.o.pmd.c
  CC i40e_ethdev_vf.o.pmd.o
--
  CC ixgbe_vf_representor.o
== Build drivers/net/liquidio
  LD librte_pmd_ixgbe.so.2.1
ixgbe_rxtx.o: In function `ixgbe_dev_jumboenable_check':
ixgbe_rxtx.c:(.text.unlikely+0x12dd): undefined reference to `ixgbe_dev_info_get'
collect2: error: ld returned 1 exit status
/tmp/FC24_K4.9.13_GCC6.2.1/x86_64-native-linuxapp-gcc-shared/6a5d6530fe8c4eb1949478e15e09272a/dpdk/mk/rte.lib.mk:98: recipe for target 'librte_pmd_ixgbe.so.2.1' failed
make[6]: *** [librte_pmd_ixgbe.so.2.1] Error 1
/tmp/FC24_K4.9.13_GCC6.2.1/x86_64-native-linuxapp-gcc-shared/6a5d6530fe8c4eb1949478e15e09272a/dpdk/mk/rte.subdir.mk:35: recipe for target 'ixgbe' failed
make[5]: *** [ixgbe] Error 2
make[5]: *** Waiting for unfinished jobs....
  CC lio_ethdev.o
  CC lio_rxtx.o
  PMDINFO lio_ethdev.o.pmd.c
--
  LD lio_ethdev.o
  CC lio_23xx_vf.o
  CC lio_mbox.o
  LD librte_pmd_lio.so.1.1
  INSTALL-LIB librte_pmd_lio.so.1.1
/tmp/FC24_K4.9.13_GCC6.2.1/x86_64-native-linuxapp-gcc-shared/6a5d6530fe8c4eb1949478e15e09272a/dpdk/mk/rte.subdir.mk:35: recipe for target 'net' failed
make[4]: *** [net] Error 2
/tmp/FC24_K4.9.13_GCC6.2.1/x86_64-native-linuxapp-gcc-shared/6a5d6530fe8c4eb1949478e15e09272a/dpdk/mk/rte.sdkbuild.mk:49: recipe for target 'drivers' failed
make[3]: *** [drivers] Error 2
/tmp/FC24_K4.9.13_GCC6.2.1/x86_64-native-linuxapp-gcc-shared/6a5d6530fe8c4eb1949478e15e09272a/dpdk/mk/rte.sdkroot.mk:100: recipe for target 'all' failed
make[2]: *** [all] Error 2
/tmp/FC24_K4.9.13_GCC6.2.1/x86_64-native-linuxapp-gcc-shared/6a5d6530fe8c4eb1949478e15e09272a/dpdk/mk/rte.sdkinstall.mk:57: recipe for target 'pre_install' failed
make[1]: *** [pre_install] Error 2
/tmp/FC24_K4.9.13_GCC6.2.1/x86_64-native-linuxapp-gcc-shared/6a5d6530fe8c4eb1949478e15e09272a/dpdk/mk/rte.sdkroot.mk:79: recipe for target 'install' failed
make: *** [install] Error 2

*Failed Build #12:
OS: FC24
Target: i686-native-linuxapp-gcc
  CC ixgbe_dcb.o
  CC ixgbe_dcb_82599.o
  CC ixgbe_dcb_82598.o
  CC ixgbe_mbx.o
  CC ixgbe_rxtx.o
/tmp/FC24_K4.5.5_GCC6.1.1/i686-native-linuxapp-gcc/6a5d6530fe8c4eb1949478e15e09272a/dpdk/drivers/net/ixgbe/ixgbe_rxtx.c:4818:1: warning: no previous prototype for ‘ixgbe_dev_jumboenable_check’ [-Wmissing-prototypes]
 ixgbe_dev_jumboenable_check(struct rte_eth_dev *dev,
 ^~~~~~~~~~~~~~~~~~~~~~~~~~~
/tmp/FC24_K4.5.5_GCC6.1.1/i686-native-linuxapp-gcc/6a5d6530fe8c4eb1949478e15e09272a/dpdk/drivers/net/ixgbe/ixgbe_rxtx.c: In function ‘ixgbe_dev_jumboenable_check’:
/tmp/FC24_K4.5.5_GCC6.1.1/i686-native-linuxapp-gcc/6a5d6530fe8c4eb1949478e15e09272a/dpdk/drivers/net/ixgbe/ixgbe_rxtx.c:4823:2: warning: implicit declaration of function ‘ixgbe_dev_info_get’ [-Wimplicit-function-declaration]
  ixgbe_dev_info_get(dev, &dev_info);
  ^~~~~~~~~~~~~~~~~~
/tmp/FC24_K4.5.5_GCC6.1.1/i686-native-linuxapp-gcc/6a5d6530fe8c4eb1949478e15e09272a/dpdk/drivers/net/ixgbe/ixgbe_rxtx.c:4823:2: warning: nested extern declaration of ‘ixgbe_dev_info_get’ [-Wnested-externs]
  PMDINFO i40e_ethdev.o.pmd.c
  CC i40e_ethdev.o.pmd.o
  LD i40e_ethdev.o
  CC i40e_rxtx.o
  CC ixgbe_ethdev.o
--
  CC ifpga_enumerate.o
  CC ifpga_feature_dev.o
  CC ifpga_fme.o
  CC ifpga_fme_iperf.o
  CC ifpga_fme_dperf.o
  CC ifpga_fme_error.o
  CC ifpga_port.o
  CC ifpga_port_error.o
  CC opae_hw_api.o
  CC opae_ifpga_hw_api.o
  CC opae_debug.o
  CC ifpga_fme_pr.o
  CC ifpga_rawdev.o
--
  CC main.o
  CC testpmd.o
  LD dpdk-procinfo
/tmp/FC24_K4.5.5_GCC6.1.1/i686-native-linuxapp-gcc/6a5d6530fe8c4eb1949478e15e09272a/dpdk/i686-native-linuxapp-gcc/lib/librte_pmd_ixgbe.a(ixgbe_rxtx.o): In function `ixgbe_dev_jumboenable_check':
ixgbe_rxtx.c:(.text.unlikely+0x10e6): undefined reference to `ixgbe_dev_info_get'
collect2: error: ld returned 1 exit status
/tmp/FC24_K4.5.5_GCC6.1.1/i686-native-linuxapp-gcc/6a5d6530fe8c4eb1949478e15e09272a/dpdk/mk/rte.app.mk:392: recipe for target 'dpdk-procinfo' failed
make[5]: *** [dpdk-procinfo] Error 1
/tmp/FC24_K4.5.5_GCC6.1.1/i686-native-linuxapp-gcc/6a5d6530fe8c4eb1949478e15e09272a/dpdk/mk/rte.subdir.mk:35: recipe for target 'proc-info' failed
make[4]: *** [proc-info] Error 2
make[4]: *** Waiting for unfinished jobs....
  CC parameters.o
  CC cmdline.o
  CC cmdline_flow.o
--
  CC util.o
  CC softnicfwd.o
  LD testpmd
/tmp/FC24_K4.5.5_GCC6.1.1/i686-native-linuxapp-gcc/6a5d6530fe8c4eb1949478e15e09272a/dpdk/i686-native-linuxapp-gcc/lib/librte_pmd_ixgbe.a(ixgbe_rxtx.o): In function `ixgbe_dev_jumboenable_check':
ixgbe_rxtx.c:(.text.unlikely+0x10e6): undefined reference to `ixgbe_dev_info_get'
collect2: error: ld returned 1 exit status
/tmp/FC24_K4.5.5_GCC6.1.1/i686-native-linuxapp-gcc/6a5d6530fe8c4eb1949478e15e09272a/dpdk/mk/rte.app.mk:392: recipe for target 'testpmd' failed
make[5]: *** [testpmd] Error 1
/tmp/FC24_K4.5.5_GCC6.1.1/i686-native-linuxapp-gcc/6a5d6530fe8c4eb1949478e15e09272a/dpdk/mk/rte.subdir.mk:35: recipe for target 'test-pmd' failed
make[4]: *** [test-pmd] Error 2
/tmp/FC24_K4.5.5_GCC6.1.1/i686-native-linuxapp-gcc/6a5d6530fe8c4eb1949478e15e09272a/dpdk/mk/rte.sdkbuild.mk:49: recipe for target 'app' failed
make[3]: *** [app] Error 2
/tmp/FC24_K4.5.5_GCC6.1.1/i686-native-linuxapp-gcc/6a5d6530fe8c4eb1949478e15e09272a/dpdk/mk/rte.sdkroot.mk:100: recipe for target 'all' failed
make[2]: *** [all] Error 2
/tmp/FC24_K4.5.5_GCC6.1.1/i686-native-linuxapp-gcc/6a5d6530fe8c4eb1949478e15e09272a/dpdk/mk/rte.sdkinstall.mk:57: recipe for target 'pre_install' failed
make[1]: *** [pre_install] Error 2
/tmp/FC24_K4.5.5_GCC6.1.1/i686-native-linuxapp-gcc/6a5d6530fe8c4eb1949478e15e09272a/dpdk/mk/rte.sdkroot.mk:79: recipe for target 'install' failed
make: *** [install] Error 2

*Failed Build #13:
OS: FC24
Target: x86_64-native-linuxapp-clang
  CC ixgbe_dcb.o
  CC ixgbe_dcb_82599.o
  CC ixgbe_dcb_82598.o
  CC ixgbe_mbx.o
  CC ixgbe_rxtx.o
/tmp/FC24_K4.9.13_GCC6.2.1/x86_64-native-linuxapp-clang/6a5d6530fe8c4eb1949478e15e09272a/dpdk/drivers/net/ixgbe/ixgbe_rxtx.c:4823:2: warning: implicit declaration of function 'ixgbe_dev_info_get' is invalid in C99 [-Wimplicit-function-declaration]
        ixgbe_dev_info_get(dev, &dev_info);
        ^
/tmp/FC24_K4.9.13_GCC6.2.1/x86_64-native-linuxapp-clang/6a5d6530fe8c4eb1949478e15e09272a/dpdk/drivers/net/ixgbe/ixgbe_rxtx.c:4818:1: warning: no previous prototype for function 'ixgbe_dev_jumboenable_check' [-Wmissing-prototypes]
ixgbe_dev_jumboenable_check(struct rte_eth_dev *dev,
^
  PMDINFO i40e_ethdev.o.pmd.c
  CC i40e_ethdev.o.pmd.o
  LD i40e_ethdev.o
  CC i40e_rxtx.o
2 warnings generated.
  CC ixgbe_ethdev.o
  CC i40e_rxtx_vec_sse.o
  CC i40e_ethdev_vf.o
  PMDINFO ixgbe_ethdev.o.pmd.c
  CC ixgbe_ethdev.o.pmd.o
--
  AR librte_pmd_dpaa2_qdma.a
  INSTALL-LIB librte_pmd_dpaa2_qdma.a
  CC ifpga_fme.o
  CC ifpga_fme_iperf.o
  CC ifpga_fme_dperf.o
  CC ifpga_fme_error.o
  CC ifpga_port.o
  CC ifpga_port_error.o
  CC opae_hw_api.o
  CC opae_ifpga_hw_api.o
  CC opae_debug.o
  CC ifpga_fme_pr.o
  CC ifpga_rawdev.o
--
  CC main.o
  CC testpmd.o
  LD dpdk-procinfo
/tmp/FC24_K4.9.13_GCC6.2.1/x86_64-native-linuxapp-clang/6a5d6530fe8c4eb1949478e15e09272a/dpdk/x86_64-native-linuxapp-clang/lib/librte_pmd_ixgbe.a(ixgbe_rxtx.o): In function `ixgbe_dev_jumboenable_check':
/tmp/FC24_K4.9.13_GCC6.2.1/x86_64-native-linuxapp-clang/6a5d6530fe8c4eb1949478e15e09272a/dpdk/drivers/net/ixgbe/ixgbe_rxtx.c:(.text+0x64a5): undefined reference to `ixgbe_dev_info_get'
clang-3.8: error: linker command failed with exit code 1 (use -v to see invocation)
/tmp/FC24_K4.9.13_GCC6.2.1/x86_64-native-linuxapp-clang/6a5d6530fe8c4eb1949478e15e09272a/dpdk/mk/rte.app.mk:392: recipe for target 'dpdk-procinfo' failed
make[5]: *** [dpdk-procinfo] Error 1
/tmp/FC24_K4.9.13_GCC6.2.1/x86_64-native-linuxapp-clang/6a5d6530fe8c4eb1949478e15e09272a/dpdk/mk/rte.subdir.mk:35: recipe for target 'proc-info' failed
make[4]: *** [proc-info] Error 2
make[4]: *** Waiting for unfinished jobs....
  CC parameters.o
  CC cmdline.o
  CC cmdline_flow.o
--
  CC util.o
  CC softnicfwd.o
  LD testpmd
/tmp/FC24_K4.9.13_GCC6.2.1/x86_64-native-linuxapp-clang/6a5d6530fe8c4eb1949478e15e09272a/dpdk/x86_64-native-linuxapp-clang/lib/librte_pmd_ixgbe.a(ixgbe_rxtx.o): In function `ixgbe_dev_jumboenable_check':
/tmp/FC24_K4.9.13_GCC6.2.1/x86_64-native-linuxapp-clang/6a5d6530fe8c4eb1949478e15e09272a/dpdk/drivers/net/ixgbe/ixgbe_rxtx.c:(.text+0x64a5): undefined reference to `ixgbe_dev_info_get'
clang-3.8: error: linker command failed with exit code 1 (use -v to see invocation)
/tmp/FC24_K4.9.13_GCC6.2.1/x86_64-native-linuxapp-clang/6a5d6530fe8c4eb1949478e15e09272a/dpdk/mk/rte.app.mk:392: recipe for target 'testpmd' failed
make[5]: *** [testpmd] Error 1
/tmp/FC24_K4.9.13_GCC6.2.1/x86_64-native-linuxapp-clang/6a5d6530fe8c4eb1949478e15e09272a/dpdk/mk/rte.subdir.mk:35: recipe for target 'test-pmd' failed
make[4]: *** [test-pmd] Error 2
/tmp/FC24_K4.9.13_GCC6.2.1/x86_64-native-linuxapp-clang/6a5d6530fe8c4eb1949478e15e09272a/dpdk/mk/rte.sdkbuild.mk:49: recipe for target 'app' failed
make[3]: *** [app] Error 2
/tmp/FC24_K4.9.13_GCC6.2.1/x86_64-native-linuxapp-clang/6a5d6530fe8c4eb1949478e15e09272a/dpdk/mk/rte.sdkroot.mk:100: recipe for target 'all' failed
make[2]: *** [all] Error 2
/tmp/FC24_K4.9.13_GCC6.2.1/x86_64-native-linuxapp-clang/6a5d6530fe8c4eb1949478e15e09272a/dpdk/mk/rte.sdkinstall.mk:57: recipe for target 'pre_install' failed
make[1]: *** [pre_install] Error 2
/tmp/FC24_K4.9.13_GCC6.2.1/x86_64-native-linuxapp-clang/6a5d6530fe8c4eb1949478e15e09272a/dpdk/mk/rte.sdkroot.mk:79: recipe for target 'install' failed
make: *** [install] Error 2

*Failed Build #14:
OS: FC25
Target: x86_64-native-linuxapp-gcc-debug
  CC i40e_ethdev.o.pmd.o
  LD i40e_ethdev.o
  CC i40e_rxtx.o
  CC ixgbe_mbx.o
  CC ixgbe_rxtx.o
/tmp/FC25_K4.8.6_GCC6.3.1/x86_64-native-linuxapp-gcc-debug/6a5d6530fe8c4eb1949478e15e09272a/dpdk/drivers/net/ixgbe/ixgbe_rxtx.c:4818:1: warning: no previous prototype for ‘ixgbe_dev_jumboenable_check’ [-Wmissing-prototypes]
 ixgbe_dev_jumboenable_check(struct rte_eth_dev *dev,
 ^~~~~~~~~~~~~~~~~~~~~~~~~~~
/tmp/FC25_K4.8.6_GCC6.3.1/x86_64-native-linuxapp-gcc-debug/6a5d6530fe8c4eb1949478e15e09272a/dpdk/drivers/net/ixgbe/ixgbe_rxtx.c: In function ‘ixgbe_dev_jumboenable_check’:
/tmp/FC25_K4.8.6_GCC6.3.1/x86_64-native-linuxapp-gcc-debug/6a5d6530fe8c4eb1949478e15e09272a/dpdk/drivers/net/ixgbe/ixgbe_rxtx.c:4823:2: warning: implicit declaration of function ‘ixgbe_dev_info_get’ [-Wimplicit-function-declaration]
  ixgbe_dev_info_get(dev, &dev_info);
  ^~~~~~~~~~~~~~~~~~
/tmp/FC25_K4.8.6_GCC6.3.1/x86_64-native-linuxapp-gcc-debug/6a5d6530fe8c4eb1949478e15e09272a/dpdk/drivers/net/ixgbe/ixgbe_rxtx.c:4823:2: warning: nested extern declaration of ‘ixgbe_dev_info_get’ [-Wnested-externs]
  CC i40e_rxtx_vec_sse.o
  CC ixgbe_ethdev.o
  CC i40e_ethdev_vf.o
  PMDINFO i40e_ethdev_vf.o.pmd.c
  CC i40e_ethdev_vf.o.pmd.o
--
  CC ifpga_enumerate.o
  CC ifpga_feature_dev.o
  CC ifpga_fme.o
  CC ifpga_fme_iperf.o
  CC ifpga_fme_dperf.o
  CC ifpga_fme_error.o
  CC ifpga_port.o
  CC ifpga_port_error.o
  CC opae_hw_api.o
  CC opae_ifpga_hw_api.o
  CC opae_debug.o
  CC ifpga_fme_pr.o
  CC ifpga_rawdev.o
--
  CC main.o
  CC testpmd.o
  LD dpdk-procinfo
/tmp/FC25_K4.8.6_GCC6.3.1/x86_64-native-linuxapp-gcc-debug/6a5d6530fe8c4eb1949478e15e09272a/dpdk/x86_64-native-linuxapp-gcc/lib/librte_pmd_ixgbe.a(ixgbe_rxtx.o): In function `ixgbe_dev_jumboenable_check':
ixgbe_rxtx.c:(.text.unlikely+0x1528): undefined reference to `ixgbe_dev_info_get'
collect2: error: ld returned 1 exit status
/tmp/FC25_K4.8.6_GCC6.3.1/x86_64-native-linuxapp-gcc-debug/6a5d6530fe8c4eb1949478e15e09272a/dpdk/mk/rte.app.mk:392: recipe for target 'dpdk-procinfo' failed
make[5]: *** [dpdk-procinfo] Error 1
/tmp/FC25_K4.8.6_GCC6.3.1/x86_64-native-linuxapp-gcc-debug/6a5d6530fe8c4eb1949478e15e09272a/dpdk/mk/rte.subdir.mk:35: recipe for target 'proc-info' failed
make[4]: *** [proc-info] Error 2
make[4]: *** Waiting for unfinished jobs....
  CC parameters.o
  CC cmdline.o
  CC cmdline_flow.o
--
  CC util.o
  CC softnicfwd.o
  LD testpmd
/tmp/FC25_K4.8.6_GCC6.3.1/x86_64-native-linuxapp-gcc-debug/6a5d6530fe8c4eb1949478e15e09272a/dpdk/x86_64-native-linuxapp-gcc/lib/librte_pmd_ixgbe.a(ixgbe_rxtx.o): In function `ixgbe_dev_jumboenable_check':
ixgbe_rxtx.c:(.text.unlikely+0x1528): undefined reference to `ixgbe_dev_info_get'
collect2: error: ld returned 1 exit status
/tmp/FC25_K4.8.6_GCC6.3.1/x86_64-native-linuxapp-gcc-debug/6a5d6530fe8c4eb1949478e15e09272a/dpdk/mk/rte.app.mk:392: recipe for target 'testpmd' failed
make[5]: *** [testpmd] Error 1
/tmp/FC25_K4.8.6_GCC6.3.1/x86_64-native-linuxapp-gcc-debug/6a5d6530fe8c4eb1949478e15e09272a/dpdk/mk/rte.subdir.mk:35: recipe for target 'test-pmd' failed
make[4]: *** [test-pmd] Error 2
/tmp/FC25_K4.8.6_GCC6.3.1/x86_64-native-linuxapp-gcc-debug/6a5d6530fe8c4eb1949478e15e09272a/dpdk/mk/rte.sdkbuild.mk:49: recipe for target 'app' failed
make[3]: *** [app] Error 2
/tmp/FC25_K4.8.6_GCC6.3.1/x86_64-native-linuxapp-gcc-debug/6a5d6530fe8c4eb1949478e15e09272a/dpdk/mk/rte.sdkroot.mk:100: recipe for target 'all' failed
make[2]: *** [all] Error 2
/tmp/FC25_K4.8.6_GCC6.3.1/x86_64-native-linuxapp-gcc-debug/6a5d6530fe8c4eb1949478e15e09272a/dpdk/mk/rte.sdkinstall.mk:57: recipe for target 'pre_install' failed
make[1]: *** [pre_install] Error 2
/tmp/FC25_K4.8.6_GCC6.3.1/x86_64-native-linuxapp-gcc-debug/6a5d6530fe8c4eb1949478e15e09272a/dpdk/mk/rte.sdkroot.mk:79: recipe for target 'install' failed
make: *** [install] Error 2

*Failed Build #15:
OS: FreeBSD
Target: x86_64-native-bsdapp-gcc
@ -> /usr/src/sys
machine -> /usr/src/sys/amd64/include
x86 -> /usr/src/sys/x86/include
awk -f @/tools/makeobjops.awk @/kern/device_if.m -h
awk -f @/tools/makeobjops.awk @/kern/bus_if.m -h
cc -Winline -Wall -Werror -include /tmp/FreeBSD_K10.3_GCC4.8.5/x86_64-native-bsdapp-gcc/6a5d6530fe8c4eb1949478e15e09272a/dpdk/x86_64-native-bsdapp-gcc/include/rte_config.h  -Werror -D_KERNEL -DKLD_MODULE -nostdinc  -I/tmp/FreeBSD_K10.3_GCC4.8.5/x86_64-native-bsdapp-gcc/6a5d6530fe8c4eb1949478e15e09272a/dpdk/kernel/freebsd/contigmem -I/tmp/FreeBSD_K10.3_GCC4.8.5/x86_64-native-bsdapp-gcc/6a5d6530fe8c4eb1949478e15e09272a/dpdk/x86_64-native-bsdapp-gcc/include -I. -I@ -I@/contrib/altq -fno-common  -fno-omit-frame-pointer -mno-omit-leaf-frame-pointer  -mno-aes -mno-avx -mcmodel=kernel -mno-red-zone -mno-mmx -mno-sse -msoft-float  -fno-asynchronous-unwind-tables -ffreestanding -fstack-protector -std=iso9899:1999 -Qunused-arguments  -fstack-protector -Wall -Wredundant-decls -Wnested-externs -Wstrict-prototypes  -Wmissing-prototypes -Wpointer-arith -Winline -Wcast-qual  -Wundef -Wno-pointer-sign -fformat-extensions  -Wmissing-include-dirs -fdiagnostics-show-option  -Wno-error-tautological-compare -Wno-error-empty-body  -Wno-error-parentheses-equality -Wno-error-unused-function    -c contigmem.c -o contigmem.o
ld      -L/tmp/FreeBSD_K10.3_GCC4.8.5/x86_64-native-bsdapp-gcc/6a5d6530fe8c4eb1949478e15e09272a/dpdk/x86_64-native-bsdapp-gcc/lib -d -warn-common -r -d -o contigmem.ko contigmem.o
:> export_syms
awk -f /sys/conf/kmod_syms.awk contigmem.ko  export_syms | xargs -J% objcopy % contigmem.ko
objcopy --strip-debug contigmem.ko
INSTALL-MODULE contigmem.ko
--
machine -> /usr/src/sys/amd64/include
x86 -> /usr/src/sys/x86/include
awk -f @/tools/makeobjops.awk @/kern/device_if.m -h
awk -f @/tools/makeobjops.awk @/kern/bus_if.m -h
awk -f @/tools/makeobjops.awk @/dev/pci/pci_if.m -h
cc -Winline -Wall -Werror -include /tmp/FreeBSD_K10.3_GCC4.8.5/x86_64-native-bsdapp-gcc/6a5d6530fe8c4eb1949478e15e09272a/dpdk/x86_64-native-bsdapp-gcc/include/rte_config.h  -Werror -D_KERNEL -DKLD_MODULE -nostdinc  -I/tmp/FreeBSD_K10.3_GCC4.8.5/x86_64-native-bsdapp-gcc/6a5d6530fe8c4eb1949478e15e09272a/dpdk/kernel/freebsd/nic_uio -I/tmp/FreeBSD_K10.3_GCC4.8.5/x86_64-native-bsdapp-gcc/6a5d6530fe8c4eb1949478e15e09272a/dpdk/x86_64-native-bsdapp-gcc/include -I. -I@ -I@/contrib/altq -fno-common  -fno-omit-frame-pointer -mno-omit-leaf-frame-pointer  -mno-aes -mno-avx -mcmodel=kernel -mno-red-zone -mno-mmx -mno-sse -msoft-float  -fno-asynchronous-unwind-tables -ffreestanding -fstack-protector -std=iso9899:1999 -Qunused-arguments  -fstack-protector -Wall -Wredundant-decls -Wnested-externs -Wstrict-prototypes  -Wmissing-prototypes -Wpointer-arith -Winline -Wcast-qual  -Wundef -Wno-pointer-sign -fformat-extensions  -Wmissing-include-dirs -fdiagnostics-show-option  -Wno-error-tautological-compare -Wno-error-empty-body  -Wno-error-parentheses-equality -Wno-error-unused-function    -c nic_uio.c -o nic_uio.o
ld      -L/tmp/FreeBSD_K10.3_GCC4.8.5/x86_64-native-bsdapp-gcc/6a5d6530fe8c4eb1949478e15e09272a/dpdk/x86_64-native-bsdapp-gcc/lib -d -warn-common -r -d -o nic_uio.ko nic_uio.o
:> export_syms
awk -f /sys/conf/kmod_syms.awk nic_uio.ko  export_syms | xargs -J% objcopy % nic_uio.ko
objcopy --strip-debug nic_uio.ko
INSTALL-MODULE nic_uio.ko
--
  CC i40e_rxtx_vec_sse.o
  CC ixgbe_dcb_82598.o
  CC ixgbe_mbx.o
  CC i40e_ethdev_vf.o
  CC ixgbe_rxtx.o
/tmp/FreeBSD_K10.3_GCC4.8.5/x86_64-native-bsdapp-gcc/6a5d6530fe8c4eb1949478e15e09272a/dpdk/drivers/net/ixgbe/ixgbe_rxtx.c:4818:1: warning: no previous prototype for 'ixgbe_dev_jumboenable_check' [-Wmissing-prototypes]
 ixgbe_dev_jumboenable_check(struct rte_eth_dev *dev,
 ^~~~~~~~~~~~~~~~~~~~~~~~~~~
/tmp/FreeBSD_K10.3_GCC4.8.5/x86_64-native-bsdapp-gcc/6a5d6530fe8c4eb1949478e15e09272a/dpdk/drivers/net/ixgbe/ixgbe_rxtx.c: In function 'ixgbe_dev_jumboenable_check':
/tmp/FreeBSD_K10.3_GCC4.8.5/x86_64-native-bsdapp-gcc/6a5d6530fe8c4eb1949478e15e09272a/dpdk/drivers/net/ixgbe/ixgbe_rxtx.c:4823:2: warning: implicit declaration of function 'ixgbe_dev_info_get'; did you mean 'ixgbe_txq_info_get'? [-Wimplicit-function-declaration]
  ixgbe_dev_info_get(dev, &dev_info);
  ^~~~~~~~~~~~~~~~~~
  ixgbe_txq_info_get
/tmp/FreeBSD_K10.3_GCC4.8.5/x86_64-native-bsdapp-gcc/6a5d6530fe8c4eb1949478e15e09272a/dpdk/drivers/net/ixgbe/ixgbe_rxtx.c:4823:2: warning: nested extern declaration of 'ixgbe_dev_info_get' [-Wnested-externs]
  PMDINFO i40e_ethdev_vf.o.pmd.c
  CC i40e_ethdev_vf.o.pmd.o
  LD i40e_ethdev_vf.o
  CC i40e_pf.o
  CC i40e_fdir.o
--
  CC ifpga_fme.o
  CC ifpga_fme_iperf.o
  AR librte_pmd_skeleton_rawdev.a
  INSTALL-LIB librte_pmd_skeleton_rawdev.a
  CC ifpga_fme_dperf.o
  CC ifpga_fme_error.o
  CC ifpga_port.o
  CC ifpga_port_error.o
  CC opae_hw_api.o
  CC opae_ifpga_hw_api.o
  CC opae_debug.o
  CC ifpga_fme_pr.o
  CC ifpga_rawdev.o
--
  CC main.o
  CC testpmd.o
  LD dpdk-pdump
/tmp/FreeBSD_K10.3_GCC4.8.5/x86_64-native-bsdapp-gcc/6a5d6530fe8c4eb1949478e15e09272a/dpdk/x86_64-native-bsdapp-gcc/lib/librte_pmd_ixgbe.a(ixgbe_rxtx.o): In function `ixgbe_dev_jumboenable_check':
ixgbe_rxtx.c:(.text.unlikely+0xf7b): undefined reference to `ixgbe_dev_info_get'
collect2: error: ld returned 1 exit status
gmake[5]: *** [/tmp/FreeBSD_K10.3_GCC4.8.5/x86_64-native-bsdapp-gcc/6a5d6530fe8c4eb1949478e15e09272a/dpdk/mk/rte.app.mk:394: dpdk-pdump] Error 1
gmake[4]: *** [/tmp/FreeBSD_K10.3_GCC4.8.5/x86_64-native-bsdapp-gcc/6a5d6530fe8c4eb1949478e15e09272a/dpdk/mk/rte.subdir.mk:37: pdump] Error 2
gmake[4]: *** Waiting for unfinished jobs....
  CC parameters.o
  CC cmdline.o
--
  CC bpf_cmd.o
  CC util.o
  LD testpmd
/tmp/FreeBSD_K10.3_GCC4.8.5/x86_64-native-bsdapp-gcc/6a5d6530fe8c4eb1949478e15e09272a/dpdk/x86_64-native-bsdapp-gcc/lib/librte_pmd_ixgbe.a(ixgbe_rxtx.o): In function `ixgbe_dev_jumboenable_check':
ixgbe_rxtx.c:(.text.unlikely+0xf7b): undefined reference to `ixgbe_dev_info_get'
collect2: error: ld returned 1 exit status
gmake[5]: *** [/tmp/FreeBSD_K10.3_GCC4.8.5/x86_64-native-bsdapp-gcc/6a5d6530fe8c4eb1949478e15e09272a/dpdk/mk/rte.app.mk:394: testpmd] Error 1
gmake[4]: *** [/tmp/FreeBSD_K10.3_GCC4.8.5/x86_64-native-bsdapp-gcc/6a5d6530fe8c4eb1949478e15e09272a/dpdk/mk/rte.subdir.mk:37: test-pmd] Error 2
gmake[3]: *** [/tmp/FreeBSD_K10.3_GCC4.8.5/x86_64-native-bsdapp-gcc/6a5d6530fe8c4eb1949478e15e09272a/dpdk/mk/rte.sdkbuild.mk:51: app] Error 2
gmake[2]: *** [/tmp/FreeBSD_K10.3_GCC4.8.5/x86_64-native-bsdapp-gcc/6a5d6530fe8c4eb1949478e15e09272a/dpdk/mk/rte.sdkroot.mk:101: all] Error 2
gmake[1]: *** [/tmp/FreeBSD_K10.3_GCC4.8.5/x86_64-native-bsdapp-gcc/6a5d6530fe8c4eb1949478e15e09272a/dpdk/mk/rte.sdkinstall.mk:58: pre_install] Error 2

DPDK STV team


More information about the test-report mailing list