[dpdk-test-report] |FAILURE| pw48046[19.02, 2/2] mem: use memfd for no-huge mode

sys_stv at intel.com sys_stv at intel.com
Tue Nov 13 19:07:27 CET 2018


Test-Label: Intel-compilation
Test-Status: FAILURE
http://dpdk.org/patch/48046

_Compilation issues_

Submitter: Anatoly Burakov <anatoly.burakov at intel.com>
Date: 2018-11-13 17:54:48
DPDK git baseline: Repo:dpdk-master, CommitID: 31f19a9beb8d88b67be6e469404081eb834d199c

Build Summary: 15 Builds Done, 2 Successful, 13 Failures

Test environment and configuration as below:

OS: FC25
	Kernel Version: 4.5.5-300.fc24.x86_64
	CPU info: Intel(R) Xeon(R) CPU E5-2699 v3 @ 2.30GHz
	GCC Version: gcc (GCC) 6.1.1 20160510 (Red Hat 6.1.1-2)
	Clang Version: 3.8.0 (tags/RELEASE_380/final)
	x86_64-native-linuxapp-gcc
	x86_64-native-linuxapp-gcc-debug

OS: FC24
	Kernel Version: 4.9.13-100.fc24.x86_64
	CPU info: Intel(R) Xeon(R) CPU E5-2699 v3 @ 2.30GHz
	GCC Version: gcc (GCC) 6.2.1 20160916 (Red Hat 6.2.1-2)
	Clang Version: 3.8.0 (tags/RELEASE_380/final)
	x86_64-native-linuxapp-gcc-shared
	x86_64-native-linuxapp-clang
	i686-native-linuxapp-gcc

OS: CENTOS
	Kernel Version: 3.10.0-514.10.2.el7.x86_64
	CPU info: Intel(R) Xeon(R) CPU E5-2699 v3 @ 2.30GHz
	GCC Version: gcc (GCC) 4.8.5 20150623 (Red Hat 4.8.5-4)
	Clang Version: 3.4.2 (tags/RELEASE_34/dot2-final)
	x86_64-native-linuxapp-gcc
	x86_64-native-linuxapp-clang
	i686-native-linuxapp-gcc
	x86_64-native-linuxapp-gcc-shared

OS: UB1604
	Kernel Version: 4.4.0-137-generic
	CPU info: Intel(R) Xeon(R) CPU E5-2699 v3 @ 2.30GHz
	GCC Version: gcc (Ubuntu 5.4.0-6ubuntu1~16.04.10) 5.4.0 20160609
	Clang Version: 3.8.0-2ubuntu4 (tags/RELEASE_380/final)
	x86_64-native-linuxapp-gcc
	x86_64-native-linuxapp-gcc-shared
	i686-native-linuxapp-gcc
	x86_64-native-linuxapp-clang

OS: FreeBSD
	Kernel Version: 10.3-RELEASE
	CPU info: Intel(R) Xeon(R) CPU E5-2699 v3 @ 2.30GHz (2294.75-MHz K8-class CPU)
	GCC Version: gcc (FreeBSD Ports Collection) 7.3.0
	Clang Version: 3.4.1 (tags/RELEASE_34/dot1-final 208032) 20140512
	x86_64-native-bsdapp-clang
	x86_64-native-bsdapp-gcc

*Failed Build #1:
OS: FC25
Target: x86_64-native-linuxapp-gcc
  CC eal.o
  CC eal_cpuflags.o
  CC eal_hugepage_info.o
  CC eal_memory.o
/tmp/FC25_K4.8.6_GCC6.3.1/x86_64-native-linuxapp-gcc/b17b014c39e249b9b491e23956b40094/dpdk/lib/librte_eal/linuxapp/eal/eal_memory.c: In function ‘eal_legacy_hugepage_init’:
/tmp/FC25_K4.8.6_GCC6.3.1/x86_64-native-linuxapp-gcc/b17b014c39e249b9b491e23956b40094/dpdk/lib/librte_eal/linuxapp/eal/eal_memory.c:1375:11: warning: implicit declaration of function ‘memfd_create’ [-Wimplicit-function-declaration]
   memfd = memfd_create("nohuge", 0);
           ^~~~~~~~~~~~
/tmp/FC25_K4.8.6_GCC6.3.1/x86_64-native-linuxapp-gcc/b17b014c39e249b9b491e23956b40094/dpdk/lib/librte_eal/linuxapp/eal/eal_memory.c:1375:3: warning: nested extern declaration of ‘memfd_create’ [-Wnested-externs]
   memfd = memfd_create("nohuge", 0);
   ^~~~~
  CC eal_thread.o
  CC eal_log.o
  CC eal_vfio.o
--
  CC ifpga_feature_dev.o
  CC ifpga_enumerate.o
  CC ifpga_fme.o
  CC ifpga_fme_iperf.o
  CC ifpga_fme_dperf.o
  CC ifpga_fme_error.o
  CC ifpga_port.o
  CC ifpga_port_error.o
  CC opae_hw_api.o
  CC opae_ifpga_hw_api.o
  CC opae_debug.o
  CC ifpga_fme_pr.o
  CC ifpga_rawdev.o
--
  CC main.o
  CC testpmd.o
  LD dpdk-procinfo
/tmp/FC25_K4.8.6_GCC6.3.1/x86_64-native-linuxapp-gcc/b17b014c39e249b9b491e23956b40094/dpdk/x86_64-native-linuxapp-gcc/lib/librte_eal.a(eal_memory.o): In function `eal_legacy_hugepage_init':
eal_memory.c:(.text+0x1ad6): undefined reference to `memfd_create'
collect2: error: ld returned 1 exit status
/tmp/FC25_K4.8.6_GCC6.3.1/x86_64-native-linuxapp-gcc/b17b014c39e249b9b491e23956b40094/dpdk/mk/rte.app.mk:394: recipe for target 'dpdk-procinfo' failed
make[5]: *** [dpdk-procinfo] Error 1
/tmp/FC25_K4.8.6_GCC6.3.1/x86_64-native-linuxapp-gcc/b17b014c39e249b9b491e23956b40094/dpdk/mk/rte.subdir.mk:35: recipe for target 'proc-info' failed
make[4]: *** [proc-info] Error 2
make[4]: *** Waiting for unfinished jobs....
  CC parameters.o
  CC cmdline.o
  CC cmdline_flow.o
--
  CC util.o
  CC softnicfwd.o
  LD testpmd
/tmp/FC25_K4.8.6_GCC6.3.1/x86_64-native-linuxapp-gcc/b17b014c39e249b9b491e23956b40094/dpdk/x86_64-native-linuxapp-gcc/lib/librte_eal.a(eal_memory.o): In function `eal_legacy_hugepage_init':
eal_memory.c:(.text+0x1ad6): undefined reference to `memfd_create'
collect2: error: ld returned 1 exit status
/tmp/FC25_K4.8.6_GCC6.3.1/x86_64-native-linuxapp-gcc/b17b014c39e249b9b491e23956b40094/dpdk/mk/rte.app.mk:394: recipe for target 'testpmd' failed
make[5]: *** [testpmd] Error 1
/tmp/FC25_K4.8.6_GCC6.3.1/x86_64-native-linuxapp-gcc/b17b014c39e249b9b491e23956b40094/dpdk/mk/rte.subdir.mk:35: recipe for target 'test-pmd' failed
make[4]: *** [test-pmd] Error 2
/tmp/FC25_K4.8.6_GCC6.3.1/x86_64-native-linuxapp-gcc/b17b014c39e249b9b491e23956b40094/dpdk/mk/rte.sdkbuild.mk:49: recipe for target 'app' failed
make[3]: *** [app] Error 2
/tmp/FC25_K4.8.6_GCC6.3.1/x86_64-native-linuxapp-gcc/b17b014c39e249b9b491e23956b40094/dpdk/mk/rte.sdkroot.mk:100: recipe for target 'all' failed
make[2]: *** [all] Error 2
/tmp/FC25_K4.8.6_GCC6.3.1/x86_64-native-linuxapp-gcc/b17b014c39e249b9b491e23956b40094/dpdk/mk/rte.sdkinstall.mk:57: recipe for target 'pre_install' failed
make[1]: *** [pre_install] Error 2
/tmp/FC25_K4.8.6_GCC6.3.1/x86_64-native-linuxapp-gcc/b17b014c39e249b9b491e23956b40094/dpdk/mk/rte.sdkroot.mk:79: recipe for target 'install' failed
make: *** [install] Error 2

*Failed Build #2:
OS: UB1604
Target: x86_64-native-linuxapp-gcc
  CC eal.o
  CC eal_cpuflags.o
  CC eal_hugepage_info.o
  CC eal_memory.o
/tmp/UB1604_K4.8.0_GCC6.2.0/x86_64-native-linuxapp-gcc/b17b014c39e249b9b491e23956b40094/dpdk/lib/librte_eal/linuxapp/eal/eal_memory.c: In function ‘eal_legacy_hugepage_init’:
/tmp/UB1604_K4.8.0_GCC6.2.0/x86_64-native-linuxapp-gcc/b17b014c39e249b9b491e23956b40094/dpdk/lib/librte_eal/linuxapp/eal/eal_memory.c:1375:11: warning: implicit declaration of function ‘memfd_create’ [-Wimplicit-function-declaration]
   memfd = memfd_create("nohuge", 0);
           ^~~~~~~~~~~~
/tmp/UB1604_K4.8.0_GCC6.2.0/x86_64-native-linuxapp-gcc/b17b014c39e249b9b491e23956b40094/dpdk/lib/librte_eal/linuxapp/eal/eal_memory.c:1375:3: warning: nested extern declaration of ‘memfd_create’ [-Wnested-externs]
   memfd = memfd_create("nohuge", 0);
   ^~~~~
  CC eal_thread.o
  CC eal_log.o
  CC eal_vfio.o
--
  CC ifpga_enumerate.o
  CC ifpga_feature_dev.o
  CC ifpga_fme.o
  CC ifpga_fme_iperf.o
  CC ifpga_fme_dperf.o
  CC ifpga_fme_error.o
  CC ifpga_port.o
  CC ifpga_port_error.o
  CC opae_hw_api.o
  CC opae_ifpga_hw_api.o
  CC opae_debug.o
  CC ifpga_fme_pr.o
  CC ifpga_rawdev.o
--
  CC main.o
  CC testpmd.o
  LD dpdk-procinfo
/tmp/UB1604_K4.8.0_GCC6.2.0/x86_64-native-linuxapp-gcc/b17b014c39e249b9b491e23956b40094/dpdk/x86_64-native-linuxapp-gcc/lib/librte_eal.a(eal_memory.o): In function `eal_legacy_hugepage_init':
eal_memory.c:(.text+0x1c49): undefined reference to `memfd_create'
collect2: error: ld returned 1 exit status
/tmp/UB1604_K4.8.0_GCC6.2.0/x86_64-native-linuxapp-gcc/b17b014c39e249b9b491e23956b40094/dpdk/mk/rte.app.mk:394: recipe for target 'dpdk-procinfo' failed
make[5]: *** [dpdk-procinfo] Error 1
/tmp/UB1604_K4.8.0_GCC6.2.0/x86_64-native-linuxapp-gcc/b17b014c39e249b9b491e23956b40094/dpdk/mk/rte.subdir.mk:35: recipe for target 'proc-info' failed
make[4]: *** [proc-info] Error 2
make[4]: *** Waiting for unfinished jobs....
  CC parameters.o
  CC cmdline.o
  CC cmdline_flow.o
--
  CC util.o
  CC softnicfwd.o
  LD testpmd
/tmp/UB1604_K4.8.0_GCC6.2.0/x86_64-native-linuxapp-gcc/b17b014c39e249b9b491e23956b40094/dpdk/x86_64-native-linuxapp-gcc/lib/librte_eal.a(eal_memory.o): In function `eal_legacy_hugepage_init':
eal_memory.c:(.text+0x1c49): undefined reference to `memfd_create'
collect2: error: ld returned 1 exit status
/tmp/UB1604_K4.8.0_GCC6.2.0/x86_64-native-linuxapp-gcc/b17b014c39e249b9b491e23956b40094/dpdk/mk/rte.app.mk:394: recipe for target 'testpmd' failed
make[5]: *** [testpmd] Error 1
/tmp/UB1604_K4.8.0_GCC6.2.0/x86_64-native-linuxapp-gcc/b17b014c39e249b9b491e23956b40094/dpdk/mk/rte.subdir.mk:35: recipe for target 'test-pmd' failed
make[4]: *** [test-pmd] Error 2
/tmp/UB1604_K4.8.0_GCC6.2.0/x86_64-native-linuxapp-gcc/b17b014c39e249b9b491e23956b40094/dpdk/mk/rte.sdkbuild.mk:49: recipe for target 'app' failed
make[3]: *** [app] Error 2
/tmp/UB1604_K4.8.0_GCC6.2.0/x86_64-native-linuxapp-gcc/b17b014c39e249b9b491e23956b40094/dpdk/mk/rte.sdkroot.mk:100: recipe for target 'all' failed
make[2]: *** [all] Error 2
/tmp/UB1604_K4.8.0_GCC6.2.0/x86_64-native-linuxapp-gcc/b17b014c39e249b9b491e23956b40094/dpdk/mk/rte.sdkinstall.mk:57: recipe for target 'pre_install' failed
make[1]: *** [pre_install] Error 2
/tmp/UB1604_K4.8.0_GCC6.2.0/x86_64-native-linuxapp-gcc/b17b014c39e249b9b491e23956b40094/dpdk/mk/rte.sdkroot.mk:79: recipe for target 'install' failed
make: *** [install] Error 2

*Failed Build #3:
OS: CENTOS
Target: x86_64-native-linuxapp-gcc
  SYMLINK-FILE include/exec-env/rte_kni_common.h
  CC eal.o
  CC eal_cpuflags.o
  CC eal_hugepage_info.o
  CC eal_memory.o
/tmp/CENTOS_K3.10.0_GCC4.8.5/x86_64-native-linuxapp-gcc/b17b014c39e249b9b491e23956b40094/dpdk/lib/librte_eal/linuxapp/eal/eal_memory.c:28:25: fatal error: linux/memfd.h: No such file or directory
 #include <linux/memfd.h>
                         ^
compilation terminated.
make[7]: *** [eal_memory.o] Error 1
make[7]: *** Waiting for unfinished jobs....

*Failed Build #4:
OS: CENTOS
Target: x86_64-native-linuxapp-clang
  SYMLINK-FILE include/exec-env/rte_kni_common.h
  CC eal.o
  CC eal_cpuflags.o
  CC eal_hugepage_info.o
  CC eal_memory.o
/tmp/CENTOS_K3.10.0_GCC4.8.5/x86_64-native-linuxapp-clang/b17b014c39e249b9b491e23956b40094/dpdk/lib/librte_eal/linuxapp/eal/eal_memory.c:28:10: fatal error: 'linux/memfd.h' file not found
#include <linux/memfd.h>
         ^
1 error generated.
make[7]: *** [eal_memory.o] Error 1
make[7]: *** Waiting for unfinished jobs....
make[6]: *** [eal] Error 2
make[5]: *** [linuxapp] Error 2
make[4]: *** [librte_eal] Error 2

*Failed Build #5:
OS: CENTOS
Target: i686-native-linuxapp-gcc
  SYMLINK-FILE include/exec-env/rte_kni_common.h
  CC eal.o
  CC eal_cpuflags.o
  CC eal_hugepage_info.o
  CC eal_memory.o
/tmp/CENTOS_K3.10.0_GCC4.8.5/i686-native-linuxapp-gcc/b17b014c39e249b9b491e23956b40094/dpdk/lib/librte_eal/linuxapp/eal/eal_memory.c:28:25: fatal error: linux/memfd.h: No such file or directory
 #include <linux/memfd.h>
                         ^
compilation terminated.
make[7]: *** [eal_memory.o] Error 1
make[7]: *** Waiting for unfinished jobs....

*Failed Build #6:
OS: CENTOS
Target: x86_64-native-linuxapp-gcc-shared
  SYMLINK-FILE include/exec-env/rte_kni_common.h
  CC eal.o
  CC eal_cpuflags.o
  CC eal_hugepage_info.o
  CC eal_memory.o
/tmp/CENTOS_K3.10.0_GCC4.8.5/x86_64-native-linuxapp-gcc-shared/b17b014c39e249b9b491e23956b40094/dpdk/lib/librte_eal/linuxapp/eal/eal_memory.c:28:25: fatal error: linux/memfd.h: No such file or directory
 #include <linux/memfd.h>
                         ^
compilation terminated.
make[7]: *** [eal_memory.o] Error 1
make[7]: *** Waiting for unfinished jobs....

*Failed Build #7:
OS: UB1604
Target: x86_64-native-linuxapp-gcc-shared
  CC eal.o
  CC eal_cpuflags.o
  CC eal_hugepage_info.o
  CC eal_memory.o
/tmp/UB1604_K4.4.0_GCC5.4.0/x86_64-native-linuxapp-gcc-shared/b17b014c39e249b9b491e23956b40094/dpdk/lib/librte_eal/linuxapp/eal/eal_memory.c: In function ‘eal_legacy_hugepage_init’:
/tmp/UB1604_K4.4.0_GCC5.4.0/x86_64-native-linuxapp-gcc-shared/b17b014c39e249b9b491e23956b40094/dpdk/lib/librte_eal/linuxapp/eal/eal_memory.c:1375:11: warning: implicit declaration of function ‘memfd_create’ [-Wimplicit-function-declaration]
   memfd = memfd_create("nohuge", 0);
           ^
/tmp/UB1604_K4.4.0_GCC5.4.0/x86_64-native-linuxapp-gcc-shared/b17b014c39e249b9b491e23956b40094/dpdk/lib/librte_eal/linuxapp/eal/eal_memory.c:1375:3: warning: nested extern declaration of ‘memfd_create’ [-Wnested-externs]
   memfd = memfd_create("nohuge", 0);
   ^
  CC eal_thread.o
  CC eal_log.o
  CC eal_vfio.o
--
  CC rte_spinlock.o
  CC rte_cycles.o
  LD librte_eal.so.9.1
eal_memory.o: In function `eal_legacy_hugepage_init':
eal_memory.c:(.text+0x2e8b): undefined reference to `memfd_create'
collect2: error: ld returned 1 exit status
/tmp/UB1604_K4.4.0_GCC5.4.0/x86_64-native-linuxapp-gcc-shared/b17b014c39e249b9b491e23956b40094/dpdk/mk/rte.lib.mk:98: recipe for target 'librte_eal.so.9.1' failed
make[7]: *** [librte_eal.so.9.1] Error 1
/tmp/UB1604_K4.4.0_GCC5.4.0/x86_64-native-linuxapp-gcc-shared/b17b014c39e249b9b491e23956b40094/dpdk/mk/rte.subdir.mk:35: recipe for target 'eal' failed
make[6]: *** [eal] Error 2
/tmp/UB1604_K4.4.0_GCC5.4.0/x86_64-native-linuxapp-gcc-shared/b17b014c39e249b9b491e23956b40094/dpdk/mk/rte.subdir.mk:35: recipe for target 'linuxapp' failed
make[5]: *** [linuxapp] Error 2
/tmp/UB1604_K4.4.0_GCC5.4.0/x86_64-native-linuxapp-gcc-shared/b17b014c39e249b9b491e23956b40094/dpdk/mk/rte.subdir.mk:35: recipe for target 'librte_eal' failed
make[4]: *** [librte_eal] Error 2
/tmp/UB1604_K4.4.0_GCC5.4.0/x86_64-native-linuxapp-gcc-shared/b17b014c39e249b9b491e23956b40094/dpdk/mk/rte.sdkbuild.mk:49: recipe for target 'lib' failed
make[3]: *** [lib] Error 2
/tmp/UB1604_K4.4.0_GCC5.4.0/x86_64-native-linuxapp-gcc-shared/b17b014c39e249b9b491e23956b40094/dpdk/mk/rte.sdkroot.mk:100: recipe for target 'all' failed
make[2]: *** [all] Error 2
/tmp/UB1604_K4.4.0_GCC5.4.0/x86_64-native-linuxapp-gcc-shared/b17b014c39e249b9b491e23956b40094/dpdk/mk/rte.sdkinstall.mk:57: recipe for target 'pre_install' failed
make[1]: *** [pre_install] Error 2
/tmp/UB1604_K4.4.0_GCC5.4.0/x86_64-native-linuxapp-gcc-shared/b17b014c39e249b9b491e23956b40094/dpdk/mk/rte.sdkroot.mk:79: recipe for target 'install' failed
make: *** [install] Error 2

*Failed Build #8:
OS: UB1604
Target: i686-native-linuxapp-gcc
  CC eal.o
  CC eal_cpuflags.o
  CC eal_hugepage_info.o
  CC eal_memory.o
/tmp/UB1604_K4.4.0_GCC5.4.0/i686-native-linuxapp-gcc/b17b014c39e249b9b491e23956b40094/dpdk/lib/librte_eal/linuxapp/eal/eal_memory.c: In function ‘eal_legacy_hugepage_init’:
/tmp/UB1604_K4.4.0_GCC5.4.0/i686-native-linuxapp-gcc/b17b014c39e249b9b491e23956b40094/dpdk/lib/librte_eal/linuxapp/eal/eal_memory.c:1375:11: warning: implicit declaration of function ‘memfd_create’ [-Wimplicit-function-declaration]
   memfd = memfd_create("nohuge", 0);
           ^
/tmp/UB1604_K4.4.0_GCC5.4.0/i686-native-linuxapp-gcc/b17b014c39e249b9b491e23956b40094/dpdk/lib/librte_eal/linuxapp/eal/eal_memory.c:1375:3: warning: nested extern declaration of ‘memfd_create’ [-Wnested-externs]
   memfd = memfd_create("nohuge", 0);
   ^
  CC eal_thread.o
  CC eal_log.o
  CC eal_vfio.o
--
  CC ifpga_enumerate.o
  CC ifpga_feature_dev.o
  CC ifpga_fme.o
  CC ifpga_fme_iperf.o
  CC ifpga_fme_dperf.o
  CC ifpga_fme_error.o
  CC ifpga_port.o
  CC ifpga_port_error.o
  CC opae_hw_api.o
  CC opae_ifpga_hw_api.o
  CC opae_debug.o
  CC ifpga_fme_pr.o
  CC ifpga_rawdev.o
--
  CC main.o
  CC testpmd.o
  LD dpdk-procinfo
/tmp/UB1604_K4.4.0_GCC5.4.0/i686-native-linuxapp-gcc/b17b014c39e249b9b491e23956b40094/dpdk/i686-native-linuxapp-gcc/lib/librte_eal.a(eal_memory.o): In function `eal_legacy_hugepage_init':
eal_memory.c:(.text+0x23df): undefined reference to `memfd_create'
collect2: error: ld returned 1 exit status
/tmp/UB1604_K4.4.0_GCC5.4.0/i686-native-linuxapp-gcc/b17b014c39e249b9b491e23956b40094/dpdk/mk/rte.app.mk:394: recipe for target 'dpdk-procinfo' failed
make[5]: *** [dpdk-procinfo] Error 1
/tmp/UB1604_K4.4.0_GCC5.4.0/i686-native-linuxapp-gcc/b17b014c39e249b9b491e23956b40094/dpdk/mk/rte.subdir.mk:35: recipe for target 'proc-info' failed
make[4]: *** [proc-info] Error 2
make[4]: *** Waiting for unfinished jobs....
  CC parameters.o
  CC cmdline.o
  CC cmdline_flow.o
--
  CC util.o
  CC softnicfwd.o
  LD testpmd
/tmp/UB1604_K4.4.0_GCC5.4.0/i686-native-linuxapp-gcc/b17b014c39e249b9b491e23956b40094/dpdk/i686-native-linuxapp-gcc/lib/librte_eal.a(eal_memory.o): In function `eal_legacy_hugepage_init':
eal_memory.c:(.text+0x23df): undefined reference to `memfd_create'
collect2: error: ld returned 1 exit status
/tmp/UB1604_K4.4.0_GCC5.4.0/i686-native-linuxapp-gcc/b17b014c39e249b9b491e23956b40094/dpdk/mk/rte.app.mk:394: recipe for target 'testpmd' failed
make[5]: *** [testpmd] Error 1
/tmp/UB1604_K4.4.0_GCC5.4.0/i686-native-linuxapp-gcc/b17b014c39e249b9b491e23956b40094/dpdk/mk/rte.subdir.mk:35: recipe for target 'test-pmd' failed
make[4]: *** [test-pmd] Error 2
/tmp/UB1604_K4.4.0_GCC5.4.0/i686-native-linuxapp-gcc/b17b014c39e249b9b491e23956b40094/dpdk/mk/rte.sdkbuild.mk:49: recipe for target 'app' failed
make[3]: *** [app] Error 2
/tmp/UB1604_K4.4.0_GCC5.4.0/i686-native-linuxapp-gcc/b17b014c39e249b9b491e23956b40094/dpdk/mk/rte.sdkroot.mk:100: recipe for target 'all' failed
make[2]: *** [all] Error 2
/tmp/UB1604_K4.4.0_GCC5.4.0/i686-native-linuxapp-gcc/b17b014c39e249b9b491e23956b40094/dpdk/mk/rte.sdkinstall.mk:57: recipe for target 'pre_install' failed
make[1]: *** [pre_install] Error 2
/tmp/UB1604_K4.4.0_GCC5.4.0/i686-native-linuxapp-gcc/b17b014c39e249b9b491e23956b40094/dpdk/mk/rte.sdkroot.mk:79: recipe for target 'install' failed
make: *** [install] Error 2

*Failed Build #9:
OS: UB1604
Target: x86_64-native-linuxapp-clang
  SYMLINK-FILE include/exec-env/rte_kni_common.h
  CC eal.o
  CC eal_cpuflags.o
  CC eal_hugepage_info.o
  CC eal_memory.o
/tmp/UB1604_K4.4.0_GCC5.4.0/x86_64-native-linuxapp-clang/b17b014c39e249b9b491e23956b40094/dpdk/lib/librte_eal/linuxapp/eal/eal_memory.c:1375:11: warning: implicit declaration of function 'memfd_create' is invalid in C99 [-Wimplicit-function-declaration]
                memfd = memfd_create("nohuge", 0);
                        ^
  CC eal_thread.o
1 warning generated.
  CC eal_log.o
  CC eal_vfio.o
  CC eal_vfio_mp_sync.o
  CC eal_memalloc.o
  CC eal_debug.o
--
  AR librte_pmd_dpaa2_qdma.a
  INSTALL-LIB librte_pmd_dpaa2_qdma.a
  CC ifpga_fme.o
  CC ifpga_fme_iperf.o
  CC ifpga_fme_dperf.o
  CC ifpga_fme_error.o
  CC ifpga_port.o
  CC ifpga_port_error.o
  CC opae_hw_api.o
  CC opae_ifpga_hw_api.o
  CC opae_debug.o
  CC ifpga_fme_pr.o
  CC ifpga_rawdev.o
--
  CC main.o
  CC testpmd.o
  LD dpdk-procinfo
/tmp/UB1604_K4.4.0_GCC5.4.0/x86_64-native-linuxapp-clang/b17b014c39e249b9b491e23956b40094/dpdk/x86_64-native-linuxapp-clang/lib/librte_eal.a(eal_memory.o): In function `rte_eal_hugepage_init':
/tmp/UB1604_K4.4.0_GCC5.4.0/x86_64-native-linuxapp-clang/b17b014c39e249b9b491e23956b40094/dpdk/lib/librte_eal/linuxapp/eal/eal_memory.c:(.text+0x186b): undefined reference to `memfd_create'
clang: error: linker command failed with exit code 1 (use -v to see invocation)
/tmp/UB1604_K4.4.0_GCC5.4.0/x86_64-native-linuxapp-clang/b17b014c39e249b9b491e23956b40094/dpdk/mk/rte.app.mk:394: recipe for target 'dpdk-procinfo' failed
make[5]: *** [dpdk-procinfo] Error 1
/tmp/UB1604_K4.4.0_GCC5.4.0/x86_64-native-linuxapp-clang/b17b014c39e249b9b491e23956b40094/dpdk/mk/rte.subdir.mk:35: recipe for target 'proc-info' failed
make[4]: *** [proc-info] Error 2
make[4]: *** Waiting for unfinished jobs....
  CC parameters.o
  CC cmdline.o
  CC cmdline_flow.o
--
  CC util.o
  CC softnicfwd.o
  LD testpmd
/tmp/UB1604_K4.4.0_GCC5.4.0/x86_64-native-linuxapp-clang/b17b014c39e249b9b491e23956b40094/dpdk/x86_64-native-linuxapp-clang/lib/librte_eal.a(eal_memory.o): In function `rte_eal_hugepage_init':
/tmp/UB1604_K4.4.0_GCC5.4.0/x86_64-native-linuxapp-clang/b17b014c39e249b9b491e23956b40094/dpdk/lib/librte_eal/linuxapp/eal/eal_memory.c:(.text+0x186b): undefined reference to `memfd_create'
clang: error: linker command failed with exit code 1 (use -v to see invocation)
/tmp/UB1604_K4.4.0_GCC5.4.0/x86_64-native-linuxapp-clang/b17b014c39e249b9b491e23956b40094/dpdk/mk/rte.app.mk:394: recipe for target 'testpmd' failed
make[5]: *** [testpmd] Error 1
/tmp/UB1604_K4.4.0_GCC5.4.0/x86_64-native-linuxapp-clang/b17b014c39e249b9b491e23956b40094/dpdk/mk/rte.subdir.mk:35: recipe for target 'test-pmd' failed
make[4]: *** [test-pmd] Error 2
/tmp/UB1604_K4.4.0_GCC5.4.0/x86_64-native-linuxapp-clang/b17b014c39e249b9b491e23956b40094/dpdk/mk/rte.sdkbuild.mk:49: recipe for target 'app' failed
make[3]: *** [app] Error 2
/tmp/UB1604_K4.4.0_GCC5.4.0/x86_64-native-linuxapp-clang/b17b014c39e249b9b491e23956b40094/dpdk/mk/rte.sdkroot.mk:100: recipe for target 'all' failed
make[2]: *** [all] Error 2
/tmp/UB1604_K4.4.0_GCC5.4.0/x86_64-native-linuxapp-clang/b17b014c39e249b9b491e23956b40094/dpdk/mk/rte.sdkinstall.mk:57: recipe for target 'pre_install' failed
make[1]: *** [pre_install] Error 2
/tmp/UB1604_K4.4.0_GCC5.4.0/x86_64-native-linuxapp-clang/b17b014c39e249b9b491e23956b40094/dpdk/mk/rte.sdkroot.mk:79: recipe for target 'install' failed
make: *** [install] Error 2

*Failed Build #10:
OS: FC24
Target: x86_64-native-linuxapp-gcc-shared
  CC eal.o
  CC eal_cpuflags.o
  CC eal_hugepage_info.o
  CC eal_memory.o
/tmp/FC24_K4.9.13_GCC6.2.1/x86_64-native-linuxapp-gcc-shared/b17b014c39e249b9b491e23956b40094/dpdk/lib/librte_eal/linuxapp/eal/eal_memory.c: In function ‘eal_legacy_hugepage_init’:
/tmp/FC24_K4.9.13_GCC6.2.1/x86_64-native-linuxapp-gcc-shared/b17b014c39e249b9b491e23956b40094/dpdk/lib/librte_eal/linuxapp/eal/eal_memory.c:1375:11: warning: implicit declaration of function ‘memfd_create’ [-Wimplicit-function-declaration]
   memfd = memfd_create("nohuge", 0);
           ^~~~~~~~~~~~
/tmp/FC24_K4.9.13_GCC6.2.1/x86_64-native-linuxapp-gcc-shared/b17b014c39e249b9b491e23956b40094/dpdk/lib/librte_eal/linuxapp/eal/eal_memory.c:1375:3: warning: nested extern declaration of ‘memfd_create’ [-Wnested-externs]
   memfd = memfd_create("nohuge", 0);
   ^~~~~
  CC eal_thread.o
  CC eal_log.o
  CC eal_vfio.o
--
  CC rte_spinlock.o
  CC rte_cycles.o
  LD librte_eal.so.9.1
eal_memory.o: In function `eal_legacy_hugepage_init':
eal_memory.c:(.text+0x2b74): undefined reference to `memfd_create'
collect2: error: ld returned 1 exit status
/tmp/FC24_K4.9.13_GCC6.2.1/x86_64-native-linuxapp-gcc-shared/b17b014c39e249b9b491e23956b40094/dpdk/mk/rte.lib.mk:98: recipe for target 'librte_eal.so.9.1' failed
make[7]: *** [librte_eal.so.9.1] Error 1
/tmp/FC24_K4.9.13_GCC6.2.1/x86_64-native-linuxapp-gcc-shared/b17b014c39e249b9b491e23956b40094/dpdk/mk/rte.subdir.mk:35: recipe for target 'eal' failed
make[6]: *** [eal] Error 2
/tmp/FC24_K4.9.13_GCC6.2.1/x86_64-native-linuxapp-gcc-shared/b17b014c39e249b9b491e23956b40094/dpdk/mk/rte.subdir.mk:35: recipe for target 'linuxapp' failed
make[5]: *** [linuxapp] Error 2
/tmp/FC24_K4.9.13_GCC6.2.1/x86_64-native-linuxapp-gcc-shared/b17b014c39e249b9b491e23956b40094/dpdk/mk/rte.subdir.mk:35: recipe for target 'librte_eal' failed
make[4]: *** [librte_eal] Error 2
/tmp/FC24_K4.9.13_GCC6.2.1/x86_64-native-linuxapp-gcc-shared/b17b014c39e249b9b491e23956b40094/dpdk/mk/rte.sdkbuild.mk:49: recipe for target 'lib' failed
make[3]: *** [lib] Error 2
/tmp/FC24_K4.9.13_GCC6.2.1/x86_64-native-linuxapp-gcc-shared/b17b014c39e249b9b491e23956b40094/dpdk/mk/rte.sdkroot.mk:100: recipe for target 'all' failed
make[2]: *** [all] Error 2
/tmp/FC24_K4.9.13_GCC6.2.1/x86_64-native-linuxapp-gcc-shared/b17b014c39e249b9b491e23956b40094/dpdk/mk/rte.sdkinstall.mk:57: recipe for target 'pre_install' failed
make[1]: *** [pre_install] Error 2
/tmp/FC24_K4.9.13_GCC6.2.1/x86_64-native-linuxapp-gcc-shared/b17b014c39e249b9b491e23956b40094/dpdk/mk/rte.sdkroot.mk:79: recipe for target 'install' failed
make: *** [install] Error 2

*Failed Build #11:
OS: FC24
Target: x86_64-native-linuxapp-clang
  SYMLINK-FILE include/exec-env/rte_kni_common.h
  CC eal.o
  CC eal_cpuflags.o
  CC eal_hugepage_info.o
  CC eal_memory.o
/tmp/FC24_K4.9.13_GCC6.2.1/x86_64-native-linuxapp-clang/b17b014c39e249b9b491e23956b40094/dpdk/lib/librte_eal/linuxapp/eal/eal_memory.c:1375:11: warning: implicit declaration of function 'memfd_create' is invalid in C99 [-Wimplicit-function-declaration]
                memfd = memfd_create("nohuge", 0);
                        ^
  CC eal_thread.o
1 warning generated.
  CC eal_log.o
  CC eal_vfio.o
  CC eal_vfio_mp_sync.o
  CC eal_memalloc.o
  CC eal_debug.o
--
  INSTALL-LIB librte_pmd_dpaa2_qdma.a
  CC ifpga_feature_dev.o
  CC ifpga_fme.o
  CC ifpga_fme_iperf.o
  CC ifpga_fme_dperf.o
  CC ifpga_fme_error.o
  CC ifpga_port.o
  CC ifpga_port_error.o
  CC opae_hw_api.o
  CC opae_ifpga_hw_api.o
  CC opae_debug.o
  CC ifpga_fme_pr.o
  CC ifpga_rawdev.o
--
  CC testpmd.o
  CC main.o
  LD dpdk-procinfo
/tmp/FC24_K4.9.13_GCC6.2.1/x86_64-native-linuxapp-clang/b17b014c39e249b9b491e23956b40094/dpdk/x86_64-native-linuxapp-clang/lib/librte_eal.a(eal_memory.o): In function `rte_eal_hugepage_init':
/tmp/FC24_K4.9.13_GCC6.2.1/x86_64-native-linuxapp-clang/b17b014c39e249b9b491e23956b40094/dpdk/lib/librte_eal/linuxapp/eal/eal_memory.c:(.text+0x186b): undefined reference to `memfd_create'
clang-3.8: error: linker command failed with exit code 1 (use -v to see invocation)
/tmp/FC24_K4.9.13_GCC6.2.1/x86_64-native-linuxapp-clang/b17b014c39e249b9b491e23956b40094/dpdk/mk/rte.app.mk:394: recipe for target 'dpdk-procinfo' failed
make[5]: *** [dpdk-procinfo] Error 1
/tmp/FC24_K4.9.13_GCC6.2.1/x86_64-native-linuxapp-clang/b17b014c39e249b9b491e23956b40094/dpdk/mk/rte.subdir.mk:35: recipe for target 'proc-info' failed
make[4]: *** [proc-info] Error 2
make[4]: *** Waiting for unfinished jobs....
  CC parameters.o
  CC cmdline.o
  CC cmdline_flow.o
--
  CC util.o
  CC softnicfwd.o
  LD testpmd
/tmp/FC24_K4.9.13_GCC6.2.1/x86_64-native-linuxapp-clang/b17b014c39e249b9b491e23956b40094/dpdk/x86_64-native-linuxapp-clang/lib/librte_eal.a(eal_memory.o): In function `rte_eal_hugepage_init':
/tmp/FC24_K4.9.13_GCC6.2.1/x86_64-native-linuxapp-clang/b17b014c39e249b9b491e23956b40094/dpdk/lib/librte_eal/linuxapp/eal/eal_memory.c:(.text+0x186b): undefined reference to `memfd_create'
clang-3.8: error: linker command failed with exit code 1 (use -v to see invocation)
/tmp/FC24_K4.9.13_GCC6.2.1/x86_64-native-linuxapp-clang/b17b014c39e249b9b491e23956b40094/dpdk/mk/rte.app.mk:394: recipe for target 'testpmd' failed
make[5]: *** [testpmd] Error 1
/tmp/FC24_K4.9.13_GCC6.2.1/x86_64-native-linuxapp-clang/b17b014c39e249b9b491e23956b40094/dpdk/mk/rte.subdir.mk:35: recipe for target 'test-pmd' failed
make[4]: *** [test-pmd] Error 2
/tmp/FC24_K4.9.13_GCC6.2.1/x86_64-native-linuxapp-clang/b17b014c39e249b9b491e23956b40094/dpdk/mk/rte.sdkbuild.mk:49: recipe for target 'app' failed
make[3]: *** [app] Error 2
/tmp/FC24_K4.9.13_GCC6.2.1/x86_64-native-linuxapp-clang/b17b014c39e249b9b491e23956b40094/dpdk/mk/rte.sdkroot.mk:100: recipe for target 'all' failed
make[2]: *** [all] Error 2
/tmp/FC24_K4.9.13_GCC6.2.1/x86_64-native-linuxapp-clang/b17b014c39e249b9b491e23956b40094/dpdk/mk/rte.sdkinstall.mk:57: recipe for target 'pre_install' failed
make[1]: *** [pre_install] Error 2
/tmp/FC24_K4.9.13_GCC6.2.1/x86_64-native-linuxapp-clang/b17b014c39e249b9b491e23956b40094/dpdk/mk/rte.sdkroot.mk:79: recipe for target 'install' failed
make: *** [install] Error 2

*Failed Build #12:
OS: FC25
Target: x86_64-native-linuxapp-gcc-debug
  CC eal.o
  CC eal_cpuflags.o
  CC eal_hugepage_info.o
  CC eal_memory.o
/tmp/FC25_K4.8.6_GCC6.3.1/x86_64-native-linuxapp-gcc-debug/b17b014c39e249b9b491e23956b40094/dpdk/lib/librte_eal/linuxapp/eal/eal_memory.c: In function ‘eal_legacy_hugepage_init’:
/tmp/FC25_K4.8.6_GCC6.3.1/x86_64-native-linuxapp-gcc-debug/b17b014c39e249b9b491e23956b40094/dpdk/lib/librte_eal/linuxapp/eal/eal_memory.c:1375:11: warning: implicit declaration of function ‘memfd_create’ [-Wimplicit-function-declaration]
   memfd = memfd_create("nohuge", 0);
           ^~~~~~~~~~~~
/tmp/FC25_K4.8.6_GCC6.3.1/x86_64-native-linuxapp-gcc-debug/b17b014c39e249b9b491e23956b40094/dpdk/lib/librte_eal/linuxapp/eal/eal_memory.c:1375:3: warning: nested extern declaration of ‘memfd_create’ [-Wnested-externs]
   memfd = memfd_create("nohuge", 0);
   ^~~~~
  CC eal_thread.o
  CC eal_log.o
  CC eal_vfio.o
--
  AR librte_pmd_dpaa2_qdma.a
  INSTALL-LIB librte_pmd_dpaa2_qdma.a
  CC ifpga_fme.o
  CC ifpga_fme_iperf.o
  CC ifpga_fme_dperf.o
  CC ifpga_fme_error.o
  CC ifpga_port.o
  CC ifpga_port_error.o
  CC opae_hw_api.o
  CC opae_ifpga_hw_api.o
  CC opae_debug.o
  CC ifpga_fme_pr.o
  CC ifpga_rawdev.o
--
  CC main.o
  CC testpmd.o
  LD dpdk-procinfo
/tmp/FC25_K4.8.6_GCC6.3.1/x86_64-native-linuxapp-gcc-debug/b17b014c39e249b9b491e23956b40094/dpdk/x86_64-native-linuxapp-gcc/lib/librte_eal.a(eal_memory.o): In function `eal_legacy_hugepage_init':
eal_memory.c:(.text+0x1ad6): undefined reference to `memfd_create'
collect2: error: ld returned 1 exit status
/tmp/FC25_K4.8.6_GCC6.3.1/x86_64-native-linuxapp-gcc-debug/b17b014c39e249b9b491e23956b40094/dpdk/mk/rte.app.mk:394: recipe for target 'dpdk-procinfo' failed
make[5]: *** [dpdk-procinfo] Error 1
/tmp/FC25_K4.8.6_GCC6.3.1/x86_64-native-linuxapp-gcc-debug/b17b014c39e249b9b491e23956b40094/dpdk/mk/rte.subdir.mk:35: recipe for target 'proc-info' failed
make[4]: *** [proc-info] Error 2
make[4]: *** Waiting for unfinished jobs....
  CC parameters.o
  CC cmdline.o
  CC cmdline_flow.o
--
  CC util.o
  CC softnicfwd.o
  LD testpmd
/tmp/FC25_K4.8.6_GCC6.3.1/x86_64-native-linuxapp-gcc-debug/b17b014c39e249b9b491e23956b40094/dpdk/x86_64-native-linuxapp-gcc/lib/librte_eal.a(eal_memory.o): In function `eal_legacy_hugepage_init':
eal_memory.c:(.text+0x1ad6): undefined reference to `memfd_create'
collect2: error: ld returned 1 exit status
/tmp/FC25_K4.8.6_GCC6.3.1/x86_64-native-linuxapp-gcc-debug/b17b014c39e249b9b491e23956b40094/dpdk/mk/rte.app.mk:394: recipe for target 'testpmd' failed
make[5]: *** [testpmd] Error 1
/tmp/FC25_K4.8.6_GCC6.3.1/x86_64-native-linuxapp-gcc-debug/b17b014c39e249b9b491e23956b40094/dpdk/mk/rte.subdir.mk:35: recipe for target 'test-pmd' failed
make[4]: *** [test-pmd] Error 2
/tmp/FC25_K4.8.6_GCC6.3.1/x86_64-native-linuxapp-gcc-debug/b17b014c39e249b9b491e23956b40094/dpdk/mk/rte.sdkbuild.mk:49: recipe for target 'app' failed
make[3]: *** [app] Error 2
/tmp/FC25_K4.8.6_GCC6.3.1/x86_64-native-linuxapp-gcc-debug/b17b014c39e249b9b491e23956b40094/dpdk/mk/rte.sdkroot.mk:100: recipe for target 'all' failed
make[2]: *** [all] Error 2
/tmp/FC25_K4.8.6_GCC6.3.1/x86_64-native-linuxapp-gcc-debug/b17b014c39e249b9b491e23956b40094/dpdk/mk/rte.sdkinstall.mk:57: recipe for target 'pre_install' failed
make[1]: *** [pre_install] Error 2
/tmp/FC25_K4.8.6_GCC6.3.1/x86_64-native-linuxapp-gcc-debug/b17b014c39e249b9b491e23956b40094/dpdk/mk/rte.sdkroot.mk:79: recipe for target 'install' failed
make: *** [install] Error 2

*Failed Build #13:
OS: FC24
Target: i686-native-linuxapp-gcc
  CC eal.o
  CC eal_cpuflags.o
  CC eal_hugepage_info.o
  CC eal_memory.o
/tmp/FC24_K4.5.5_GCC6.1.1/i686-native-linuxapp-gcc/b17b014c39e249b9b491e23956b40094/dpdk/lib/librte_eal/linuxapp/eal/eal_memory.c: In function ‘eal_legacy_hugepage_init’:
/tmp/FC24_K4.5.5_GCC6.1.1/i686-native-linuxapp-gcc/b17b014c39e249b9b491e23956b40094/dpdk/lib/librte_eal/linuxapp/eal/eal_memory.c:1375:11: warning: implicit declaration of function ‘memfd_create’ [-Wimplicit-function-declaration]
   memfd = memfd_create("nohuge", 0);
           ^~~~~~~~~~~~
/tmp/FC24_K4.5.5_GCC6.1.1/i686-native-linuxapp-gcc/b17b014c39e249b9b491e23956b40094/dpdk/lib/librte_eal/linuxapp/eal/eal_memory.c:1375:3: warning: nested extern declaration of ‘memfd_create’ [-Wnested-externs]
   memfd = memfd_create("nohuge", 0);
   ^~~~~
  CC eal_thread.o
  CC eal_log.o
  CC eal_vfio.o
--
  CC ifpga_enumerate.o
  CC ifpga_feature_dev.o
  CC ifpga_fme.o
  CC ifpga_fme_iperf.o
  CC ifpga_fme_dperf.o
  CC ifpga_fme_error.o
  CC ifpga_port.o
  CC ifpga_port_error.o
  CC opae_hw_api.o
  CC opae_ifpga_hw_api.o
  CC opae_debug.o
  CC ifpga_fme_pr.o
  CC ifpga_rawdev.o
--
  CC main.o
  CC testpmd.o
  LD dpdk-procinfo
/tmp/FC24_K4.5.5_GCC6.1.1/i686-native-linuxapp-gcc/b17b014c39e249b9b491e23956b40094/dpdk/i686-native-linuxapp-gcc/lib/librte_eal.a(eal_memory.o): In function `eal_legacy_hugepage_init':
eal_memory.c:(.text+0x1c9c): undefined reference to `memfd_create'
collect2: error: ld returned 1 exit status
/tmp/FC24_K4.5.5_GCC6.1.1/i686-native-linuxapp-gcc/b17b014c39e249b9b491e23956b40094/dpdk/mk/rte.app.mk:394: recipe for target 'dpdk-procinfo' failed
make[5]: *** [dpdk-procinfo] Error 1
/tmp/FC24_K4.5.5_GCC6.1.1/i686-native-linuxapp-gcc/b17b014c39e249b9b491e23956b40094/dpdk/mk/rte.subdir.mk:35: recipe for target 'proc-info' failed
make[4]: *** [proc-info] Error 2
make[4]: *** Waiting for unfinished jobs....
  CC parameters.o
  CC cmdline.o
  CC cmdline_flow.o
--
  CC util.o
  CC softnicfwd.o
  LD testpmd
/tmp/FC24_K4.5.5_GCC6.1.1/i686-native-linuxapp-gcc/b17b014c39e249b9b491e23956b40094/dpdk/i686-native-linuxapp-gcc/lib/librte_eal.a(eal_memory.o): In function `eal_legacy_hugepage_init':
eal_memory.c:(.text+0x1c9c): undefined reference to `memfd_create'
collect2: error: ld returned 1 exit status
/tmp/FC24_K4.5.5_GCC6.1.1/i686-native-linuxapp-gcc/b17b014c39e249b9b491e23956b40094/dpdk/mk/rte.app.mk:394: recipe for target 'testpmd' failed
make[5]: *** [testpmd] Error 1
/tmp/FC24_K4.5.5_GCC6.1.1/i686-native-linuxapp-gcc/b17b014c39e249b9b491e23956b40094/dpdk/mk/rte.subdir.mk:35: recipe for target 'test-pmd' failed
make[4]: *** [test-pmd] Error 2
/tmp/FC24_K4.5.5_GCC6.1.1/i686-native-linuxapp-gcc/b17b014c39e249b9b491e23956b40094/dpdk/mk/rte.sdkbuild.mk:49: recipe for target 'app' failed
make[3]: *** [app] Error 2
/tmp/FC24_K4.5.5_GCC6.1.1/i686-native-linuxapp-gcc/b17b014c39e249b9b491e23956b40094/dpdk/mk/rte.sdkroot.mk:100: recipe for target 'all' failed
make[2]: *** [all] Error 2
/tmp/FC24_K4.5.5_GCC6.1.1/i686-native-linuxapp-gcc/b17b014c39e249b9b491e23956b40094/dpdk/mk/rte.sdkinstall.mk:57: recipe for target 'pre_install' failed
make[1]: *** [pre_install] Error 2
/tmp/FC24_K4.5.5_GCC6.1.1/i686-native-linuxapp-gcc/b17b014c39e249b9b491e23956b40094/dpdk/mk/rte.sdkroot.mk:79: recipe for target 'install' failed
make: *** [install] Error 2

DPDK STV team


More information about the test-report mailing list