[dpdk-test-report] |FAILURE| pw48077[v3] build: establish an invariant machine type

sys_stv at intel.com sys_stv at intel.com
Thu Nov 15 07:27:28 CET 2018


Test-Label: Intel-compilation
Test-Status: FAILURE
http://dpdk.org/patch/48077

_Compilation issues_

Submitter: Christian Ehrhardt <christian.ehrhardt at canonical.com>
Date: 2018-11-14 14:33:15
DPDK git baseline: Repo:dpdk-master, CommitID: 3e42b6ce06a1901b1ab631df4484ec8f548091c6

Build Summary: 15 Builds Done, 14 Successful, 1 Failures

Test environment and configuration as below:

OS: FC25
	Kernel Version: 4.5.5-300.fc24.x86_64
	CPU info: Intel(R) Xeon(R) CPU E5-2699 v3 @ 2.30GHz
	GCC Version: gcc (GCC) 6.1.1 20160510 (Red Hat 6.1.1-2)
	Clang Version: 3.8.0 (tags/RELEASE_380/final)
	x86_64-native-linuxapp-gcc
	x86_64-native-linuxapp-gcc-debug

OS: FC24
	Kernel Version: 4.9.13-100.fc24.x86_64
	CPU info: Intel(R) Xeon(R) CPU E5-2699 v3 @ 2.30GHz
	GCC Version: gcc (GCC) 6.2.1 20160916 (Red Hat 6.2.1-2)
	Clang Version: 3.8.0 (tags/RELEASE_380/final)
	i686-native-linuxapp-gcc
	x86_64-native-linuxapp-clang
	x86_64-native-linuxapp-gcc-shared

OS: CENTOS
	Kernel Version: 3.10.0-514.10.2.el7.x86_64
	CPU info: Intel(R) Xeon(R) CPU E5-2699 v3 @ 2.30GHz
	GCC Version: gcc (GCC) 4.8.5 20150623 (Red Hat 4.8.5-28)
	Clang Version: 3.4.2 (tags/RELEASE_34/dot2-final)
	x86_64-native-linuxapp-clang
	i686-native-linuxapp-gcc
	x86_64-native-linuxapp-gcc
	x86_64-native-linuxapp-gcc-shared

OS: UB1604
	Kernel Version: 
	CPU info: 
	GCC Version: 
	Clang Version: NA
	x86_64-native-linuxapp-gcc
	i686-native-linuxapp-gcc
	x86_64-native-linuxapp-gcc-shared
	x86_64-native-linuxapp-clang

OS: FreeBSD
	Kernel Version: 10.3-RELEASE
	CPU info: Intel(R) Xeon(R) CPU E5-2699 v3 @ 2.30GHz (2294.75-MHz K8-class CPU)
	GCC Version: gcc (FreeBSD Ports Collection) 7.3.0
	Clang Version: 3.4.1 (tags/RELEASE_34/dot1-final 208032) 20140512
	x86_64-native-bsdapp-clang
	x86_64-native-bsdapp-gcc

*Failed Build #1:
OS: UB1604
Target: x86_64-native-linuxapp-clang
  INSTALL-LIB librte_pmd_dpaa2_qdma.a
  CC ifpga_feature_dev.o
  CC ifpga_fme.o
  CC ifpga_fme_iperf.o
  CC ifpga_fme_dperf.o
  CC ifpga_fme_error.o
  CC ifpga_port.o
  CC ifpga_port_error.o
  CC opae_hw_api.o
  CC opae_ifpga_hw_api.o
  CC opae_debug.o
  CC ifpga_fme_pr.o
  CC ifpga_rawdev.o
--
== Build app/test-eventdev
  INSTALL-APP testpmd
  CC evt_main.o
  INSTALL-MAP testpmd.map
  CC evt_options.o
grep: error while loading shared libraries: libpcre.so.3: cannot open shared object file: No such file or directory
/bin/sh: error while loading shared libraries: libc.so.6: cannot open shared object file: No such file or directory
/tmp/UB1604_K4.4.0_GCC5.4.0/x86_64-native-linuxapp-clang/d8af0d3ddc9249429c35275a14ca3a1d/dpdk/mk/internal/rte.compile-pre.mk:114: recipe for target 'evt_main.o' failed
make[5]: *** [evt_main.o] Error 127
make[5]: *** Waiting for unfinished jobs....
grep: error while loading shared libraries: libpcre.so.3: cannot open shared object file: No such file or directory
/bin/sh: error while loading shared libraries: libc.so.6: cannot open shared object file: No such file or directory
/tmp/UB1604_K4.4.0_GCC5.4.0/x86_64-native-linuxapp-clang/d8af0d3ddc9249429c35275a14ca3a1d/dpdk/mk/internal/rte.compile-pre.mk:114: recipe for target 'evt_options.o' failed
make[5]: *** [evt_options.o] Error 127
/tmp/UB1604_K4.4.0_GCC5.4.0/x86_64-native-linuxapp-clang/d8af0d3ddc9249429c35275a14ca3a1d/dpdk/mk/rte.subdir.mk:35: recipe for target 'test-eventdev' failed
make[4]: *** [test-eventdev] Error 2
/tmp/UB1604_K4.4.0_GCC5.4.0/x86_64-native-linuxapp-clang/d8af0d3ddc9249429c35275a14ca3a1d/dpdk/mk/rte.sdkbuild.mk:49: recipe for target 'app' failed
make[3]: *** [app] Error 2
/tmp/UB1604_K4.4.0_GCC5.4.0/x86_64-native-linuxapp-clang/d8af0d3ddc9249429c35275a14ca3a1d/dpdk/mk/rte.sdkroot.mk:100: recipe for target 'all' failed
make[2]: *** [all] Error 2
/tmp/UB1604_K4.4.0_GCC5.4.0/x86_64-native-linuxapp-clang/d8af0d3ddc9249429c35275a14ca3a1d/dpdk/mk/rte.sdkinstall.mk:57: recipe for target 'pre_install' failed
make[1]: *** [pre_install] Error 2
/tmp/UB1604_K4.4.0_GCC5.4.0/x86_64-native-linuxapp-clang/d8af0d3ddc9249429c35275a14ca3a1d/dpdk/mk/rte.sdkroot.mk:79: recipe for target 'install' failed
make: *** [install] Error 2

DPDK STV team


More information about the test-report mailing list