[dpdk-test-report] |FAILURE| pw48138[2/2] cryptodev: change symmetric session structure

sys_stv at intel.com sys_stv at intel.com
Thu Nov 15 18:47:32 CET 2018


Test-Label: Intel-compilation
Test-Status: FAILURE
http://dpdk.org/patch/48138

_Compilation issues_

Submitter: Fan Zhang <roy.fan.zhang at intel.com>
Date: 2018-11-15 17:24:27
DPDK git baseline: Repo:dpdk-master, CommitID: 3e42b6ce06a1901b1ab631df4484ec8f548091c6

Build Summary: 15 Builds Done, 0 Successful, 15 Failures

Test environment and configuration as below:

OS: FC25
	Kernel Version: 4.5.5-300.fc24.x86_64
	CPU info: Intel(R) Xeon(R) CPU E5-2699 v3 @ 2.30GHz
	GCC Version: gcc (GCC) 6.1.1 20160510 (Red Hat 6.1.1-2)
	Clang Version: 3.8.0 (tags/RELEASE_380/final)
	x86_64-native-linuxapp-gcc
	x86_64-native-linuxapp-gcc-debug

OS: FC24
	Kernel Version: 4.9.13-100.fc24.x86_64
	CPU info: Intel(R) Xeon(R) CPU E5-2699 v3 @ 2.30GHz
	GCC Version: gcc (GCC) 6.3.1 20161221 (Red Hat 6.3.1-1)
	Clang Version: 3.8.1 (tags/RELEASE_381/final)
	x86_64-native-linuxapp-gcc-shared
	i686-native-linuxapp-gcc
	x86_64-native-linuxapp-clang

OS: CENTOS
	Kernel Version: 3.10.0-514.10.2.el7.x86_64
	CPU info: Intel(R) Xeon(R) CPU E5-2699 v3 @ 2.30GHz
	GCC Version: gcc (GCC) 4.8.5 20150623 (Red Hat 4.8.5-4)
	Clang Version: 3.4.2 (tags/RELEASE_34/dot2-final)
	x86_64-native-linuxapp-clang
	i686-native-linuxapp-gcc
	x86_64-native-linuxapp-gcc-shared
	x86_64-native-linuxapp-gcc

OS: UB1604
	Kernel Version: 4.4.0-137-generic
	CPU info: Intel(R) Xeon(R) CPU E5-2699 v3 @ 2.30GHz
	GCC Version: gcc (Ubuntu 5.4.0-6ubuntu1~16.04.10) 5.4.0 20160609
	Clang Version: 3.8.0-2ubuntu4 (tags/RELEASE_380/final)
	x86_64-native-linuxapp-gcc
	x86_64-native-linuxapp-clang
	i686-native-linuxapp-gcc
	x86_64-native-linuxapp-gcc-shared

OS: FreeBSD
	Kernel Version: 10.3-RELEASE
	CPU info: Intel(R) Xeon(R) CPU E5-2699 v3 @ 2.30GHz (2294.75-MHz K8-class CPU)
	GCC Version: gcc (FreeBSD Ports Collection) 7.3.0
	Clang Version: 3.4.1 (tags/RELEASE_34/dot1-final 208032) 20140512
	x86_64-native-bsdapp-clang
	x86_64-native-bsdapp-gcc

*Failed Build #1:
OS: FC25
Target: x86_64-native-linuxapp-gcc
  CC aesni_gcm_pmd.o
  CC ark_ddm.o
  CC ark_ethdev.o
In file included from /tmp/FC25_K4.8.6_GCC6.3.1/x86_64-native-linuxapp-gcc/ebcd50f3fba84414a30f159de6c31848/dpdk/drivers/crypto/aesni_gcm/aesni_gcm_pmd_private.h:8:0,
                 from /tmp/FC25_K4.8.6_GCC6.3.1/x86_64-native-linuxapp-gcc/ebcd50f3fba84414a30f159de6c31848/dpdk/drivers/crypto/aesni_gcm/aesni_gcm_pmd.c:14:
/tmp/FC25_K4.8.6_GCC6.3.1/x86_64-native-linuxapp-gcc/ebcd50f3fba84414a30f159de6c31848/dpdk/drivers/crypto/aesni_gcm/aesni_gcm_ops.h:12:28: fatal error: intel-ipsec-mb.h: No such file or directory
 #include <intel-ipsec-mb.h>
                            ^
compilation terminated.
/tmp/FC25_K4.8.6_GCC6.3.1/x86_64-native-linuxapp-gcc/ebcd50f3fba84414a30f159de6c31848/dpdk/mk/internal/rte.compile-pre.mk:114: recipe for target 'aesni_gcm_pmd.o' failed
make[6]: *** [aesni_gcm_pmd.o] Error 1
/tmp/FC25_K4.8.6_GCC6.3.1/x86_64-native-linuxapp-gcc/ebcd50f3fba84414a30f159de6c31848/dpdk/mk/rte.subdir.mk:35: recipe for target 'aesni_gcm' failed
make[5]: *** [aesni_gcm] Error 2
/tmp/FC25_K4.8.6_GCC6.3.1/x86_64-native-linuxapp-gcc/ebcd50f3fba84414a30f159de6c31848/dpdk/mk/rte.subdir.mk:35: recipe for target 'crypto' failed
make[4]: *** [crypto] Error 2
make[4]: *** Waiting for unfinished jobs....
  CC ark_ethdev_rx.o
  PMDINFO ark_ethdev.o.pmd.c
  CC ark_ethdev.o.pmd.o
--
  CC rte_eth_softnic_cryptodev.o
  CC parser.o
  CC conn.o
  AR librte_pmd_softnic.a
  INSTALL-LIB librte_pmd_softnic.a
/tmp/FC25_K4.8.6_GCC6.3.1/x86_64-native-linuxapp-gcc/ebcd50f3fba84414a30f159de6c31848/dpdk/mk/rte.sdkbuild.mk:49: recipe for target 'drivers' failed
make[3]: *** [drivers] Error 2
/tmp/FC25_K4.8.6_GCC6.3.1/x86_64-native-linuxapp-gcc/ebcd50f3fba84414a30f159de6c31848/dpdk/mk/rte.sdkroot.mk:100: recipe for target 'all' failed
make[2]: *** [all] Error 2
/tmp/FC25_K4.8.6_GCC6.3.1/x86_64-native-linuxapp-gcc/ebcd50f3fba84414a30f159de6c31848/dpdk/mk/rte.sdkinstall.mk:57: recipe for target 'pre_install' failed
make[1]: *** [pre_install] Error 2
/tmp/FC25_K4.8.6_GCC6.3.1/x86_64-native-linuxapp-gcc/ebcd50f3fba84414a30f159de6c31848/dpdk/mk/rte.sdkroot.mk:79: recipe for target 'install' failed
make: *** [install] Error 2

*Failed Build #2:
OS: UB1604
Target: x86_64-native-linuxapp-gcc
  LD ark_ethdev.o
  CC ark_ethdev_rx.o
  CC aesni_gcm_pmd.o
In file included from /tmp/UB1604_K4.8.0_GCC6.2.0/x86_64-native-linuxapp-gcc/ebcd50f3fba84414a30f159de6c31848/dpdk/drivers/crypto/aesni_gcm/aesni_gcm_pmd_private.h:8:0,
                 from /tmp/UB1604_K4.8.0_GCC6.2.0/x86_64-native-linuxapp-gcc/ebcd50f3fba84414a30f159de6c31848/dpdk/drivers/crypto/aesni_gcm/aesni_gcm_pmd.c:14:
/tmp/UB1604_K4.8.0_GCC6.2.0/x86_64-native-linuxapp-gcc/ebcd50f3fba84414a30f159de6c31848/dpdk/drivers/crypto/aesni_gcm/aesni_gcm_ops.h:12:28: fatal error: intel-ipsec-mb.h: No such file or directory
 #include <intel-ipsec-mb.h>
                            ^
compilation terminated.
/tmp/UB1604_K4.8.0_GCC6.2.0/x86_64-native-linuxapp-gcc/ebcd50f3fba84414a30f159de6c31848/dpdk/mk/internal/rte.compile-pre.mk:114: recipe for target 'aesni_gcm_pmd.o' failed
make[6]: *** [aesni_gcm_pmd.o] Error 1
/tmp/UB1604_K4.8.0_GCC6.2.0/x86_64-native-linuxapp-gcc/ebcd50f3fba84414a30f159de6c31848/dpdk/mk/rte.subdir.mk:35: recipe for target 'aesni_gcm' failed
make[5]: *** [aesni_gcm] Error 2
/tmp/UB1604_K4.8.0_GCC6.2.0/x86_64-native-linuxapp-gcc/ebcd50f3fba84414a30f159de6c31848/dpdk/mk/rte.subdir.mk:35: recipe for target 'crypto' failed
make[4]: *** [crypto] Error 2
make[4]: *** Waiting for unfinished jobs....
== Build drivers/net/atlantic
  CC atl_rxtx.o
  CC ark_ethdev_tx.o
--
  CC rte_eth_softnic_cryptodev.o
  CC parser.o
  CC conn.o
  AR librte_pmd_softnic.a
  INSTALL-LIB librte_pmd_softnic.a
/tmp/UB1604_K4.8.0_GCC6.2.0/x86_64-native-linuxapp-gcc/ebcd50f3fba84414a30f159de6c31848/dpdk/mk/rte.sdkbuild.mk:49: recipe for target 'drivers' failed
make[3]: *** [drivers] Error 2
/tmp/UB1604_K4.8.0_GCC6.2.0/x86_64-native-linuxapp-gcc/ebcd50f3fba84414a30f159de6c31848/dpdk/mk/rte.sdkroot.mk:100: recipe for target 'all' failed
make[2]: *** [all] Error 2
/tmp/UB1604_K4.8.0_GCC6.2.0/x86_64-native-linuxapp-gcc/ebcd50f3fba84414a30f159de6c31848/dpdk/mk/rte.sdkinstall.mk:57: recipe for target 'pre_install' failed
make[1]: *** [pre_install] Error 2
/tmp/UB1604_K4.8.0_GCC6.2.0/x86_64-native-linuxapp-gcc/ebcd50f3fba84414a30f159de6c31848/dpdk/mk/rte.sdkroot.mk:79: recipe for target 'install' failed
make: *** [install] Error 2

*Failed Build #3:
OS: CENTOS
Target: x86_64-native-linuxapp-clang
== Build drivers/crypto/aesni_gcm
  CC aesni_gcm_pmd.o
  CC ark_ethdev_tx.o
In file included from /tmp/CENTOS_K3.10.0_GCC4.8.5/x86_64-native-linuxapp-clang/ebcd50f3fba84414a30f159de6c31848/dpdk/drivers/crypto/aesni_gcm/aesni_gcm_pmd.c:14:
In file included from /tmp/CENTOS_K3.10.0_GCC4.8.5/x86_64-native-linuxapp-clang/ebcd50f3fba84414a30f159de6c31848/dpdk/drivers/crypto/aesni_gcm/aesni_gcm_pmd_private.h:8:
/tmp/CENTOS_K3.10.0_GCC4.8.5/x86_64-native-linuxapp-clang/ebcd50f3fba84414a30f159de6c31848/dpdk/drivers/crypto/aesni_gcm/aesni_gcm_ops.h:12:10: fatal error: 'intel-ipsec-mb.h' file not found
  CC ark_mpu.o
  CC ark_pktchkr.o
#include <intel-ipsec-mb.h>
         ^
  CC ark_pktdir.o
--
  CC atl_hw_regs.o
  CC hw_atl_utils.o
  CC hw_atl_llh.o
  CC hw_atl_utils_fw2x.o
  CC hw_atl_b0.o
1 error generated.
make[6]: *** [aesni_gcm_pmd.o] Error 1
make[5]: *** [aesni_gcm] Error 2
make[4]: *** [crypto] Error 2
make[4]: *** Waiting for unfinished jobs....
== Build drivers/net/avf

*Failed Build #4:
OS: CENTOS
Target: i686-native-linuxapp-gcc
== Build drivers/net/ark
== Build drivers/crypto/openssl
  CC ark_ddm.o
  CC ark_ethdev.o
  CC rte_openssl_pmd.o
/tmp/CENTOS_K3.10.0_GCC4.8.5/i686-native-linuxapp-gcc/ebcd50f3fba84414a30f159de6c31848/dpdk/drivers/crypto/openssl/rte_openssl_pmd.c:13:26: fatal error: openssl/hmac.h: No such file or directory
 #include <openssl/hmac.h>
                          ^
compilation terminated.
  PMDINFO ark_ethdev.o.pmd.c
  CC ark_ethdev.o.pmd.o

*Failed Build #5:
OS: UB1604
Target: x86_64-native-linuxapp-clang
  INSTALL-LIB librte_pmd_aesni_mb.a
== Build drivers/crypto/openssl
  CC rte_openssl_pmd.o
  CC ark_rqp.o
  CC ark_udm.o
/tmp/UB1604_K4.4.0_GCC5.4.0/x86_64-native-linuxapp-clang/ebcd50f3fba84414a30f159de6c31848/dpdk/drivers/crypto/openssl/rte_openssl_pmd.c:13:10: fatal error: 'openssl/hmac.h' file not found
#include <openssl/hmac.h>
         ^
1 error generated.
/tmp/UB1604_K4.4.0_GCC5.4.0/x86_64-native-linuxapp-clang/ebcd50f3fba84414a30f159de6c31848/dpdk/mk/internal/rte.compile-pre.mk:114: recipe for target 'rte_openssl_pmd.o' failed
make[6]: *** [rte_openssl_pmd.o] Error 1
/tmp/UB1604_K4.4.0_GCC5.4.0/x86_64-native-linuxapp-clang/ebcd50f3fba84414a30f159de6c31848/dpdk/mk/rte.subdir.mk:35: recipe for target 'openssl' failed
make[5]: *** [openssl] Error 2
/tmp/UB1604_K4.4.0_GCC5.4.0/x86_64-native-linuxapp-clang/ebcd50f3fba84414a30f159de6c31848/dpdk/mk/rte.subdir.mk:35: recipe for target 'crypto' failed
make[4]: *** [crypto] Error 2
make[4]: *** Waiting for unfinished jobs....
== Build drivers/net/atlantic
  AR librte_pmd_ark.a
  INSTALL-LIB librte_pmd_ark.a
--
  CC rte_eth_softnic_cryptodev.o
  CC parser.o
  CC conn.o
  AR librte_pmd_softnic.a
  INSTALL-LIB librte_pmd_softnic.a
/tmp/UB1604_K4.4.0_GCC5.4.0/x86_64-native-linuxapp-clang/ebcd50f3fba84414a30f159de6c31848/dpdk/mk/rte.sdkbuild.mk:49: recipe for target 'drivers' failed
make[3]: *** [drivers] Error 2
/tmp/UB1604_K4.4.0_GCC5.4.0/x86_64-native-linuxapp-clang/ebcd50f3fba84414a30f159de6c31848/dpdk/mk/rte.sdkroot.mk:100: recipe for target 'all' failed
make[2]: *** [all] Error 2
/tmp/UB1604_K4.4.0_GCC5.4.0/x86_64-native-linuxapp-clang/ebcd50f3fba84414a30f159de6c31848/dpdk/mk/rte.sdkinstall.mk:57: recipe for target 'pre_install' failed
make[1]: *** [pre_install] Error 2
/tmp/UB1604_K4.4.0_GCC5.4.0/x86_64-native-linuxapp-clang/ebcd50f3fba84414a30f159de6c31848/dpdk/mk/rte.sdkroot.mk:79: recipe for target 'install' failed
make: *** [install] Error 2

*Failed Build #6:
OS: CENTOS
Target: x86_64-native-linuxapp-gcc-shared
== Build drivers/crypto/aesni_gcm
  CC ark_ddm.o
  CC aesni_gcm_pmd.o
In file included from /tmp/CENTOS_K3.10.0_GCC4.8.5/x86_64-native-linuxapp-gcc-shared/ebcd50f3fba84414a30f159de6c31848/dpdk/drivers/crypto/aesni_gcm/aesni_gcm_pmd_private.h:8:0,
                 from /tmp/CENTOS_K3.10.0_GCC4.8.5/x86_64-native-linuxapp-gcc-shared/ebcd50f3fba84414a30f159de6c31848/dpdk/drivers/crypto/aesni_gcm/aesni_gcm_pmd.c:14:
/tmp/CENTOS_K3.10.0_GCC4.8.5/x86_64-native-linuxapp-gcc-shared/ebcd50f3fba84414a30f159de6c31848/dpdk/drivers/crypto/aesni_gcm/aesni_gcm_ops.h:12:28: fatal error: intel-ipsec-mb.h: No such file or directory
 #include <intel-ipsec-mb.h>
                            ^
compilation terminated.
  CC ark_ethdev.o
make[6]: *** [aesni_gcm_pmd.o] Error 1

*Failed Build #7:
OS: UB1604
Target: i686-native-linuxapp-gcc
  CC atl_ethdev.o
  AR librte_pmd_crypto_scheduler.a
  INSTALL-LIB librte_pmd_crypto_scheduler.a
== Build drivers/crypto/snow3g
/tmp/UB1604_K4.4.0_GCC5.4.0/i686-native-linuxapp-gcc/ebcd50f3fba84414a30f159de6c31848/dpdk/drivers/crypto/snow3g/Makefile:8: *** "Please define LIBSSO_SNOW3G_PATH environment variable".  Stop.
/tmp/UB1604_K4.4.0_GCC5.4.0/i686-native-linuxapp-gcc/ebcd50f3fba84414a30f159de6c31848/dpdk/mk/rte.subdir.mk:35: recipe for target 'snow3g' failed
make[5]: *** [snow3g] Error 2
/tmp/UB1604_K4.4.0_GCC5.4.0/i686-native-linuxapp-gcc/ebcd50f3fba84414a30f159de6c31848/dpdk/mk/rte.subdir.mk:35: recipe for target 'crypto' failed
make[4]: *** [crypto] Error 2
make[4]: *** Waiting for unfinished jobs....
  PMDINFO atl_ethdev.o.pmd.c
  CC atl_ethdev.o.pmd.o
== Build drivers/net/avf
--
  PMDINFO ifcvf_vdpa.o.pmd.c
  CC ifcvf_vdpa.o.pmd.o
  LD ifcvf_vdpa.o
  AR librte_pmd_ifc.a
  INSTALL-LIB librte_pmd_ifc.a
/tmp/UB1604_K4.4.0_GCC5.4.0/i686-native-linuxapp-gcc/ebcd50f3fba84414a30f159de6c31848/dpdk/mk/rte.sdkbuild.mk:49: recipe for target 'drivers' failed
make[3]: *** [drivers] Error 2
/tmp/UB1604_K4.4.0_GCC5.4.0/i686-native-linuxapp-gcc/ebcd50f3fba84414a30f159de6c31848/dpdk/mk/rte.sdkroot.mk:100: recipe for target 'all' failed
make[2]: *** [all] Error 2
/tmp/UB1604_K4.4.0_GCC5.4.0/i686-native-linuxapp-gcc/ebcd50f3fba84414a30f159de6c31848/dpdk/mk/rte.sdkinstall.mk:57: recipe for target 'pre_install' failed
make[1]: *** [pre_install] Error 2
/tmp/UB1604_K4.4.0_GCC5.4.0/i686-native-linuxapp-gcc/ebcd50f3fba84414a30f159de6c31848/dpdk/mk/rte.sdkroot.mk:79: recipe for target 'install' failed
make: *** [install] Error 2

*Failed Build #8:
OS: CENTOS
Target: x86_64-native-linuxapp-gcc
  LD ark_ethdev.o
  CC ark_ethdev_rx.o
  CC ark_ethdev_tx.o
In file included from /tmp/CENTOS_K3.10.0_GCC4.8.5/x86_64-native-linuxapp-gcc/ebcd50f3fba84414a30f159de6c31848/dpdk/drivers/crypto/aesni_gcm/aesni_gcm_pmd_private.h:8:0,
                 from /tmp/CENTOS_K3.10.0_GCC4.8.5/x86_64-native-linuxapp-gcc/ebcd50f3fba84414a30f159de6c31848/dpdk/drivers/crypto/aesni_gcm/aesni_gcm_pmd.c:14:
/tmp/CENTOS_K3.10.0_GCC4.8.5/x86_64-native-linuxapp-gcc/ebcd50f3fba84414a30f159de6c31848/dpdk/drivers/crypto/aesni_gcm/aesni_gcm_ops.h:12:28: fatal error: intel-ipsec-mb.h: No such file or directory
 #include <intel-ipsec-mb.h>
                            ^
compilation terminated.
make[6]: *** [aesni_gcm_pmd.o] Error 1
make[5]: *** [aesni_gcm] Error 2

*Failed Build #9:
OS: UB1604
Target: x86_64-native-linuxapp-gcc-shared
  LD ark_ethdev.o
  CC ark_ethdev_rx.o
  CC aesni_gcm_pmd.o
In file included from /tmp/UB1604_K4.4.0_GCC5.4.0/x86_64-native-linuxapp-gcc-shared/ebcd50f3fba84414a30f159de6c31848/dpdk/drivers/crypto/aesni_gcm/aesni_gcm_pmd_private.h:8:0,
                 from /tmp/UB1604_K4.4.0_GCC5.4.0/x86_64-native-linuxapp-gcc-shared/ebcd50f3fba84414a30f159de6c31848/dpdk/drivers/crypto/aesni_gcm/aesni_gcm_pmd.c:14:
/tmp/UB1604_K4.4.0_GCC5.4.0/x86_64-native-linuxapp-gcc-shared/ebcd50f3fba84414a30f159de6c31848/dpdk/drivers/crypto/aesni_gcm/aesni_gcm_ops.h:12:28: fatal error: intel-ipsec-mb.h: No such file or directory
compilation terminated.
/tmp/UB1604_K4.4.0_GCC5.4.0/x86_64-native-linuxapp-gcc-shared/ebcd50f3fba84414a30f159de6c31848/dpdk/mk/internal/rte.compile-pre.mk:114: recipe for target 'aesni_gcm_pmd.o' failed
make[6]: *** [aesni_gcm_pmd.o] Error 1
/tmp/UB1604_K4.4.0_GCC5.4.0/x86_64-native-linuxapp-gcc-shared/ebcd50f3fba84414a30f159de6c31848/dpdk/mk/rte.subdir.mk:35: recipe for target 'aesni_gcm' failed
make[5]: *** [aesni_gcm] Error 2
/tmp/UB1604_K4.4.0_GCC5.4.0/x86_64-native-linuxapp-gcc-shared/ebcd50f3fba84414a30f159de6c31848/dpdk/mk/rte.subdir.mk:35: recipe for target 'crypto' failed
make[4]: *** [crypto] Error 2
make[4]: *** Waiting for unfinished jobs....
== Build drivers/net/atlantic
  CC ark_ethdev_tx.o
  CC atl_rxtx.o
--
  CC rte_eth_softnic_cryptodev.o
  CC parser.o
  CC conn.o
  LD librte_pmd_softnic.so.1.1
  INSTALL-LIB librte_pmd_softnic.so.1.1
/tmp/UB1604_K4.4.0_GCC5.4.0/x86_64-native-linuxapp-gcc-shared/ebcd50f3fba84414a30f159de6c31848/dpdk/mk/rte.sdkbuild.mk:49: recipe for target 'drivers' failed
make[3]: *** [drivers] Error 2
/tmp/UB1604_K4.4.0_GCC5.4.0/x86_64-native-linuxapp-gcc-shared/ebcd50f3fba84414a30f159de6c31848/dpdk/mk/rte.sdkroot.mk:100: recipe for target 'all' failed
make[2]: *** [all] Error 2
/tmp/UB1604_K4.4.0_GCC5.4.0/x86_64-native-linuxapp-gcc-shared/ebcd50f3fba84414a30f159de6c31848/dpdk/mk/rte.sdkinstall.mk:57: recipe for target 'pre_install' failed
make[1]: *** [pre_install] Error 2
/tmp/UB1604_K4.4.0_GCC5.4.0/x86_64-native-linuxapp-gcc-shared/ebcd50f3fba84414a30f159de6c31848/dpdk/mk/rte.sdkroot.mk:79: recipe for target 'install' failed
make: *** [install] Error 2

*Failed Build #10:
OS: FreeBSD
Target: x86_64-native-bsdapp-clang
machine -> /usr/src/sys/amd64/include
x86 -> /usr/src/sys/x86/include
awk -f @/tools/makeobjops.awk @/kern/device_if.m -h
awk -f @/tools/makeobjops.awk @/kern/bus_if.m -h
  INSTALL-HOSTAPP dpdk-pmdinfogen
cc -Winline -Wall -Werror -include /tmp/FreeBSD_K10.3_GCC4.8.5/x86_64-native-bsdapp-clang/ebcd50f3fba84414a30f159de6c31848/dpdk/x86_64-native-bsdapp-clang/include/rte_config.h  -Werror -D_KERNEL -DKLD_MODULE -nostdinc  -I/tmp/FreeBSD_K10.3_GCC4.8.5/x86_64-native-bsdapp-clang/ebcd50f3fba84414a30f159de6c31848/dpdk/kernel/freebsd/contigmem -I/tmp/FreeBSD_K10.3_GCC4.8.5/x86_64-native-bsdapp-clang/ebcd50f3fba84414a30f159de6c31848/dpdk/x86_64-native-bsdapp-clang/include -I. -I@ -I@/contrib/altq -fno-common  -fno-omit-frame-pointer -mno-omit-leaf-frame-pointer  -mno-aes -mno-avx -mcmodel=kernel -mno-red-zone -mno-mmx -mno-sse -msoft-float  -fno-asynchronous-unwind-tables -ffreestanding -fstack-protector -std=iso9899:1999 -Qunused-arguments  -fstack-protector -Wall -Wredundant-decls -Wnested-externs -Wstrict-prototypes  -Wmissing-prototypes -Wpointer-arith -Winline -Wcast-qual  -Wundef -Wno-pointer-sign -fformat-extensions  -Wmissing-include-dirs -fdiagnostics-show-option  -Wno-error-tautological-compare -Wno-error-empty-body  -Wno-error-parentheses-equality -Wno-error-unused-function    -c contigmem.c -o contigmem.o
== Build drivers
== Build drivers/common
ld      -L/tmp/FreeBSD_K10.3_GCC4.8.5/x86_64-native-bsdapp-clang/ebcd50f3fba84414a30f159de6c31848/dpdk/x86_64-native-bsdapp-clang/lib -d -warn-common -r -d -o contigmem.ko contigmem.o
:> export_syms
awk -f /sys/conf/kmod_syms.awk contigmem.ko  export_syms | xargs -J% objcopy % contigmem.ko
--
machine -> /usr/src/sys/amd64/include
x86 -> /usr/src/sys/x86/include
awk -f @/tools/makeobjops.awk @/kern/device_if.m -h
awk -f @/tools/makeobjops.awk @/kern/bus_if.m -h
awk -f @/tools/makeobjops.awk @/dev/pci/pci_if.m -h
cc -Winline -Wall -Werror -include /tmp/FreeBSD_K10.3_GCC4.8.5/x86_64-native-bsdapp-clang/ebcd50f3fba84414a30f159de6c31848/dpdk/x86_64-native-bsdapp-clang/include/rte_config.h  -Werror -D_KERNEL -DKLD_MODULE -nostdinc  -I/tmp/FreeBSD_K10.3_GCC4.8.5/x86_64-native-bsdapp-clang/ebcd50f3fba84414a30f159de6c31848/dpdk/kernel/freebsd/nic_uio -I/tmp/FreeBSD_K10.3_GCC4.8.5/x86_64-native-bsdapp-clang/ebcd50f3fba84414a30f159de6c31848/dpdk/x86_64-native-bsdapp-clang/include -I. -I@ -I@/contrib/altq -fno-common  -fno-omit-frame-pointer -mno-omit-leaf-frame-pointer  -mno-aes -mno-avx -mcmodel=kernel -mno-red-zone -mno-mmx -mno-sse -msoft-float  -fno-asynchronous-unwind-tables -ffreestanding -fstack-protector -std=iso9899:1999 -Qunused-arguments  -fstack-protector -Wall -Wredundant-decls -Wnested-externs -Wstrict-prototypes  -Wmissing-prototypes -Wpointer-arith -Winline -Wcast-qual  -Wundef -Wno-pointer-sign -fformat-extensions  -Wmissing-include-dirs -fdiagnostics-show-option  -Wno-error-tautological-compare -Wno-error-empty-body  -Wno-error-parentheses-equality -Wno-error-unused-function    -c nic_uio.c -o nic_uio.o
  AR librte_common_octeontx.a
  INSTALL-LIB librte_common_octeontx.a
== Build drivers/bus
== Build drivers/bus/ifpga
ld      -L/tmp/FreeBSD_K10.3_GCC4.8.5/x86_64-native-bsdapp-clang/ebcd50f3fba84414a30f159de6c31848/dpdk/x86_64-native-bsdapp-clang/lib -d -warn-common -r -d -o nic_uio.ko nic_uio.o
--
== Build drivers/crypto/aesni_gcm
  CC aesni_gcm_pmd.o
  CC ark_ethdev_tx.o
In file included from /tmp/FreeBSD_K10.3_GCC4.8.5/x86_64-native-bsdapp-clang/ebcd50f3fba84414a30f159de6c31848/dpdk/drivers/crypto/aesni_gcm/aesni_gcm_pmd.c:14:
In file included from /tmp/FreeBSD_K10.3_GCC4.8.5/x86_64-native-bsdapp-clang/ebcd50f3fba84414a30f159de6c31848/dpdk/drivers/crypto/aesni_gcm/aesni_gcm_pmd_private.h:8:
/tmp/FreeBSD_K10.3_GCC4.8.5/x86_64-native-bsdapp-clang/ebcd50f3fba84414a30f159de6c31848/dpdk/drivers/crypto/aesni_gcm/aesni_gcm_ops.h:12:10: fatal error: 'intel-ipsec-mb.h' file not found
#include <intel-ipsec-mb.h>
         ^
1 error generated.
  CC ark_mpu.o
gmake[6]: *** [/tmp/FreeBSD_K10.3_GCC4.8.5/x86_64-native-bsdapp-clang/ebcd50f3fba84414a30f159de6c31848/dpdk/mk/internal/rte.compile-pre.mk:116: aesni_gcm_pmd.o] Error 1
gmake[5]: *** [/tmp/FreeBSD_K10.3_GCC4.8.5/x86_64-native-bsdapp-clang/ebcd50f3fba84414a30f159de6c31848/dpdk/mk/rte.subdir.mk:37: aesni_gcm] Error 2
gmake[4]: *** [/tmp/FreeBSD_K10.3_GCC4.8.5/x86_64-native-bsdapp-clang/ebcd50f3fba84414a30f159de6c31848/dpdk/mk/rte.subdir.mk:37: crypto] Error 2
gmake[4]: *** Waiting for unfinished jobs....

*Failed Build #11:
OS: FC24
Target: x86_64-native-linuxapp-gcc-shared
  CC aesni_gcm_pmd.o
  CC ark_ddm.o
  CC ark_ethdev.o
In file included from /tmp/FC24_K4.9.13_GCC6.2.1/x86_64-native-linuxapp-gcc-shared/ebcd50f3fba84414a30f159de6c31848/dpdk/drivers/crypto/aesni_gcm/aesni_gcm_pmd_private.h:8:0,
                 from /tmp/FC24_K4.9.13_GCC6.2.1/x86_64-native-linuxapp-gcc-shared/ebcd50f3fba84414a30f159de6c31848/dpdk/drivers/crypto/aesni_gcm/aesni_gcm_pmd.c:14:
/tmp/FC24_K4.9.13_GCC6.2.1/x86_64-native-linuxapp-gcc-shared/ebcd50f3fba84414a30f159de6c31848/dpdk/drivers/crypto/aesni_gcm/aesni_gcm_ops.h:12:28: fatal error: intel-ipsec-mb.h: No such file or directory
 #include <intel-ipsec-mb.h>
                            ^
compilation terminated.
/tmp/FC24_K4.9.13_GCC6.2.1/x86_64-native-linuxapp-gcc-shared/ebcd50f3fba84414a30f159de6c31848/dpdk/mk/internal/rte.compile-pre.mk:114: recipe for target 'aesni_gcm_pmd.o' failed
make[6]: *** [aesni_gcm_pmd.o] Error 1
/tmp/FC24_K4.9.13_GCC6.2.1/x86_64-native-linuxapp-gcc-shared/ebcd50f3fba84414a30f159de6c31848/dpdk/mk/rte.subdir.mk:35: recipe for target 'aesni_gcm' failed
make[5]: *** [aesni_gcm] Error 2
/tmp/FC24_K4.9.13_GCC6.2.1/x86_64-native-linuxapp-gcc-shared/ebcd50f3fba84414a30f159de6c31848/dpdk/mk/rte.subdir.mk:35: recipe for target 'crypto' failed
make[4]: *** [crypto] Error 2
make[4]: *** Waiting for unfinished jobs....
  CC ark_ethdev_rx.o
  PMDINFO ark_ethdev.o.pmd.c
  CC ark_ethdev.o.pmd.o
--
  CC rte_eth_softnic_cryptodev.o
  CC parser.o
  CC conn.o
  LD librte_pmd_softnic.so.1.1
  INSTALL-LIB librte_pmd_softnic.so.1.1
/tmp/FC24_K4.9.13_GCC6.2.1/x86_64-native-linuxapp-gcc-shared/ebcd50f3fba84414a30f159de6c31848/dpdk/mk/rte.sdkbuild.mk:49: recipe for target 'drivers' failed
make[3]: *** [drivers] Error 2
/tmp/FC24_K4.9.13_GCC6.2.1/x86_64-native-linuxapp-gcc-shared/ebcd50f3fba84414a30f159de6c31848/dpdk/mk/rte.sdkroot.mk:100: recipe for target 'all' failed
make[2]: *** [all] Error 2
/tmp/FC24_K4.9.13_GCC6.2.1/x86_64-native-linuxapp-gcc-shared/ebcd50f3fba84414a30f159de6c31848/dpdk/mk/rte.sdkinstall.mk:57: recipe for target 'pre_install' failed
make[1]: *** [pre_install] Error 2
/tmp/FC24_K4.9.13_GCC6.2.1/x86_64-native-linuxapp-gcc-shared/ebcd50f3fba84414a30f159de6c31848/dpdk/mk/rte.sdkroot.mk:79: recipe for target 'install' failed
make: *** [install] Error 2

*Failed Build #12:
OS: FC25
Target: x86_64-native-linuxapp-gcc-debug
  CC aesni_gcm_pmd.o
  CC ark_ddm.o
  CC ark_ethdev.o
In file included from /tmp/FC25_K4.8.6_GCC6.3.1/x86_64-native-linuxapp-gcc-debug/ebcd50f3fba84414a30f159de6c31848/dpdk/drivers/crypto/aesni_gcm/aesni_gcm_pmd_private.h:8:0,
                 from /tmp/FC25_K4.8.6_GCC6.3.1/x86_64-native-linuxapp-gcc-debug/ebcd50f3fba84414a30f159de6c31848/dpdk/drivers/crypto/aesni_gcm/aesni_gcm_pmd.c:14:
/tmp/FC25_K4.8.6_GCC6.3.1/x86_64-native-linuxapp-gcc-debug/ebcd50f3fba84414a30f159de6c31848/dpdk/drivers/crypto/aesni_gcm/aesni_gcm_ops.h:12:28: fatal error: intel-ipsec-mb.h: No such file or directory
 #include <intel-ipsec-mb.h>
                            ^
compilation terminated.
  PMDINFO ark_ethdev.o.pmd.c
  CC ark_ethdev.o.pmd.o
  LD ark_ethdev.o
  CC ark_ethdev_rx.o
/tmp/FC25_K4.8.6_GCC6.3.1/x86_64-native-linuxapp-gcc-debug/ebcd50f3fba84414a30f159de6c31848/dpdk/mk/internal/rte.compile-pre.mk:114: recipe for target 'aesni_gcm_pmd.o' failed
make[6]: *** [aesni_gcm_pmd.o] Error 1
/tmp/FC25_K4.8.6_GCC6.3.1/x86_64-native-linuxapp-gcc-debug/ebcd50f3fba84414a30f159de6c31848/dpdk/mk/rte.subdir.mk:35: recipe for target 'aesni_gcm' failed
make[5]: *** [aesni_gcm] Error 2
/tmp/FC25_K4.8.6_GCC6.3.1/x86_64-native-linuxapp-gcc-debug/ebcd50f3fba84414a30f159de6c31848/dpdk/mk/rte.subdir.mk:35: recipe for target 'crypto' failed
make[4]: *** [crypto] Error 2
make[4]: *** Waiting for unfinished jobs....
  CC ark_ethdev_tx.o
== Build drivers/net/atlantic
  CC ark_mpu.o
--
  CC rte_eth_softnic_cryptodev.o
  CC parser.o
  CC conn.o
  AR librte_pmd_softnic.a
  INSTALL-LIB librte_pmd_softnic.a
/tmp/FC25_K4.8.6_GCC6.3.1/x86_64-native-linuxapp-gcc-debug/ebcd50f3fba84414a30f159de6c31848/dpdk/mk/rte.sdkbuild.mk:49: recipe for target 'drivers' failed
make[3]: *** [drivers] Error 2
/tmp/FC25_K4.8.6_GCC6.3.1/x86_64-native-linuxapp-gcc-debug/ebcd50f3fba84414a30f159de6c31848/dpdk/mk/rte.sdkroot.mk:100: recipe for target 'all' failed
make[2]: *** [all] Error 2
/tmp/FC25_K4.8.6_GCC6.3.1/x86_64-native-linuxapp-gcc-debug/ebcd50f3fba84414a30f159de6c31848/dpdk/mk/rte.sdkinstall.mk:57: recipe for target 'pre_install' failed
make[1]: *** [pre_install] Error 2
/tmp/FC25_K4.8.6_GCC6.3.1/x86_64-native-linuxapp-gcc-debug/ebcd50f3fba84414a30f159de6c31848/dpdk/mk/rte.sdkroot.mk:79: recipe for target 'install' failed
make: *** [install] Error 2

*Failed Build #13:
OS: FC24
Target: i686-native-linuxapp-gcc
  INSTALL-LIB librte_pmd_af_packet.a
== Build drivers/net/ark
  CC rte_openssl_pmd.o
  CC ark_ddm.o
  CC ark_ethdev.o
/tmp/FC24_K4.5.5_GCC6.1.1/i686-native-linuxapp-gcc/ebcd50f3fba84414a30f159de6c31848/dpdk/drivers/crypto/openssl/rte_openssl_pmd.c:13:26: fatal error: openssl/hmac.h: No such file or directory
 #include <openssl/hmac.h>
                          ^
compilation terminated.
/tmp/FC24_K4.5.5_GCC6.1.1/i686-native-linuxapp-gcc/ebcd50f3fba84414a30f159de6c31848/dpdk/mk/internal/rte.compile-pre.mk:114: recipe for target 'rte_openssl_pmd.o' failed
make[6]: *** [rte_openssl_pmd.o] Error 1
/tmp/FC24_K4.5.5_GCC6.1.1/i686-native-linuxapp-gcc/ebcd50f3fba84414a30f159de6c31848/dpdk/mk/rte.subdir.mk:35: recipe for target 'openssl' failed
make[5]: *** [openssl] Error 2
/tmp/FC24_K4.5.5_GCC6.1.1/i686-native-linuxapp-gcc/ebcd50f3fba84414a30f159de6c31848/dpdk/mk/rte.subdir.mk:35: recipe for target 'crypto' failed
make[4]: *** [crypto] Error 2
make[4]: *** Waiting for unfinished jobs....
== Build drivers/net/atlantic
  CC atl_rxtx.o
  PMDINFO ark_ethdev.o.pmd.c
--
  PMDINFO ifcvf_vdpa.o.pmd.c
  CC ifcvf_vdpa.o.pmd.o
  LD ifcvf_vdpa.o
  AR librte_pmd_ifc.a
  INSTALL-LIB librte_pmd_ifc.a
/tmp/FC24_K4.5.5_GCC6.1.1/i686-native-linuxapp-gcc/ebcd50f3fba84414a30f159de6c31848/dpdk/mk/rte.sdkbuild.mk:49: recipe for target 'drivers' failed
make[3]: *** [drivers] Error 2
/tmp/FC24_K4.5.5_GCC6.1.1/i686-native-linuxapp-gcc/ebcd50f3fba84414a30f159de6c31848/dpdk/mk/rte.sdkroot.mk:100: recipe for target 'all' failed
make[2]: *** [all] Error 2
/tmp/FC24_K4.5.5_GCC6.1.1/i686-native-linuxapp-gcc/ebcd50f3fba84414a30f159de6c31848/dpdk/mk/rte.sdkinstall.mk:57: recipe for target 'pre_install' failed
make[1]: *** [pre_install] Error 2
/tmp/FC24_K4.5.5_GCC6.1.1/i686-native-linuxapp-gcc/ebcd50f3fba84414a30f159de6c31848/dpdk/mk/rte.sdkroot.mk:79: recipe for target 'install' failed
make: *** [install] Error 2

*Failed Build #14:
OS: FC24
Target: x86_64-native-linuxapp-clang
  CC ark_ddm.o
  CC ark_ethdev.o
  CC aesni_gcm_pmd.o
In file included from /tmp/FC24_K4.9.13_GCC6.2.1/x86_64-native-linuxapp-clang/ebcd50f3fba84414a30f159de6c31848/dpdk/drivers/crypto/aesni_gcm/aesni_gcm_pmd.c:14:
In file included from /tmp/FC24_K4.9.13_GCC6.2.1/x86_64-native-linuxapp-clang/ebcd50f3fba84414a30f159de6c31848/dpdk/drivers/crypto/aesni_gcm/aesni_gcm_pmd_private.h:8:
/tmp/FC24_K4.9.13_GCC6.2.1/x86_64-native-linuxapp-clang/ebcd50f3fba84414a30f159de6c31848/dpdk/drivers/crypto/aesni_gcm/aesni_gcm_ops.h:12:10: fatal error: 'intel-ipsec-mb.h' file not found
#include <intel-ipsec-mb.h>
         ^
1 error generated.
/tmp/FC24_K4.9.13_GCC6.2.1/x86_64-native-linuxapp-clang/ebcd50f3fba84414a30f159de6c31848/dpdk/mk/internal/rte.compile-pre.mk:114: recipe for target 'aesni_gcm_pmd.o' failed
make[6]: *** [aesni_gcm_pmd.o] Error 1
/tmp/FC24_K4.9.13_GCC6.2.1/x86_64-native-linuxapp-clang/ebcd50f3fba84414a30f159de6c31848/dpdk/mk/rte.subdir.mk:35: recipe for target 'aesni_gcm' failed
make[5]: *** [aesni_gcm] Error 2
/tmp/FC24_K4.9.13_GCC6.2.1/x86_64-native-linuxapp-clang/ebcd50f3fba84414a30f159de6c31848/dpdk/mk/rte.subdir.mk:35: recipe for target 'crypto' failed
make[4]: *** [crypto] Error 2
make[4]: *** Waiting for unfinished jobs....
  CC ark_ethdev_rx.o
  PMDINFO ark_ethdev.o.pmd.c
  CC ark_ethdev.o.pmd.o
--
  CC rte_eth_softnic_cryptodev.o
  CC parser.o
  CC conn.o
  AR librte_pmd_softnic.a
  INSTALL-LIB librte_pmd_softnic.a
/tmp/FC24_K4.9.13_GCC6.2.1/x86_64-native-linuxapp-clang/ebcd50f3fba84414a30f159de6c31848/dpdk/mk/rte.sdkbuild.mk:49: recipe for target 'drivers' failed
make[3]: *** [drivers] Error 2
/tmp/FC24_K4.9.13_GCC6.2.1/x86_64-native-linuxapp-clang/ebcd50f3fba84414a30f159de6c31848/dpdk/mk/rte.sdkroot.mk:100: recipe for target 'all' failed
make[2]: *** [all] Error 2
/tmp/FC24_K4.9.13_GCC6.2.1/x86_64-native-linuxapp-clang/ebcd50f3fba84414a30f159de6c31848/dpdk/mk/rte.sdkinstall.mk:57: recipe for target 'pre_install' failed
make[1]: *** [pre_install] Error 2
/tmp/FC24_K4.9.13_GCC6.2.1/x86_64-native-linuxapp-clang/ebcd50f3fba84414a30f159de6c31848/dpdk/mk/rte.sdkroot.mk:79: recipe for target 'install' failed
make: *** [install] Error 2

*Failed Build #15:
OS: FreeBSD
Target: x86_64-native-bsdapp-gcc
@ -> /usr/src/sys
machine -> /usr/src/sys/amd64/include
x86 -> /usr/src/sys/x86/include
awk -f @/tools/makeobjops.awk @/kern/device_if.m -h
awk -f @/tools/makeobjops.awk @/kern/bus_if.m -h
cc -Winline -Wall -Werror -include /tmp/FreeBSD_K10.3_GCC4.8.5/x86_64-native-bsdapp-gcc/ebcd50f3fba84414a30f159de6c31848/dpdk/x86_64-native-bsdapp-gcc/include/rte_config.h  -Werror -D_KERNEL -DKLD_MODULE -nostdinc  -I/tmp/FreeBSD_K10.3_GCC4.8.5/x86_64-native-bsdapp-gcc/ebcd50f3fba84414a30f159de6c31848/dpdk/kernel/freebsd/contigmem -I/tmp/FreeBSD_K10.3_GCC4.8.5/x86_64-native-bsdapp-gcc/ebcd50f3fba84414a30f159de6c31848/dpdk/x86_64-native-bsdapp-gcc/include -I. -I@ -I@/contrib/altq -fno-common  -fno-omit-frame-pointer -mno-omit-leaf-frame-pointer  -mno-aes -mno-avx -mcmodel=kernel -mno-red-zone -mno-mmx -mno-sse -msoft-float  -fno-asynchronous-unwind-tables -ffreestanding -fstack-protector -std=iso9899:1999 -Qunused-arguments  -fstack-protector -Wall -Wredundant-decls -Wnested-externs -Wstrict-prototypes  -Wmissing-prototypes -Wpointer-arith -Winline -Wcast-qual  -Wundef -Wno-pointer-sign -fformat-extensions  -Wmissing-include-dirs -fdiagnostics-show-option  -Wno-error-tautological-compare -Wno-error-empty-body  -Wno-error-parentheses-equality -Wno-error-unused-function    -c contigmem.c -o contigmem.o
ld      -L/tmp/FreeBSD_K10.3_GCC4.8.5/x86_64-native-bsdapp-gcc/ebcd50f3fba84414a30f159de6c31848/dpdk/x86_64-native-bsdapp-gcc/lib -d -warn-common -r -d -o contigmem.ko contigmem.o
:> export_syms
awk -f /sys/conf/kmod_syms.awk contigmem.ko  export_syms | xargs -J% objcopy % contigmem.ko
objcopy --strip-debug contigmem.ko
INSTALL-MODULE contigmem.ko
--
machine -> /usr/src/sys/amd64/include
x86 -> /usr/src/sys/x86/include
awk -f @/tools/makeobjops.awk @/kern/device_if.m -h
awk -f @/tools/makeobjops.awk @/kern/bus_if.m -h
awk -f @/tools/makeobjops.awk @/dev/pci/pci_if.m -h
cc -Winline -Wall -Werror -include /tmp/FreeBSD_K10.3_GCC4.8.5/x86_64-native-bsdapp-gcc/ebcd50f3fba84414a30f159de6c31848/dpdk/x86_64-native-bsdapp-gcc/include/rte_config.h  -Werror -D_KERNEL -DKLD_MODULE -nostdinc  -I/tmp/FreeBSD_K10.3_GCC4.8.5/x86_64-native-bsdapp-gcc/ebcd50f3fba84414a30f159de6c31848/dpdk/kernel/freebsd/nic_uio -I/tmp/FreeBSD_K10.3_GCC4.8.5/x86_64-native-bsdapp-gcc/ebcd50f3fba84414a30f159de6c31848/dpdk/x86_64-native-bsdapp-gcc/include -I. -I@ -I@/contrib/altq -fno-common  -fno-omit-frame-pointer -mno-omit-leaf-frame-pointer  -mno-aes -mno-avx -mcmodel=kernel -mno-red-zone -mno-mmx -mno-sse -msoft-float  -fno-asynchronous-unwind-tables -ffreestanding -fstack-protector -std=iso9899:1999 -Qunused-arguments  -fstack-protector -Wall -Wredundant-decls -Wnested-externs -Wstrict-prototypes  -Wmissing-prototypes -Wpointer-arith -Winline -Wcast-qual  -Wundef -Wno-pointer-sign -fformat-extensions  -Wmissing-include-dirs -fdiagnostics-show-option  -Wno-error-tautological-compare -Wno-error-empty-body  -Wno-error-parentheses-equality -Wno-error-unused-function    -c nic_uio.c -o nic_uio.o
ld      -L/tmp/FreeBSD_K10.3_GCC4.8.5/x86_64-native-bsdapp-gcc/ebcd50f3fba84414a30f159de6c31848/dpdk/x86_64-native-bsdapp-gcc/lib -d -warn-common -r -d -o nic_uio.ko nic_uio.o
:> export_syms
awk -f /sys/conf/kmod_syms.awk nic_uio.ko  export_syms | xargs -J% objcopy % nic_uio.ko
objcopy --strip-debug nic_uio.ko
INSTALL-MODULE nic_uio.ko
--
== Build drivers/crypto/aesni_gcm
  CC ark_ethdev_tx.o
  CC aesni_gcm_pmd.o
In file included from /tmp/FreeBSD_K10.3_GCC4.8.5/x86_64-native-bsdapp-gcc/ebcd50f3fba84414a30f159de6c31848/dpdk/drivers/crypto/aesni_gcm/aesni_gcm_pmd_private.h:8:0,
                 from /tmp/FreeBSD_K10.3_GCC4.8.5/x86_64-native-bsdapp-gcc/ebcd50f3fba84414a30f159de6c31848/dpdk/drivers/crypto/aesni_gcm/aesni_gcm_pmd.c:14:
/tmp/FreeBSD_K10.3_GCC4.8.5/x86_64-native-bsdapp-gcc/ebcd50f3fba84414a30f159de6c31848/dpdk/drivers/crypto/aesni_gcm/aesni_gcm_ops.h:12:10: fatal error: intel-ipsec-mb.h: No such file or directory
 #include <intel-ipsec-mb.h>
          ^~~~~~~~~~~~~~~~~~
compilation terminated.
gmake[6]: *** [/tmp/FreeBSD_K10.3_GCC4.8.5/x86_64-native-bsdapp-gcc/ebcd50f3fba84414a30f159de6c31848/dpdk/mk/internal/rte.compile-pre.mk:116: aesni_gcm_pmd.o] Error 1
gmake[5]: *** [/tmp/FreeBSD_K10.3_GCC4.8.5/x86_64-native-bsdapp-gcc/ebcd50f3fba84414a30f159de6c31848/dpdk/mk/rte.subdir.mk:37: aesni_gcm] Error 2

DPDK STV team


More information about the test-report mailing list