[dpdk-test-report] |FAILURE| pw48286[02/19] net/ice: support device initialization

sys_stv at intel.com sys_stv at intel.com
Fri Nov 23 12:17:44 CET 2018


Test-Label: Intel-compilation
Test-Status: FAILURE
http://dpdk.org/patch/48286

_Compilation issues_

Submitter: Wenzhuo Lu <wenzhuo.lu at intel.com>
Date: 2018-11-23 06:56:02
DPDK git baseline: Repo:dpdk-master, CommitID: 3ee567cfec37386707ee71ef432f63d3fb810fec

Build Summary: 15 Builds Done, 12 Successful, 3 Failures

Test environment and configuration as below:

OS: FC25
	Kernel Version: 4.5.5-300.fc24.x86_64
	CPU info: Intel(R) Xeon(R) CPU E5-2699 v3 @ 2.30GHz
	GCC Version: gcc (GCC) 6.1.1 20160510 (Red Hat 6.1.1-2)
	Clang Version: 3.8.0 (tags/RELEASE_380/final)
	x86_64-native-linuxapp-gcc
	x86_64-native-linuxapp-gcc-debug

OS: FC24
	Kernel Version: 4.9.13-100.fc24.x86_64
	CPU info: Intel(R) Xeon(R) CPU E5-2699 v3 @ 2.30GHz
	GCC Version: gcc (GCC) 6.3.1 20161221 (Red Hat 6.3.1-1)
	Clang Version: 3.8.1 (tags/RELEASE_381/final)
	x86_64-native-linuxapp-gcc-shared
	i686-native-linuxapp-gcc
	x86_64-native-linuxapp-clang

OS: CENTOS
	Kernel Version: 3.10.0-514.10.2.el7.x86_64
	CPU info: Intel(R) Xeon(R) CPU E5-2699 v3 @ 2.30GHz
	GCC Version: gcc (GCC) 4.8.5 20150623 (Red Hat 4.8.5-4)
	Clang Version: 3.4.2 (tags/RELEASE_34/dot2-final)
	x86_64-native-linuxapp-gcc-shared
	i686-native-linuxapp-gcc
	x86_64-native-linuxapp-gcc
	x86_64-native-linuxapp-clang

OS: UB1604
	Kernel Version: 4.4.0-78-generic
	CPU info: Intel(R) Xeon(R) CPU E5-2699 v3 @ 2.30GHz
	GCC Version: gcc (Ubuntu 5.4.0-6ubuntu1~16.04.10) 5.4.0 20160609
	Clang Version: 3.8.0-2ubuntu4 (tags/RELEASE_380/final)
	x86_64-native-linuxapp-gcc
	x86_64-native-linuxapp-gcc-shared
	x86_64-native-linuxapp-clang
	i686-native-linuxapp-gcc

OS: FreeBSD
	Kernel Version: 10.3-RELEASE
	CPU info: Intel(R) Xeon(R) CPU E5-2699 v3 @ 2.30GHz (2294.75-MHz K8-class CPU)
	GCC Version: gcc (FreeBSD Ports Collection) 7.3.0
	Clang Version: 3.4.1 (tags/RELEASE_34/dot1-final 208032) 20140512
	x86_64-native-bsdapp-clang
	x86_64-native-bsdapp-gcc

*Failed Build #1:
OS: UB1604
Target: x86_64-native-linuxapp-gcc-shared
ice_lan_rxtx.c:(.text.unlikely+0x49): undefined reference to `rte_log'
ice_lan_rxtx.c:(.text.unlikely+0x7f): undefined reference to `rte_log'
ice_lan_rxtx.c:(.text.unlikely+0xaa): undefined reference to `rte_log'
ice_lan_rxtx.c:(.text.unlikely+0xcc): undefined reference to `rte_log'
ice_lan_rxtx.o:ice_lan_rxtx.c:(.text.unlikely+0x112): more undefined references to `rte_log' follow
collect2: error: ld returned 1 exit status
/tmp/UB1604_K4.4.0_GCC5.4.0/x86_64-native-linuxapp-gcc-shared/2cf1edb29c7f45e5bea37634b3fe09c8/dpdk/mk/rte.lib.mk:98: recipe for target 'librte_pmd_ice.so.1.1' failed
make[6]: *** [librte_pmd_ice.so.1.1] Error 1
/tmp/UB1604_K4.4.0_GCC5.4.0/x86_64-native-linuxapp-gcc-shared/2cf1edb29c7f45e5bea37634b3fe09c8/dpdk/mk/rte.subdir.mk:35: recipe for target 'ice' failed
make[5]: *** [ice] Error 2
make[5]: *** Waiting for unfinished jobs....
  CC i40e_rxtx_vec_sse.o
  CC i40e_ethdev_vf.o
  CC i40e_pf.o
--
  CC i40e_tm.o
  CC i40e_vf_representor.o
  CC i40e_rxtx_vec_avx2.o
  LD librte_pmd_i40e.so.2.1
  INSTALL-LIB librte_pmd_i40e.so.2.1
/tmp/UB1604_K4.4.0_GCC5.4.0/x86_64-native-linuxapp-gcc-shared/2cf1edb29c7f45e5bea37634b3fe09c8/dpdk/mk/rte.subdir.mk:35: recipe for target 'net' failed
make[4]: *** [net] Error 2
/tmp/UB1604_K4.4.0_GCC5.4.0/x86_64-native-linuxapp-gcc-shared/2cf1edb29c7f45e5bea37634b3fe09c8/dpdk/mk/rte.sdkbuild.mk:49: recipe for target 'drivers' failed
make[3]: *** [drivers] Error 2
/tmp/UB1604_K4.4.0_GCC5.4.0/x86_64-native-linuxapp-gcc-shared/2cf1edb29c7f45e5bea37634b3fe09c8/dpdk/mk/rte.sdkroot.mk:100: recipe for target 'all' failed
make[2]: *** [all] Error 2
/tmp/UB1604_K4.4.0_GCC5.4.0/x86_64-native-linuxapp-gcc-shared/2cf1edb29c7f45e5bea37634b3fe09c8/dpdk/mk/rte.sdkinstall.mk:57: recipe for target 'pre_install' failed
make[1]: *** [pre_install] Error 2
/tmp/UB1604_K4.4.0_GCC5.4.0/x86_64-native-linuxapp-gcc-shared/2cf1edb29c7f45e5bea37634b3fe09c8/dpdk/mk/rte.sdkroot.mk:79: recipe for target 'install' failed
make: *** [install] Error 2

*Failed Build #2:
OS: CENTOS
Target: x86_64-native-linuxapp-gcc-shared
ice_nvm.c:(.text+0x186): undefined reference to `rte_log'
ice_nvm.c:(.text+0x1c3): undefined reference to `rte_log'
ice_nvm.c:(.text+0x1fc): undefined reference to `rte_log'
ice_nvm.c:(.text+0x238): undefined reference to `rte_log'
ice_nvm.o:ice_nvm.c:(.text+0x274): more undefined references to `rte_log' follow
collect2: error: ld returned 1 exit status
make[6]: *** [librte_pmd_ice.so.1.1] Error 1
make[5]: *** [ice] Error 2
make[5]: *** Waiting for unfinished jobs....
  CC i40e_tm.o
  CC i40e_vf_representor.o

*Failed Build #3:
OS: FC24
Target: x86_64-native-linuxapp-gcc-shared
ice_nvm.c:(.text+0x186): undefined reference to `rte_log'
ice_nvm.c:(.text+0x1c0): undefined reference to `rte_log'
ice_nvm.c:(.text+0x20e): undefined reference to `rte_log'
ice_nvm.c:(.text+0x246): undefined reference to `rte_log'
ice_nvm.o:ice_nvm.c:(.text+0x284): more undefined references to `rte_log' follow
collect2: error: ld returned 1 exit status
/tmp/FC24_K4.9.13_GCC6.2.1/x86_64-native-linuxapp-gcc-shared/2cf1edb29c7f45e5bea37634b3fe09c8/dpdk/mk/rte.lib.mk:98: recipe for target 'librte_pmd_ice.so.1.1' failed
make[6]: *** [librte_pmd_ice.so.1.1] Error 1
/tmp/FC24_K4.9.13_GCC6.2.1/x86_64-native-linuxapp-gcc-shared/2cf1edb29c7f45e5bea37634b3fe09c8/dpdk/mk/rte.subdir.mk:35: recipe for target 'ice' failed
make[5]: *** [ice] Error 2
make[5]: *** Waiting for unfinished jobs....
  CC i40e_pf.o
  PMDINFO i40e_ethdev_vf.o.pmd.c
  CC i40e_ethdev_vf.o.pmd.o
--
  CC i40e_tm.o
  CC i40e_vf_representor.o
  CC i40e_rxtx_vec_avx2.o
  LD librte_pmd_i40e.so.2.1
  INSTALL-LIB librte_pmd_i40e.so.2.1
/tmp/FC24_K4.9.13_GCC6.2.1/x86_64-native-linuxapp-gcc-shared/2cf1edb29c7f45e5bea37634b3fe09c8/dpdk/mk/rte.subdir.mk:35: recipe for target 'net' failed
make[4]: *** [net] Error 2
/tmp/FC24_K4.9.13_GCC6.2.1/x86_64-native-linuxapp-gcc-shared/2cf1edb29c7f45e5bea37634b3fe09c8/dpdk/mk/rte.sdkbuild.mk:49: recipe for target 'drivers' failed
make[3]: *** [drivers] Error 2
/tmp/FC24_K4.9.13_GCC6.2.1/x86_64-native-linuxapp-gcc-shared/2cf1edb29c7f45e5bea37634b3fe09c8/dpdk/mk/rte.sdkroot.mk:100: recipe for target 'all' failed
make[2]: *** [all] Error 2
/tmp/FC24_K4.9.13_GCC6.2.1/x86_64-native-linuxapp-gcc-shared/2cf1edb29c7f45e5bea37634b3fe09c8/dpdk/mk/rte.sdkinstall.mk:57: recipe for target 'pre_install' failed
make[1]: *** [pre_install] Error 2
/tmp/FC24_K4.9.13_GCC6.2.1/x86_64-native-linuxapp-gcc-shared/2cf1edb29c7f45e5bea37634b3fe09c8/dpdk/mk/rte.sdkroot.mk:79: recipe for target 'install' failed
make: *** [install] Error 2

DPDK STV team


More information about the test-report mailing list