[dpdk-test-report] |FAILURE| pw48426[1/3] timer: allow timer management in shared memory

sys_stv at intel.com sys_stv at intel.com
Fri Nov 30 00:42:54 CET 2018


Test-Label: Intel-compilation
Test-Status: FAILURE
http://dpdk.org/patch/48426

_Compilation issues_

Submitter: Erik Gabriel Carrillo <erik.g.carrillo at intel.com>
Date: 2018-11-29 23:35:12
DPDK git baseline: Repo:dpdk-master, CommitID: 0da7f445df445630c794897347ee360d6fe6348b

Build Summary: 15 Builds Done, 0 Successful, 15 Failures

Test environment and configuration as below:

OS: FC25
	Kernel Version: 4.5.5-300.fc24.x86_64
	CPU info: Intel(R) Xeon(R) CPU E5-2699 v3 @ 2.30GHz
	GCC Version: gcc (GCC) 6.1.1 20160510 (Red Hat 6.1.1-2)
	Clang Version: 3.8.0 (tags/RELEASE_380/final)
	x86_64-native-linuxapp-gcc
	x86_64-native-linuxapp-gcc-debug

OS: FC24
	Kernel Version: 4.11.12-100.fc24.x86_64
	CPU info: Intel(R) Xeon(R) CPU E5-2699 v3 @ 2.30GHz
	GCC Version: gcc (GCC) 6.3.1 20161221 (Red Hat 6.3.1-1)
	Clang Version: 3.8.1 (tags/RELEASE_381/final)
	i686-native-linuxapp-gcc
	x86_64-native-linuxapp-clang
	x86_64-native-linuxapp-gcc-shared

OS: CENTOS
	Kernel Version: 3.10.0-514.10.2.el7.x86_64
	CPU info: Intel(R) Xeon(R) CPU E5-2699 v3 @ 2.30GHz
	GCC Version: gcc (GCC) 4.8.5 20150623 (Red Hat 4.8.5-4)
	Clang Version: 3.4.2 (tags/RELEASE_34/dot2-final)
	x86_64-native-linuxapp-clang
	i686-native-linuxapp-gcc
	x86_64-native-linuxapp-gcc-shared
	x86_64-native-linuxapp-gcc

OS: UB1604
	Kernel Version: 4.4.0-47-generic
	CPU info: Intel(R) Xeon(R) CPU E5-2699 v3 @ 2.30GHz
	GCC Version: gcc (Ubuntu 5.4.0-6ubuntu1~16.04.10) 5.4.0 20160609
	Clang Version: 3.8.0-2ubuntu4 (tags/RELEASE_380/final)
	x86_64-native-linuxapp-gcc
	i686-native-linuxapp-gcc
	x86_64-native-linuxapp-gcc-shared
	x86_64-native-linuxapp-clang

OS: FreeBSD
	Kernel Version: 10.3-RELEASE
	CPU info: Intel(R) Xeon(R) CPU E5-2699 v3 @ 2.30GHz (2294.75-MHz K8-class CPU)
	GCC Version: gcc (FreeBSD Ports Collection) 7.3.0
	Clang Version: 3.4.1 (tags/RELEASE_34/dot1-final 208032) 20140512
	x86_64-native-bsdapp-clang
	x86_64-native-bsdapp-gcc

*Failed Build #1:
OS: FC25
Target: x86_64-native-linuxapp-gcc
  CC iotlb.o
  CC socket.o
  CC vhost.o
  CC rte_event_timer_adapter.o
/tmp/FC25_K4.8.6_GCC6.3.1/x86_64-native-linuxapp-gcc/440c8c7090f740d2ad889733b7fdae92/dpdk/lib/librte_eventdev/rte_event_timer_adapter.c: In function ‘swtim_callback’:
/tmp/FC25_K4.8.6_GCC6.3.1/x86_64-native-linuxapp-gcc/440c8c7090f740d2ad889733b7fdae92/dpdk/lib/librte_eventdev/rte_event_timer_adapter.c:573:3: warning: implicit declaration of function ‘rte_timer_alt_reset’ [-Wimplicit-function-declaration]
   rte_timer_alt_reset(sw->timer_data_id, tim, 0, SINGLE,
   ^~~~~~~~~~~~~~~~~~~
/tmp/FC25_K4.8.6_GCC6.3.1/x86_64-native-linuxapp-gcc/440c8c7090f740d2ad889733b7fdae92/dpdk/lib/librte_eventdev/rte_event_timer_adapter.c:573:3: warning: nested extern declaration of ‘rte_timer_alt_reset’ [-Wnested-externs]
/tmp/FC25_K4.8.6_GCC6.3.1/x86_64-native-linuxapp-gcc/440c8c7090f740d2ad889733b7fdae92/dpdk/lib/librte_eventdev/rte_event_timer_adapter.c: In function ‘swtim_service_func’:
/tmp/FC25_K4.8.6_GCC6.3.1/x86_64-native-linuxapp-gcc/440c8c7090f740d2ad889733b7fdae92/dpdk/lib/librte_eventdev/rte_event_timer_adapter.c:690:3: warning: implicit declaration of function ‘rte_timer_alt_manage’ [-Wimplicit-function-declaration]
   rte_timer_alt_manage(sw->timer_data_id,
   ^~~~~~~~~~~~~~~~~~~~
/tmp/FC25_K4.8.6_GCC6.3.1/x86_64-native-linuxapp-gcc/440c8c7090f740d2ad889733b7fdae92/dpdk/lib/librte_eventdev/rte_event_timer_adapter.c:690:3: warning: nested extern declaration of ‘rte_timer_alt_manage’ [-Wnested-externs]
/tmp/FC25_K4.8.6_GCC6.3.1/x86_64-native-linuxapp-gcc/440c8c7090f740d2ad889733b7fdae92/dpdk/lib/librte_eventdev/rte_event_timer_adapter.c: In function ‘swtim_init’:
/tmp/FC25_K4.8.6_GCC6.3.1/x86_64-native-linuxapp-gcc/440c8c7090f740d2ad889733b7fdae92/dpdk/lib/librte_eventdev/rte_event_timer_adapter.c:793:6: error: void value not ignored as it ought to be
  ret = rte_timer_subsystem_init();
      ^
/tmp/FC25_K4.8.6_GCC6.3.1/x86_64-native-linuxapp-gcc/440c8c7090f740d2ad889733b7fdae92/dpdk/lib/librte_eventdev/rte_event_timer_adapter.c:802:8: warning: implicit declaration of function ‘rte_timer_data_alloc’ [-Wimplicit-function-declaration]
  ret = rte_timer_data_alloc(&sw->timer_data_id);
        ^~~~~~~~~~~~~~~~~~~~
/tmp/FC25_K4.8.6_GCC6.3.1/x86_64-native-linuxapp-gcc/440c8c7090f740d2ad889733b7fdae92/dpdk/lib/librte_eventdev/rte_event_timer_adapter.c:802:2: warning: nested extern declaration of ‘rte_timer_data_alloc’ [-Wnested-externs]
  ret = rte_timer_data_alloc(&sw->timer_data_id);
  ^~~
/tmp/FC25_K4.8.6_GCC6.3.1/x86_64-native-linuxapp-gcc/440c8c7090f740d2ad889733b7fdae92/dpdk/lib/librte_eventdev/rte_event_timer_adapter.c: In function ‘swtim_uninit’:
/tmp/FC25_K4.8.6_GCC6.3.1/x86_64-native-linuxapp-gcc/440c8c7090f740d2ad889733b7fdae92/dpdk/lib/librte_eventdev/rte_event_timer_adapter.c:864:2: warning: implicit declaration of function ‘rte_timer_stop_all’ [-Wimplicit-function-declaration]
  rte_timer_stop_all(sw->timer_data_id,
  ^~~~~~~~~~~~~~~~~~
/tmp/FC25_K4.8.6_GCC6.3.1/x86_64-native-linuxapp-gcc/440c8c7090f740d2ad889733b7fdae92/dpdk/lib/librte_eventdev/rte_event_timer_adapter.c:864:2: warning: nested extern declaration of ‘rte_timer_stop_all’ [-Wnested-externs]
/tmp/FC25_K4.8.6_GCC6.3.1/x86_64-native-linuxapp-gcc/440c8c7090f740d2ad889733b7fdae92/dpdk/lib/librte_eventdev/rte_event_timer_adapter.c: In function ‘swtim_cancel_burst’:
/tmp/FC25_K4.8.6_GCC6.3.1/x86_64-native-linuxapp-gcc/440c8c7090f740d2ad889733b7fdae92/dpdk/lib/librte_eventdev/rte_event_timer_adapter.c:1102:9: warning: implicit declaration of function ‘rte_timer_alt_stop’ [-Wimplicit-function-declaration]
   ret = rte_timer_alt_stop(sw->timer_data_id, timp);
         ^~~~~~~~~~~~~~~~~~
/tmp/FC25_K4.8.6_GCC6.3.1/x86_64-native-linuxapp-gcc/440c8c7090f740d2ad889733b7fdae92/dpdk/lib/librte_eventdev/rte_event_timer_adapter.c:1102:3: warning: nested extern declaration of ‘rte_timer_alt_stop’ [-Wnested-externs]
   ret = rte_timer_alt_stop(sw->timer_data_id, timp);
   ^~~
/tmp/FC25_K4.8.6_GCC6.3.1/x86_64-native-linuxapp-gcc/440c8c7090f740d2ad889733b7fdae92/dpdk/mk/internal/rte.compile-pre.mk:114: recipe for target 'rte_event_timer_adapter.o' failed
make[5]: *** [rte_event_timer_adapter.o] Error 1
/tmp/FC25_K4.8.6_GCC6.3.1/x86_64-native-linuxapp-gcc/440c8c7090f740d2ad889733b7fdae92/dpdk/mk/rte.subdir.mk:35: recipe for target 'librte_eventdev' failed
make[4]: *** [librte_eventdev] Error 2
make[4]: *** Waiting for unfinished jobs....
  CC vhost_user.o
  CC virtio_net.o
  CC vdpa.o
  CC vhost_crypto.o
  AR librte_vhost.a
  INSTALL-LIB librte_vhost.a
/tmp/FC25_K4.8.6_GCC6.3.1/x86_64-native-linuxapp-gcc/440c8c7090f740d2ad889733b7fdae92/dpdk/mk/rte.sdkbuild.mk:49: recipe for target 'lib' failed
make[3]: *** [lib] Error 2
/tmp/FC25_K4.8.6_GCC6.3.1/x86_64-native-linuxapp-gcc/440c8c7090f740d2ad889733b7fdae92/dpdk/mk/rte.sdkroot.mk:100: recipe for target 'all' failed
make[2]: *** [all] Error 2
/tmp/FC25_K4.8.6_GCC6.3.1/x86_64-native-linuxapp-gcc/440c8c7090f740d2ad889733b7fdae92/dpdk/mk/rte.sdkinstall.mk:57: recipe for target 'pre_install' failed
make[1]: *** [pre_install] Error 2
/tmp/FC25_K4.8.6_GCC6.3.1/x86_64-native-linuxapp-gcc/440c8c7090f740d2ad889733b7fdae92/dpdk/mk/rte.sdkroot.mk:79: recipe for target 'install' failed
make: *** [install] Error 2

*Failed Build #2:
OS: UB1604
Target: x86_64-native-linuxapp-gcc
  CC iotlb.o
  CC socket.o
  CC vhost.o
  CC rte_event_timer_adapter.o
/tmp/UB1604_K4.8.0_GCC6.2.0/x86_64-native-linuxapp-gcc/440c8c7090f740d2ad889733b7fdae92/dpdk/lib/librte_eventdev/rte_event_timer_adapter.c: In function ‘swtim_callback’:
/tmp/UB1604_K4.8.0_GCC6.2.0/x86_64-native-linuxapp-gcc/440c8c7090f740d2ad889733b7fdae92/dpdk/lib/librte_eventdev/rte_event_timer_adapter.c:573:3: warning: implicit declaration of function ‘rte_timer_alt_reset’ [-Wimplicit-function-declaration]
   rte_timer_alt_reset(sw->timer_data_id, tim, 0, SINGLE,
   ^~~~~~~~~~~~~~~~~~~
/tmp/UB1604_K4.8.0_GCC6.2.0/x86_64-native-linuxapp-gcc/440c8c7090f740d2ad889733b7fdae92/dpdk/lib/librte_eventdev/rte_event_timer_adapter.c:573:3: warning: nested extern declaration of ‘rte_timer_alt_reset’ [-Wnested-externs]
/tmp/UB1604_K4.8.0_GCC6.2.0/x86_64-native-linuxapp-gcc/440c8c7090f740d2ad889733b7fdae92/dpdk/lib/librte_eventdev/rte_event_timer_adapter.c: In function ‘swtim_service_func’:
/tmp/UB1604_K4.8.0_GCC6.2.0/x86_64-native-linuxapp-gcc/440c8c7090f740d2ad889733b7fdae92/dpdk/lib/librte_eventdev/rte_event_timer_adapter.c:690:3: warning: implicit declaration of function ‘rte_timer_alt_manage’ [-Wimplicit-function-declaration]
   rte_timer_alt_manage(sw->timer_data_id,
   ^~~~~~~~~~~~~~~~~~~~
/tmp/UB1604_K4.8.0_GCC6.2.0/x86_64-native-linuxapp-gcc/440c8c7090f740d2ad889733b7fdae92/dpdk/lib/librte_eventdev/rte_event_timer_adapter.c:690:3: warning: nested extern declaration of ‘rte_timer_alt_manage’ [-Wnested-externs]
/tmp/UB1604_K4.8.0_GCC6.2.0/x86_64-native-linuxapp-gcc/440c8c7090f740d2ad889733b7fdae92/dpdk/lib/librte_eventdev/rte_event_timer_adapter.c: In function ‘swtim_init’:
/tmp/UB1604_K4.8.0_GCC6.2.0/x86_64-native-linuxapp-gcc/440c8c7090f740d2ad889733b7fdae92/dpdk/lib/librte_eventdev/rte_event_timer_adapter.c:793:6: error: void value not ignored as it ought to be
  ret = rte_timer_subsystem_init();
      ^
/tmp/UB1604_K4.8.0_GCC6.2.0/x86_64-native-linuxapp-gcc/440c8c7090f740d2ad889733b7fdae92/dpdk/lib/librte_eventdev/rte_event_timer_adapter.c:802:8: warning: implicit declaration of function ‘rte_timer_data_alloc’ [-Wimplicit-function-declaration]
  ret = rte_timer_data_alloc(&sw->timer_data_id);
        ^~~~~~~~~~~~~~~~~~~~
/tmp/UB1604_K4.8.0_GCC6.2.0/x86_64-native-linuxapp-gcc/440c8c7090f740d2ad889733b7fdae92/dpdk/lib/librte_eventdev/rte_event_timer_adapter.c:802:2: warning: nested extern declaration of ‘rte_timer_data_alloc’ [-Wnested-externs]
  ret = rte_timer_data_alloc(&sw->timer_data_id);
  ^~~
/tmp/UB1604_K4.8.0_GCC6.2.0/x86_64-native-linuxapp-gcc/440c8c7090f740d2ad889733b7fdae92/dpdk/lib/librte_eventdev/rte_event_timer_adapter.c: In function ‘swtim_uninit’:
/tmp/UB1604_K4.8.0_GCC6.2.0/x86_64-native-linuxapp-gcc/440c8c7090f740d2ad889733b7fdae92/dpdk/lib/librte_eventdev/rte_event_timer_adapter.c:864:2: warning: implicit declaration of function ‘rte_timer_stop_all’ [-Wimplicit-function-declaration]
  rte_timer_stop_all(sw->timer_data_id,
  ^~~~~~~~~~~~~~~~~~
/tmp/UB1604_K4.8.0_GCC6.2.0/x86_64-native-linuxapp-gcc/440c8c7090f740d2ad889733b7fdae92/dpdk/lib/librte_eventdev/rte_event_timer_adapter.c:864:2: warning: nested extern declaration of ‘rte_timer_stop_all’ [-Wnested-externs]
/tmp/UB1604_K4.8.0_GCC6.2.0/x86_64-native-linuxapp-gcc/440c8c7090f740d2ad889733b7fdae92/dpdk/lib/librte_eventdev/rte_event_timer_adapter.c: In function ‘swtim_cancel_burst’:
/tmp/UB1604_K4.8.0_GCC6.2.0/x86_64-native-linuxapp-gcc/440c8c7090f740d2ad889733b7fdae92/dpdk/lib/librte_eventdev/rte_event_timer_adapter.c:1102:9: warning: implicit declaration of function ‘rte_timer_alt_stop’ [-Wimplicit-function-declaration]
   ret = rte_timer_alt_stop(sw->timer_data_id, timp);
         ^~~~~~~~~~~~~~~~~~
/tmp/UB1604_K4.8.0_GCC6.2.0/x86_64-native-linuxapp-gcc/440c8c7090f740d2ad889733b7fdae92/dpdk/lib/librte_eventdev/rte_event_timer_adapter.c:1102:3: warning: nested extern declaration of ‘rte_timer_alt_stop’ [-Wnested-externs]
   ret = rte_timer_alt_stop(sw->timer_data_id, timp);
   ^~~
/tmp/UB1604_K4.8.0_GCC6.2.0/x86_64-native-linuxapp-gcc/440c8c7090f740d2ad889733b7fdae92/dpdk/mk/internal/rte.compile-pre.mk:114: recipe for target 'rte_event_timer_adapter.o' failed
make[5]: *** [rte_event_timer_adapter.o] Error 1
/tmp/UB1604_K4.8.0_GCC6.2.0/x86_64-native-linuxapp-gcc/440c8c7090f740d2ad889733b7fdae92/dpdk/mk/rte.subdir.mk:35: recipe for target 'librte_eventdev' failed
make[4]: *** [librte_eventdev] Error 2
make[4]: *** Waiting for unfinished jobs....
  CC vhost_user.o
  CC virtio_net.o
  CC vdpa.o
  CC vhost_crypto.o
  AR librte_vhost.a
  INSTALL-LIB librte_vhost.a
/tmp/UB1604_K4.8.0_GCC6.2.0/x86_64-native-linuxapp-gcc/440c8c7090f740d2ad889733b7fdae92/dpdk/mk/rte.sdkbuild.mk:49: recipe for target 'lib' failed
make[3]: *** [lib] Error 2
/tmp/UB1604_K4.8.0_GCC6.2.0/x86_64-native-linuxapp-gcc/440c8c7090f740d2ad889733b7fdae92/dpdk/mk/rte.sdkroot.mk:100: recipe for target 'all' failed
make[2]: *** [all] Error 2
/tmp/UB1604_K4.8.0_GCC6.2.0/x86_64-native-linuxapp-gcc/440c8c7090f740d2ad889733b7fdae92/dpdk/mk/rte.sdkinstall.mk:57: recipe for target 'pre_install' failed
make[1]: *** [pre_install] Error 2
/tmp/UB1604_K4.8.0_GCC6.2.0/x86_64-native-linuxapp-gcc/440c8c7090f740d2ad889733b7fdae92/dpdk/mk/rte.sdkroot.mk:79: recipe for target 'install' failed
make: *** [install] Error 2

*Failed Build #3:
OS: UB1604
Target: i686-native-linuxapp-gcc
  CC fd_man.o
  CC iotlb.o
  CC socket.o
  CC rte_event_timer_adapter.o
/tmp/UB1604_K4.4.0_GCC5.4.0/i686-native-linuxapp-gcc/440c8c7090f740d2ad889733b7fdae92/dpdk/lib/librte_eventdev/rte_event_timer_adapter.c: In function ‘swtim_callback’:
/tmp/UB1604_K4.4.0_GCC5.4.0/i686-native-linuxapp-gcc/440c8c7090f740d2ad889733b7fdae92/dpdk/lib/librte_eventdev/rte_event_timer_adapter.c:573:3: warning: implicit declaration of function ‘rte_timer_alt_reset’ [-Wimplicit-function-declaration]
   rte_timer_alt_reset(sw->timer_data_id, tim, 0, SINGLE,
   ^
/tmp/UB1604_K4.4.0_GCC5.4.0/i686-native-linuxapp-gcc/440c8c7090f740d2ad889733b7fdae92/dpdk/lib/librte_eventdev/rte_event_timer_adapter.c:573:3: warning: nested extern declaration of ‘rte_timer_alt_reset’ [-Wnested-externs]
/tmp/UB1604_K4.4.0_GCC5.4.0/i686-native-linuxapp-gcc/440c8c7090f740d2ad889733b7fdae92/dpdk/lib/librte_eventdev/rte_event_timer_adapter.c: In function ‘swtim_service_func’:
/tmp/UB1604_K4.4.0_GCC5.4.0/i686-native-linuxapp-gcc/440c8c7090f740d2ad889733b7fdae92/dpdk/lib/librte_eventdev/rte_event_timer_adapter.c:690:3: warning: implicit declaration of function ‘rte_timer_alt_manage’ [-Wimplicit-function-declaration]
   rte_timer_alt_manage(sw->timer_data_id,
   ^
/tmp/UB1604_K4.4.0_GCC5.4.0/i686-native-linuxapp-gcc/440c8c7090f740d2ad889733b7fdae92/dpdk/lib/librte_eventdev/rte_event_timer_adapter.c:690:3: warning: nested extern declaration of ‘rte_timer_alt_manage’ [-Wnested-externs]
/tmp/UB1604_K4.4.0_GCC5.4.0/i686-native-linuxapp-gcc/440c8c7090f740d2ad889733b7fdae92/dpdk/lib/librte_eventdev/rte_event_timer_adapter.c: In function ‘swtim_init’:
/tmp/UB1604_K4.4.0_GCC5.4.0/i686-native-linuxapp-gcc/440c8c7090f740d2ad889733b7fdae92/dpdk/lib/librte_eventdev/rte_event_timer_adapter.c:793:6: error: void value not ignored as it ought to be
  ret = rte_timer_subsystem_init();
      ^
/tmp/UB1604_K4.4.0_GCC5.4.0/i686-native-linuxapp-gcc/440c8c7090f740d2ad889733b7fdae92/dpdk/lib/librte_eventdev/rte_event_timer_adapter.c:802:8: warning: implicit declaration of function ‘rte_timer_data_alloc’ [-Wimplicit-function-declaration]
  ret = rte_timer_data_alloc(&sw->timer_data_id);
        ^
/tmp/UB1604_K4.4.0_GCC5.4.0/i686-native-linuxapp-gcc/440c8c7090f740d2ad889733b7fdae92/dpdk/lib/librte_eventdev/rte_event_timer_adapter.c:802:2: warning: nested extern declaration of ‘rte_timer_data_alloc’ [-Wnested-externs]
  ret = rte_timer_data_alloc(&sw->timer_data_id);
  ^
/tmp/UB1604_K4.4.0_GCC5.4.0/i686-native-linuxapp-gcc/440c8c7090f740d2ad889733b7fdae92/dpdk/lib/librte_eventdev/rte_event_timer_adapter.c: In function ‘swtim_uninit’:
/tmp/UB1604_K4.4.0_GCC5.4.0/i686-native-linuxapp-gcc/440c8c7090f740d2ad889733b7fdae92/dpdk/lib/librte_eventdev/rte_event_timer_adapter.c:864:2: warning: implicit declaration of function ‘rte_timer_stop_all’ [-Wimplicit-function-declaration]
  rte_timer_stop_all(sw->timer_data_id,
  ^
/tmp/UB1604_K4.4.0_GCC5.4.0/i686-native-linuxapp-gcc/440c8c7090f740d2ad889733b7fdae92/dpdk/lib/librte_eventdev/rte_event_timer_adapter.c:864:2: warning: nested extern declaration of ‘rte_timer_stop_all’ [-Wnested-externs]
/tmp/UB1604_K4.4.0_GCC5.4.0/i686-native-linuxapp-gcc/440c8c7090f740d2ad889733b7fdae92/dpdk/lib/librte_eventdev/rte_event_timer_adapter.c: In function ‘swtim_cancel_burst’:
/tmp/UB1604_K4.4.0_GCC5.4.0/i686-native-linuxapp-gcc/440c8c7090f740d2ad889733b7fdae92/dpdk/lib/librte_eventdev/rte_event_timer_adapter.c:1102:9: warning: implicit declaration of function ‘rte_timer_alt_stop’ [-Wimplicit-function-declaration]
   ret = rte_timer_alt_stop(sw->timer_data_id, timp);
         ^
/tmp/UB1604_K4.4.0_GCC5.4.0/i686-native-linuxapp-gcc/440c8c7090f740d2ad889733b7fdae92/dpdk/lib/librte_eventdev/rte_event_timer_adapter.c:1102:3: warning: nested extern declaration of ‘rte_timer_alt_stop’ [-Wnested-externs]
   ret = rte_timer_alt_stop(sw->timer_data_id, timp);
   ^
/tmp/UB1604_K4.4.0_GCC5.4.0/i686-native-linuxapp-gcc/440c8c7090f740d2ad889733b7fdae92/dpdk/mk/internal/rte.compile-pre.mk:114: recipe for target 'rte_event_timer_adapter.o' failed
make[5]: *** [rte_event_timer_adapter.o] Error 1
/tmp/UB1604_K4.4.0_GCC5.4.0/i686-native-linuxapp-gcc/440c8c7090f740d2ad889733b7fdae92/dpdk/mk/rte.subdir.mk:35: recipe for target 'librte_eventdev' failed
make[4]: *** [librte_eventdev] Error 2
make[4]: *** Waiting for unfinished jobs....
  CC vhost.o
  CC vhost_user.o
  CC virtio_net.o
  CC vdpa.o
  CC vhost_crypto.o
  AR librte_vhost.a
  INSTALL-LIB librte_vhost.a
/tmp/UB1604_K4.4.0_GCC5.4.0/i686-native-linuxapp-gcc/440c8c7090f740d2ad889733b7fdae92/dpdk/mk/rte.sdkbuild.mk:49: recipe for target 'lib' failed
make[3]: *** [lib] Error 2
/tmp/UB1604_K4.4.0_GCC5.4.0/i686-native-linuxapp-gcc/440c8c7090f740d2ad889733b7fdae92/dpdk/mk/rte.sdkroot.mk:100: recipe for target 'all' failed
make[2]: *** [all] Error 2
/tmp/UB1604_K4.4.0_GCC5.4.0/i686-native-linuxapp-gcc/440c8c7090f740d2ad889733b7fdae92/dpdk/mk/rte.sdkinstall.mk:57: recipe for target 'pre_install' failed
make[1]: *** [pre_install] Error 2
/tmp/UB1604_K4.4.0_GCC5.4.0/i686-native-linuxapp-gcc/440c8c7090f740d2ad889733b7fdae92/dpdk/mk/rte.sdkroot.mk:79: recipe for target 'install' failed
make: *** [install] Error 2

*Failed Build #4:
OS: CENTOS
Target: x86_64-native-linuxapp-clang
  CC fd_man.o
  CC rte_event_eth_rx_adapter.o
  CC iotlb.o
  CC socket.o
  CC rte_event_timer_adapter.o
/tmp/CENTOS_K3.10.0_GCC4.8.5/x86_64-native-linuxapp-clang/440c8c7090f740d2ad889733b7fdae92/dpdk/lib/librte_eventdev/rte_event_timer_adapter.c:573:3: warning: implicit declaration of function 'rte_timer_alt_reset' is invalid in C99 [-Wimplicit-function-declaration]
                rte_timer_alt_reset(sw->timer_data_id, tim, 0, SINGLE,
                ^
/tmp/CENTOS_K3.10.0_GCC4.8.5/x86_64-native-linuxapp-clang/440c8c7090f740d2ad889733b7fdae92/dpdk/lib/librte_eventdev/rte_event_timer_adapter.c:690:3: warning: implicit declaration of function 'rte_timer_alt_manage' is invalid in C99 [-Wimplicit-function-declaration]
                rte_timer_alt_manage(sw->timer_data_id,
                ^
  CC vhost.o
/tmp/CENTOS_K3.10.0_GCC4.8.5/x86_64-native-linuxapp-clang/440c8c7090f740d2ad889733b7fdae92/dpdk/lib/librte_eventdev/rte_event_timer_adapter.c:793:6: error: assigning to 'int' from incompatible type 'void'
        ret = rte_timer_subsystem_init();
            ^ ~~~~~~~~~~~~~~~~~~~~~~~~~~
/tmp/CENTOS_K3.10.0_GCC4.8.5/x86_64-native-linuxapp-clang/440c8c7090f740d2ad889733b7fdae92/dpdk/lib/librte_eventdev/rte_event_timer_adapter.c:802:8: warning: implicit declaration of function 'rte_timer_data_alloc' is invalid in C99 [-Wimplicit-function-declaration]
        ret = rte_timer_data_alloc(&sw->timer_data_id);
              ^
/tmp/CENTOS_K3.10.0_GCC4.8.5/x86_64-native-linuxapp-clang/440c8c7090f740d2ad889733b7fdae92/dpdk/lib/librte_eventdev/rte_event_timer_adapter.c:864:2: warning: implicit declaration of function 'rte_timer_stop_all' is invalid in C99 [-Wimplicit-function-declaration]
        rte_timer_stop_all(sw->timer_data_id,
        ^
/tmp/CENTOS_K3.10.0_GCC4.8.5/x86_64-native-linuxapp-clang/440c8c7090f740d2ad889733b7fdae92/dpdk/lib/librte_eventdev/rte_event_timer_adapter.c:1102:9: warning: implicit declaration of function 'rte_timer_alt_stop' is invalid in C99 [-Wimplicit-function-declaration]
                ret = rte_timer_alt_stop(sw->timer_data_id, timp);
                      ^
5 warnings and 1 error generated.
make[5]: *** [rte_event_timer_adapter.o] Error 1
make[4]: *** [librte_eventdev] Error 2
make[4]: *** Waiting for unfinished jobs....
  CC vhost_user.o
  CC virtio_net.o

*Failed Build #5:
OS: CENTOS
Target: i686-native-linuxapp-gcc
  CC fd_man.o
  CC iotlb.o
  CC socket.o
  CC rte_event_timer_adapter.o
/tmp/CENTOS_K3.10.0_GCC4.8.5/i686-native-linuxapp-gcc/440c8c7090f740d2ad889733b7fdae92/dpdk/lib/librte_eventdev/rte_event_timer_adapter.c: In function ‘swtim_callback’:
/tmp/CENTOS_K3.10.0_GCC4.8.5/i686-native-linuxapp-gcc/440c8c7090f740d2ad889733b7fdae92/dpdk/lib/librte_eventdev/rte_event_timer_adapter.c:573:3: warning: implicit declaration of function ‘rte_timer_alt_reset’ [-Wimplicit-function-declaration]
   rte_timer_alt_reset(sw->timer_data_id, tim, 0, SINGLE,
   ^
/tmp/CENTOS_K3.10.0_GCC4.8.5/i686-native-linuxapp-gcc/440c8c7090f740d2ad889733b7fdae92/dpdk/lib/librte_eventdev/rte_event_timer_adapter.c:573:3: warning: nested extern declaration of ‘rte_timer_alt_reset’ [-Wnested-externs]
/tmp/CENTOS_K3.10.0_GCC4.8.5/i686-native-linuxapp-gcc/440c8c7090f740d2ad889733b7fdae92/dpdk/lib/librte_eventdev/rte_event_timer_adapter.c: In function ‘swtim_service_func’:
/tmp/CENTOS_K3.10.0_GCC4.8.5/i686-native-linuxapp-gcc/440c8c7090f740d2ad889733b7fdae92/dpdk/lib/librte_eventdev/rte_event_timer_adapter.c:690:3: warning: implicit declaration of function ‘rte_timer_alt_manage’ [-Wimplicit-function-declaration]
   rte_timer_alt_manage(sw->timer_data_id,
   ^
/tmp/CENTOS_K3.10.0_GCC4.8.5/i686-native-linuxapp-gcc/440c8c7090f740d2ad889733b7fdae92/dpdk/lib/librte_eventdev/rte_event_timer_adapter.c:690:3: warning: nested extern declaration of ‘rte_timer_alt_manage’ [-Wnested-externs]
  CC vhost.o
  CC vhost_user.o
/tmp/CENTOS_K3.10.0_GCC4.8.5/i686-native-linuxapp-gcc/440c8c7090f740d2ad889733b7fdae92/dpdk/lib/librte_eventdev/rte_event_timer_adapter.c: In function ‘swtim_init’:
/tmp/CENTOS_K3.10.0_GCC4.8.5/i686-native-linuxapp-gcc/440c8c7090f740d2ad889733b7fdae92/dpdk/lib/librte_eventdev/rte_event_timer_adapter.c:793:6: error: void value not ignored as it ought to be
  ret = rte_timer_subsystem_init();
      ^
/tmp/CENTOS_K3.10.0_GCC4.8.5/i686-native-linuxapp-gcc/440c8c7090f740d2ad889733b7fdae92/dpdk/lib/librte_eventdev/rte_event_timer_adapter.c:802:2: warning: implicit declaration of function ‘rte_timer_data_alloc’ [-Wimplicit-function-declaration]
  ret = rte_timer_data_alloc(&sw->timer_data_id);
  ^
/tmp/CENTOS_K3.10.0_GCC4.8.5/i686-native-linuxapp-gcc/440c8c7090f740d2ad889733b7fdae92/dpdk/lib/librte_eventdev/rte_event_timer_adapter.c:802:2: warning: nested extern declaration of ‘rte_timer_data_alloc’ [-Wnested-externs]
/tmp/CENTOS_K3.10.0_GCC4.8.5/i686-native-linuxapp-gcc/440c8c7090f740d2ad889733b7fdae92/dpdk/lib/librte_eventdev/rte_event_timer_adapter.c: In function ‘swtim_uninit’:
/tmp/CENTOS_K3.10.0_GCC4.8.5/i686-native-linuxapp-gcc/440c8c7090f740d2ad889733b7fdae92/dpdk/lib/librte_eventdev/rte_event_timer_adapter.c:864:2: warning: implicit declaration of function ‘rte_timer_stop_all’ [-Wimplicit-function-declaration]
  rte_timer_stop_all(sw->timer_data_id,
  ^
/tmp/CENTOS_K3.10.0_GCC4.8.5/i686-native-linuxapp-gcc/440c8c7090f740d2ad889733b7fdae92/dpdk/lib/librte_eventdev/rte_event_timer_adapter.c:864:2: warning: nested extern declaration of ‘rte_timer_stop_all’ [-Wnested-externs]
/tmp/CENTOS_K3.10.0_GCC4.8.5/i686-native-linuxapp-gcc/440c8c7090f740d2ad889733b7fdae92/dpdk/lib/librte_eventdev/rte_event_timer_adapter.c: In function ‘swtim_cancel_burst’:
/tmp/CENTOS_K3.10.0_GCC4.8.5/i686-native-linuxapp-gcc/440c8c7090f740d2ad889733b7fdae92/dpdk/lib/librte_eventdev/rte_event_timer_adapter.c:1102:3: warning: implicit declaration of function ‘rte_timer_alt_stop’ [-Wimplicit-function-declaration]
   ret = rte_timer_alt_stop(sw->timer_data_id, timp);
   ^
/tmp/CENTOS_K3.10.0_GCC4.8.5/i686-native-linuxapp-gcc/440c8c7090f740d2ad889733b7fdae92/dpdk/lib/librte_eventdev/rte_event_timer_adapter.c:1102:3: warning: nested extern declaration of ‘rte_timer_alt_stop’ [-Wnested-externs]
  CC virtio_net.o
make[5]: *** [rte_event_timer_adapter.o] Error 1
make[4]: *** [librte_eventdev] Error 2
make[4]: *** Waiting for unfinished jobs....
  CC vdpa.o

*Failed Build #6:
OS: CENTOS
Target: x86_64-native-linuxapp-gcc-shared
  CC iotlb.o
  CC socket.o
  CC vhost.o
  CC rte_event_timer_adapter.o
/tmp/CENTOS_K3.10.0_GCC4.8.5/x86_64-native-linuxapp-gcc-shared/440c8c7090f740d2ad889733b7fdae92/dpdk/lib/librte_eventdev/rte_event_timer_adapter.c: In function ‘swtim_callback’:
/tmp/CENTOS_K3.10.0_GCC4.8.5/x86_64-native-linuxapp-gcc-shared/440c8c7090f740d2ad889733b7fdae92/dpdk/lib/librte_eventdev/rte_event_timer_adapter.c:573:3: warning: implicit declaration of function ‘rte_timer_alt_reset’ [-Wimplicit-function-declaration]
   rte_timer_alt_reset(sw->timer_data_id, tim, 0, SINGLE,
   ^
/tmp/CENTOS_K3.10.0_GCC4.8.5/x86_64-native-linuxapp-gcc-shared/440c8c7090f740d2ad889733b7fdae92/dpdk/lib/librte_eventdev/rte_event_timer_adapter.c:573:3: warning: nested extern declaration of ‘rte_timer_alt_reset’ [-Wnested-externs]
/tmp/CENTOS_K3.10.0_GCC4.8.5/x86_64-native-linuxapp-gcc-shared/440c8c7090f740d2ad889733b7fdae92/dpdk/lib/librte_eventdev/rte_event_timer_adapter.c: In function ‘swtim_service_func’:
/tmp/CENTOS_K3.10.0_GCC4.8.5/x86_64-native-linuxapp-gcc-shared/440c8c7090f740d2ad889733b7fdae92/dpdk/lib/librte_eventdev/rte_event_timer_adapter.c:690:3: warning: implicit declaration of function ‘rte_timer_alt_manage’ [-Wimplicit-function-declaration]
   rte_timer_alt_manage(sw->timer_data_id,
   ^
/tmp/CENTOS_K3.10.0_GCC4.8.5/x86_64-native-linuxapp-gcc-shared/440c8c7090f740d2ad889733b7fdae92/dpdk/lib/librte_eventdev/rte_event_timer_adapter.c:690:3: warning: nested extern declaration of ‘rte_timer_alt_manage’ [-Wnested-externs]
  CC vhost_user.o
/tmp/CENTOS_K3.10.0_GCC4.8.5/x86_64-native-linuxapp-gcc-shared/440c8c7090f740d2ad889733b7fdae92/dpdk/lib/librte_eventdev/rte_event_timer_adapter.c: In function ‘swtim_init’:
/tmp/CENTOS_K3.10.0_GCC4.8.5/x86_64-native-linuxapp-gcc-shared/440c8c7090f740d2ad889733b7fdae92/dpdk/lib/librte_eventdev/rte_event_timer_adapter.c:793:6: error: void value not ignored as it ought to be
  ret = rte_timer_subsystem_init();
      ^
/tmp/CENTOS_K3.10.0_GCC4.8.5/x86_64-native-linuxapp-gcc-shared/440c8c7090f740d2ad889733b7fdae92/dpdk/lib/librte_eventdev/rte_event_timer_adapter.c:802:2: warning: implicit declaration of function ‘rte_timer_data_alloc’ [-Wimplicit-function-declaration]
  ret = rte_timer_data_alloc(&sw->timer_data_id);
  ^
/tmp/CENTOS_K3.10.0_GCC4.8.5/x86_64-native-linuxapp-gcc-shared/440c8c7090f740d2ad889733b7fdae92/dpdk/lib/librte_eventdev/rte_event_timer_adapter.c:802:2: warning: nested extern declaration of ‘rte_timer_data_alloc’ [-Wnested-externs]
/tmp/CENTOS_K3.10.0_GCC4.8.5/x86_64-native-linuxapp-gcc-shared/440c8c7090f740d2ad889733b7fdae92/dpdk/lib/librte_eventdev/rte_event_timer_adapter.c: In function ‘swtim_uninit’:
/tmp/CENTOS_K3.10.0_GCC4.8.5/x86_64-native-linuxapp-gcc-shared/440c8c7090f740d2ad889733b7fdae92/dpdk/lib/librte_eventdev/rte_event_timer_adapter.c:864:2: warning: implicit declaration of function ‘rte_timer_stop_all’ [-Wimplicit-function-declaration]
  rte_timer_stop_all(sw->timer_data_id,
  ^
/tmp/CENTOS_K3.10.0_GCC4.8.5/x86_64-native-linuxapp-gcc-shared/440c8c7090f740d2ad889733b7fdae92/dpdk/lib/librte_eventdev/rte_event_timer_adapter.c:864:2: warning: nested extern declaration of ‘rte_timer_stop_all’ [-Wnested-externs]
/tmp/CENTOS_K3.10.0_GCC4.8.5/x86_64-native-linuxapp-gcc-shared/440c8c7090f740d2ad889733b7fdae92/dpdk/lib/librte_eventdev/rte_event_timer_adapter.c: In function ‘swtim_cancel_burst’:
/tmp/CENTOS_K3.10.0_GCC4.8.5/x86_64-native-linuxapp-gcc-shared/440c8c7090f740d2ad889733b7fdae92/dpdk/lib/librte_eventdev/rte_event_timer_adapter.c:1102:3: warning: implicit declaration of function ‘rte_timer_alt_stop’ [-Wimplicit-function-declaration]
   ret = rte_timer_alt_stop(sw->timer_data_id, timp);
   ^
/tmp/CENTOS_K3.10.0_GCC4.8.5/x86_64-native-linuxapp-gcc-shared/440c8c7090f740d2ad889733b7fdae92/dpdk/lib/librte_eventdev/rte_event_timer_adapter.c:1102:3: warning: nested extern declaration of ‘rte_timer_alt_stop’ [-Wnested-externs]
make[5]: *** [rte_event_timer_adapter.o] Error 1
make[4]: *** [librte_eventdev] Error 2
make[4]: *** Waiting for unfinished jobs....
  CC virtio_net.o
  CC vdpa.o

*Failed Build #7:
OS: UB1604
Target: x86_64-native-linuxapp-gcc-shared
  CC rte_rawdev.o
  LD librte_rawdev.so.1.1
  INSTALL-LIB librte_rawdev.so.1.1
  CC rte_event_timer_adapter.o
/tmp/UB1604_K4.4.0_GCC5.4.0/x86_64-native-linuxapp-gcc-shared/440c8c7090f740d2ad889733b7fdae92/dpdk/lib/librte_eventdev/rte_event_timer_adapter.c: In function ‘swtim_callback’:
/tmp/UB1604_K4.4.0_GCC5.4.0/x86_64-native-linuxapp-gcc-shared/440c8c7090f740d2ad889733b7fdae92/dpdk/lib/librte_eventdev/rte_event_timer_adapter.c:573:3: warning: implicit declaration of function ‘rte_timer_alt_reset’ [-Wimplicit-function-declaration]
   rte_timer_alt_reset(sw->timer_data_id, tim, 0, SINGLE,
   ^
/tmp/UB1604_K4.4.0_GCC5.4.0/x86_64-native-linuxapp-gcc-shared/440c8c7090f740d2ad889733b7fdae92/dpdk/lib/librte_eventdev/rte_event_timer_adapter.c:573:3: warning: nested extern declaration of ‘rte_timer_alt_reset’ [-Wnested-externs]
/tmp/UB1604_K4.4.0_GCC5.4.0/x86_64-native-linuxapp-gcc-shared/440c8c7090f740d2ad889733b7fdae92/dpdk/lib/librte_eventdev/rte_event_timer_adapter.c: In function ‘swtim_service_func’:
/tmp/UB1604_K4.4.0_GCC5.4.0/x86_64-native-linuxapp-gcc-shared/440c8c7090f740d2ad889733b7fdae92/dpdk/lib/librte_eventdev/rte_event_timer_adapter.c:690:3: warning: implicit declaration of function ‘rte_timer_alt_manage’ [-Wimplicit-function-declaration]
   rte_timer_alt_manage(sw->timer_data_id,
   ^
/tmp/UB1604_K4.4.0_GCC5.4.0/x86_64-native-linuxapp-gcc-shared/440c8c7090f740d2ad889733b7fdae92/dpdk/lib/librte_eventdev/rte_event_timer_adapter.c:690:3: warning: nested extern declaration of ‘rte_timer_alt_manage’ [-Wnested-externs]
/tmp/UB1604_K4.4.0_GCC5.4.0/x86_64-native-linuxapp-gcc-shared/440c8c7090f740d2ad889733b7fdae92/dpdk/lib/librte_eventdev/rte_event_timer_adapter.c: In function ‘swtim_init’:
/tmp/UB1604_K4.4.0_GCC5.4.0/x86_64-native-linuxapp-gcc-shared/440c8c7090f740d2ad889733b7fdae92/dpdk/lib/librte_eventdev/rte_event_timer_adapter.c:793:6: error: void value not ignored as it ought to be
  ret = rte_timer_subsystem_init();
      ^
/tmp/UB1604_K4.4.0_GCC5.4.0/x86_64-native-linuxapp-gcc-shared/440c8c7090f740d2ad889733b7fdae92/dpdk/lib/librte_eventdev/rte_event_timer_adapter.c:802:8: warning: implicit declaration of function ‘rte_timer_data_alloc’ [-Wimplicit-function-declaration]
  ret = rte_timer_data_alloc(&sw->timer_data_id);
        ^
/tmp/UB1604_K4.4.0_GCC5.4.0/x86_64-native-linuxapp-gcc-shared/440c8c7090f740d2ad889733b7fdae92/dpdk/lib/librte_eventdev/rte_event_timer_adapter.c:802:2: warning: nested extern declaration of ‘rte_timer_data_alloc’ [-Wnested-externs]
  ret = rte_timer_data_alloc(&sw->timer_data_id);
  ^
/tmp/UB1604_K4.4.0_GCC5.4.0/x86_64-native-linuxapp-gcc-shared/440c8c7090f740d2ad889733b7fdae92/dpdk/lib/librte_eventdev/rte_event_timer_adapter.c: In function ‘swtim_uninit’:
/tmp/UB1604_K4.4.0_GCC5.4.0/x86_64-native-linuxapp-gcc-shared/440c8c7090f740d2ad889733b7fdae92/dpdk/lib/librte_eventdev/rte_event_timer_adapter.c:864:2: warning: implicit declaration of function ‘rte_timer_stop_all’ [-Wimplicit-function-declaration]
  rte_timer_stop_all(sw->timer_data_id,
  ^
/tmp/UB1604_K4.4.0_GCC5.4.0/x86_64-native-linuxapp-gcc-shared/440c8c7090f740d2ad889733b7fdae92/dpdk/lib/librte_eventdev/rte_event_timer_adapter.c:864:2: warning: nested extern declaration of ‘rte_timer_stop_all’ [-Wnested-externs]
/tmp/UB1604_K4.4.0_GCC5.4.0/x86_64-native-linuxapp-gcc-shared/440c8c7090f740d2ad889733b7fdae92/dpdk/lib/librte_eventdev/rte_event_timer_adapter.c: In function ‘swtim_cancel_burst’:
/tmp/UB1604_K4.4.0_GCC5.4.0/x86_64-native-linuxapp-gcc-shared/440c8c7090f740d2ad889733b7fdae92/dpdk/lib/librte_eventdev/rte_event_timer_adapter.c:1102:9: warning: implicit declaration of function ‘rte_timer_alt_stop’ [-Wimplicit-function-declaration]
   ret = rte_timer_alt_stop(sw->timer_data_id, timp);
         ^
/tmp/UB1604_K4.4.0_GCC5.4.0/x86_64-native-linuxapp-gcc-shared/440c8c7090f740d2ad889733b7fdae92/dpdk/lib/librte_eventdev/rte_event_timer_adapter.c:1102:3: warning: nested extern declaration of ‘rte_timer_alt_stop’ [-Wnested-externs]
   ret = rte_timer_alt_stop(sw->timer_data_id, timp);
   ^
/tmp/UB1604_K4.4.0_GCC5.4.0/x86_64-native-linuxapp-gcc-shared/440c8c7090f740d2ad889733b7fdae92/dpdk/mk/internal/rte.compile-pre.mk:114: recipe for target 'rte_event_timer_adapter.o' failed
make[5]: *** [rte_event_timer_adapter.o] Error 1
make[5]: *** Waiting for unfinished jobs....
== Build lib/librte_vhost
  SYMLINK-FILE include/rte_vhost.h
  SYMLINK-FILE include/rte_vdpa.h
  SYMLINK-FILE include/rte_vhost_crypto.h
  CC fd_man.o
  CC iotlb.o
/tmp/UB1604_K4.4.0_GCC5.4.0/x86_64-native-linuxapp-gcc-shared/440c8c7090f740d2ad889733b7fdae92/dpdk/mk/rte.subdir.mk:35: recipe for target 'librte_eventdev' failed
make[4]: *** [librte_eventdev] Error 2
make[4]: *** Waiting for unfinished jobs....
  CC socket.o
  CC vhost.o
  CC vhost_user.o
  CC virtio_net.o
  CC vdpa.o
  CC vhost_crypto.o
  LD librte_vhost.so.4.1
  INSTALL-LIB librte_vhost.so.4.1
/tmp/UB1604_K4.4.0_GCC5.4.0/x86_64-native-linuxapp-gcc-shared/440c8c7090f740d2ad889733b7fdae92/dpdk/mk/rte.sdkbuild.mk:49: recipe for target 'lib' failed
make[3]: *** [lib] Error 2
/tmp/UB1604_K4.4.0_GCC5.4.0/x86_64-native-linuxapp-gcc-shared/440c8c7090f740d2ad889733b7fdae92/dpdk/mk/rte.sdkroot.mk:100: recipe for target 'all' failed
make[2]: *** [all] Error 2
/tmp/UB1604_K4.4.0_GCC5.4.0/x86_64-native-linuxapp-gcc-shared/440c8c7090f740d2ad889733b7fdae92/dpdk/mk/rte.sdkinstall.mk:57: recipe for target 'pre_install' failed
make[1]: *** [pre_install] Error 2
/tmp/UB1604_K4.4.0_GCC5.4.0/x86_64-native-linuxapp-gcc-shared/440c8c7090f740d2ad889733b7fdae92/dpdk/mk/rte.sdkroot.mk:79: recipe for target 'install' failed
make: *** [install] Error 2

*Failed Build #8:
OS: CENTOS
Target: x86_64-native-linuxapp-gcc
  CC rte_event_eth_rx_adapter.o
  CC iotlb.o
  CC socket.o
  CC rte_event_timer_adapter.o
/tmp/CENTOS_K3.10.0_GCC4.8.5/x86_64-native-linuxapp-gcc/440c8c7090f740d2ad889733b7fdae92/dpdk/lib/librte_eventdev/rte_event_timer_adapter.c: In function ‘swtim_callback’:
/tmp/CENTOS_K3.10.0_GCC4.8.5/x86_64-native-linuxapp-gcc/440c8c7090f740d2ad889733b7fdae92/dpdk/lib/librte_eventdev/rte_event_timer_adapter.c:573:3: warning: implicit declaration of function ‘rte_timer_alt_reset’ [-Wimplicit-function-declaration]
   rte_timer_alt_reset(sw->timer_data_id, tim, 0, SINGLE,
   ^
/tmp/CENTOS_K3.10.0_GCC4.8.5/x86_64-native-linuxapp-gcc/440c8c7090f740d2ad889733b7fdae92/dpdk/lib/librte_eventdev/rte_event_timer_adapter.c:573:3: warning: nested extern declaration of ‘rte_timer_alt_reset’ [-Wnested-externs]
/tmp/CENTOS_K3.10.0_GCC4.8.5/x86_64-native-linuxapp-gcc/440c8c7090f740d2ad889733b7fdae92/dpdk/lib/librte_eventdev/rte_event_timer_adapter.c: In function ‘swtim_service_func’:
/tmp/CENTOS_K3.10.0_GCC4.8.5/x86_64-native-linuxapp-gcc/440c8c7090f740d2ad889733b7fdae92/dpdk/lib/librte_eventdev/rte_event_timer_adapter.c:690:3: warning: implicit declaration of function ‘rte_timer_alt_manage’ [-Wimplicit-function-declaration]
   rte_timer_alt_manage(sw->timer_data_id,
   ^
/tmp/CENTOS_K3.10.0_GCC4.8.5/x86_64-native-linuxapp-gcc/440c8c7090f740d2ad889733b7fdae92/dpdk/lib/librte_eventdev/rte_event_timer_adapter.c:690:3: warning: nested extern declaration of ‘rte_timer_alt_manage’ [-Wnested-externs]
/tmp/CENTOS_K3.10.0_GCC4.8.5/x86_64-native-linuxapp-gcc/440c8c7090f740d2ad889733b7fdae92/dpdk/lib/librte_eventdev/rte_event_timer_adapter.c: In function ‘swtim_init’:
/tmp/CENTOS_K3.10.0_GCC4.8.5/x86_64-native-linuxapp-gcc/440c8c7090f740d2ad889733b7fdae92/dpdk/lib/librte_eventdev/rte_event_timer_adapter.c:793:6: error: void value not ignored as it ought to be
  ret = rte_timer_subsystem_init();
      ^
/tmp/CENTOS_K3.10.0_GCC4.8.5/x86_64-native-linuxapp-gcc/440c8c7090f740d2ad889733b7fdae92/dpdk/lib/librte_eventdev/rte_event_timer_adapter.c:802:2: warning: implicit declaration of function ‘rte_timer_data_alloc’ [-Wimplicit-function-declaration]
  ret = rte_timer_data_alloc(&sw->timer_data_id);
  ^
/tmp/CENTOS_K3.10.0_GCC4.8.5/x86_64-native-linuxapp-gcc/440c8c7090f740d2ad889733b7fdae92/dpdk/lib/librte_eventdev/rte_event_timer_adapter.c:802:2: warning: nested extern declaration of ‘rte_timer_data_alloc’ [-Wnested-externs]
/tmp/CENTOS_K3.10.0_GCC4.8.5/x86_64-native-linuxapp-gcc/440c8c7090f740d2ad889733b7fdae92/dpdk/lib/librte_eventdev/rte_event_timer_adapter.c: In function ‘swtim_uninit’:
/tmp/CENTOS_K3.10.0_GCC4.8.5/x86_64-native-linuxapp-gcc/440c8c7090f740d2ad889733b7fdae92/dpdk/lib/librte_eventdev/rte_event_timer_adapter.c:864:2: warning: implicit declaration of function ‘rte_timer_stop_all’ [-Wimplicit-function-declaration]
  rte_timer_stop_all(sw->timer_data_id,
  ^
/tmp/CENTOS_K3.10.0_GCC4.8.5/x86_64-native-linuxapp-gcc/440c8c7090f740d2ad889733b7fdae92/dpdk/lib/librte_eventdev/rte_event_timer_adapter.c:864:2: warning: nested extern declaration of ‘rte_timer_stop_all’ [-Wnested-externs]
/tmp/CENTOS_K3.10.0_GCC4.8.5/x86_64-native-linuxapp-gcc/440c8c7090f740d2ad889733b7fdae92/dpdk/lib/librte_eventdev/rte_event_timer_adapter.c: In function ‘swtim_cancel_burst’:
/tmp/CENTOS_K3.10.0_GCC4.8.5/x86_64-native-linuxapp-gcc/440c8c7090f740d2ad889733b7fdae92/dpdk/lib/librte_eventdev/rte_event_timer_adapter.c:1102:3: warning: implicit declaration of function ‘rte_timer_alt_stop’ [-Wimplicit-function-declaration]
   ret = rte_timer_alt_stop(sw->timer_data_id, timp);
   ^
/tmp/CENTOS_K3.10.0_GCC4.8.5/x86_64-native-linuxapp-gcc/440c8c7090f740d2ad889733b7fdae92/dpdk/lib/librte_eventdev/rte_event_timer_adapter.c:1102:3: warning: nested extern declaration of ‘rte_timer_alt_stop’ [-Wnested-externs]
make[5]: *** [rte_event_timer_adapter.o] Error 1
make[4]: *** [librte_eventdev] Error 2
make[4]: *** Waiting for unfinished jobs....
  CC vhost.o
  CC vhost_user.o

*Failed Build #9:
OS: UB1604
Target: x86_64-native-linuxapp-clang
  CC rte_event_eth_rx_adapter.o
  CC iotlb.o
  CC socket.o
  CC rte_event_timer_adapter.o
  CC vhost.o
/tmp/UB1604_K4.4.0_GCC5.4.0/x86_64-native-linuxapp-clang/440c8c7090f740d2ad889733b7fdae92/dpdk/lib/librte_eventdev/rte_event_timer_adapter.c:573:3: warning: implicit declaration of function 'rte_timer_alt_reset' is invalid in C99 [-Wimplicit-function-declaration]
                rte_timer_alt_reset(sw->timer_data_id, tim, 0, SINGLE,
                ^
/tmp/UB1604_K4.4.0_GCC5.4.0/x86_64-native-linuxapp-clang/440c8c7090f740d2ad889733b7fdae92/dpdk/lib/librte_eventdev/rte_event_timer_adapter.c:690:3: warning: implicit declaration of function 'rte_timer_alt_manage' is invalid in C99 [-Wimplicit-function-declaration]
                rte_timer_alt_manage(sw->timer_data_id,
                ^
  CC vhost_user.o
/tmp/UB1604_K4.4.0_GCC5.4.0/x86_64-native-linuxapp-clang/440c8c7090f740d2ad889733b7fdae92/dpdk/lib/librte_eventdev/rte_event_timer_adapter.c:793:6: error: assigning to 'int' from incompatible type 'void'
        ret = rte_timer_subsystem_init();
            ^ ~~~~~~~~~~~~~~~~~~~~~~~~~~
/tmp/UB1604_K4.4.0_GCC5.4.0/x86_64-native-linuxapp-clang/440c8c7090f740d2ad889733b7fdae92/dpdk/lib/librte_eventdev/rte_event_timer_adapter.c:802:8: warning: implicit declaration of function 'rte_timer_data_alloc' is invalid in C99 [-Wimplicit-function-declaration]
        ret = rte_timer_data_alloc(&sw->timer_data_id);
              ^
/tmp/UB1604_K4.4.0_GCC5.4.0/x86_64-native-linuxapp-clang/440c8c7090f740d2ad889733b7fdae92/dpdk/lib/librte_eventdev/rte_event_timer_adapter.c:864:2: warning: implicit declaration of function 'rte_timer_stop_all' is invalid in C99 [-Wimplicit-function-declaration]
        rte_timer_stop_all(sw->timer_data_id,
        ^
/tmp/UB1604_K4.4.0_GCC5.4.0/x86_64-native-linuxapp-clang/440c8c7090f740d2ad889733b7fdae92/dpdk/lib/librte_eventdev/rte_event_timer_adapter.c:1102:9: warning: implicit declaration of function 'rte_timer_alt_stop' is invalid in C99 [-Wimplicit-function-declaration]
                ret = rte_timer_alt_stop(sw->timer_data_id, timp);
                      ^
5 warnings and 1 error generated.
/tmp/UB1604_K4.4.0_GCC5.4.0/x86_64-native-linuxapp-clang/440c8c7090f740d2ad889733b7fdae92/dpdk/mk/internal/rte.compile-pre.mk:114: recipe for target 'rte_event_timer_adapter.o' failed
make[5]: *** [rte_event_timer_adapter.o] Error 1
/tmp/UB1604_K4.4.0_GCC5.4.0/x86_64-native-linuxapp-clang/440c8c7090f740d2ad889733b7fdae92/dpdk/mk/rte.subdir.mk:35: recipe for target 'librte_eventdev' failed
make[4]: *** [librte_eventdev] Error 2
make[4]: *** Waiting for unfinished jobs....
  CC virtio_net.o
  CC vdpa.o
  CC vhost_crypto.o
  AR librte_vhost.a
  INSTALL-LIB librte_vhost.a
/tmp/UB1604_K4.4.0_GCC5.4.0/x86_64-native-linuxapp-clang/440c8c7090f740d2ad889733b7fdae92/dpdk/mk/rte.sdkbuild.mk:49: recipe for target 'lib' failed
make[3]: *** [lib] Error 2
/tmp/UB1604_K4.4.0_GCC5.4.0/x86_64-native-linuxapp-clang/440c8c7090f740d2ad889733b7fdae92/dpdk/mk/rte.sdkroot.mk:100: recipe for target 'all' failed
make[2]: *** [all] Error 2
/tmp/UB1604_K4.4.0_GCC5.4.0/x86_64-native-linuxapp-clang/440c8c7090f740d2ad889733b7fdae92/dpdk/mk/rte.sdkinstall.mk:57: recipe for target 'pre_install' failed
make[1]: *** [pre_install] Error 2
/tmp/UB1604_K4.4.0_GCC5.4.0/x86_64-native-linuxapp-clang/440c8c7090f740d2ad889733b7fdae92/dpdk/mk/rte.sdkroot.mk:79: recipe for target 'install' failed
make: *** [install] Error 2

*Failed Build #10:
OS: FreeBSD
Target: x86_64-native-bsdapp-clang
  CC rte_ipv6_fragmentation.o
  CC rte_ipv4_reassembly.o
  CC rte_ipv6_reassembly.o
  CC rte_event_timer_adapter.o
  CC rte_ip_frag_common.o
/tmp/FreeBSD_K10.3_GCC4.8.5/x86_64-native-bsdapp-clang/440c8c7090f740d2ad889733b7fdae92/dpdk/lib/librte_eventdev/rte_event_timer_adapter.c:573:3: warning: implicit declaration of function 'rte_timer_alt_reset' is invalid in C99 [-Wimplicit-function-declaration]
                rte_timer_alt_reset(sw->timer_data_id, tim, 0, SINGLE,
                ^
/tmp/FreeBSD_K10.3_GCC4.8.5/x86_64-native-bsdapp-clang/440c8c7090f740d2ad889733b7fdae92/dpdk/lib/librte_eventdev/rte_event_timer_adapter.c:690:3: warning: implicit declaration of function 'rte_timer_alt_manage' is invalid in C99 [-Wimplicit-function-declaration]
                rte_timer_alt_manage(sw->timer_data_id,
                ^
  CC ip_frag_internal.o
/tmp/FreeBSD_K10.3_GCC4.8.5/x86_64-native-bsdapp-clang/440c8c7090f740d2ad889733b7fdae92/dpdk/lib/librte_eventdev/rte_event_timer_adapter.c:793:6: error: assigning to 'int' from incompatible type 'void'
        ret = rte_timer_subsystem_init();
            ^ ~~~~~~~~~~~~~~~~~~~~~~~~~~
/tmp/FreeBSD_K10.3_GCC4.8.5/x86_64-native-bsdapp-clang/440c8c7090f740d2ad889733b7fdae92/dpdk/lib/librte_eventdev/rte_event_timer_adapter.c:802:8: warning: implicit declaration of function 'rte_timer_data_alloc' is invalid in C99 [-Wimplicit-function-declaration]
        ret = rte_timer_data_alloc(&sw->timer_data_id);
              ^
/tmp/FreeBSD_K10.3_GCC4.8.5/x86_64-native-bsdapp-clang/440c8c7090f740d2ad889733b7fdae92/dpdk/lib/librte_eventdev/rte_event_timer_adapter.c:864:2: warning: implicit declaration of function 'rte_timer_stop_all' is invalid in C99 [-Wimplicit-function-declaration]
        rte_timer_stop_all(sw->timer_data_id,
        ^
/tmp/FreeBSD_K10.3_GCC4.8.5/x86_64-native-bsdapp-clang/440c8c7090f740d2ad889733b7fdae92/dpdk/lib/librte_eventdev/rte_event_timer_adapter.c:1102:9: warning: implicit declaration of function 'rte_timer_alt_stop' is invalid in C99 [-Wimplicit-function-declaration]
                ret = rte_timer_alt_stop(sw->timer_data_id, timp);
                      ^
5 warnings and 1 error generated.
gmake[5]: *** [/tmp/FreeBSD_K10.3_GCC4.8.5/x86_64-native-bsdapp-clang/440c8c7090f740d2ad889733b7fdae92/dpdk/mk/internal/rte.compile-pre.mk:116: rte_event_timer_adapter.o] Error 1
gmake[4]: *** [/tmp/FreeBSD_K10.3_GCC4.8.5/x86_64-native-bsdapp-clang/440c8c7090f740d2ad889733b7fdae92/dpdk/mk/rte.subdir.mk:37: librte_eventdev] Error 2
gmake[4]: *** Waiting for unfinished jobs....
  AR librte_ip_frag.a
  INSTALL-LIB librte_ip_frag.a

*Failed Build #11:
OS: FC24
Target: i686-native-linuxapp-gcc
  CC iotlb.o
  CC socket.o
  CC vhost.o
  CC rte_event_timer_adapter.o
/tmp/FC24_K4.5.5_GCC6.1.1/i686-native-linuxapp-gcc/440c8c7090f740d2ad889733b7fdae92/dpdk/lib/librte_eventdev/rte_event_timer_adapter.c: In function ‘swtim_callback’:
/tmp/FC24_K4.5.5_GCC6.1.1/i686-native-linuxapp-gcc/440c8c7090f740d2ad889733b7fdae92/dpdk/lib/librte_eventdev/rte_event_timer_adapter.c:573:3: warning: implicit declaration of function ‘rte_timer_alt_reset’ [-Wimplicit-function-declaration]
   rte_timer_alt_reset(sw->timer_data_id, tim, 0, SINGLE,
   ^~~~~~~~~~~~~~~~~~~
/tmp/FC24_K4.5.5_GCC6.1.1/i686-native-linuxapp-gcc/440c8c7090f740d2ad889733b7fdae92/dpdk/lib/librte_eventdev/rte_event_timer_adapter.c:573:3: warning: nested extern declaration of ‘rte_timer_alt_reset’ [-Wnested-externs]
/tmp/FC24_K4.5.5_GCC6.1.1/i686-native-linuxapp-gcc/440c8c7090f740d2ad889733b7fdae92/dpdk/lib/librte_eventdev/rte_event_timer_adapter.c: In function ‘swtim_service_func’:
/tmp/FC24_K4.5.5_GCC6.1.1/i686-native-linuxapp-gcc/440c8c7090f740d2ad889733b7fdae92/dpdk/lib/librte_eventdev/rte_event_timer_adapter.c:690:3: warning: implicit declaration of function ‘rte_timer_alt_manage’ [-Wimplicit-function-declaration]
   rte_timer_alt_manage(sw->timer_data_id,
   ^~~~~~~~~~~~~~~~~~~~
/tmp/FC24_K4.5.5_GCC6.1.1/i686-native-linuxapp-gcc/440c8c7090f740d2ad889733b7fdae92/dpdk/lib/librte_eventdev/rte_event_timer_adapter.c:690:3: warning: nested extern declaration of ‘rte_timer_alt_manage’ [-Wnested-externs]
/tmp/FC24_K4.5.5_GCC6.1.1/i686-native-linuxapp-gcc/440c8c7090f740d2ad889733b7fdae92/dpdk/lib/librte_eventdev/rte_event_timer_adapter.c: In function ‘swtim_init’:
/tmp/FC24_K4.5.5_GCC6.1.1/i686-native-linuxapp-gcc/440c8c7090f740d2ad889733b7fdae92/dpdk/lib/librte_eventdev/rte_event_timer_adapter.c:793:6: error: void value not ignored as it ought to be
  ret = rte_timer_subsystem_init();
      ^
/tmp/FC24_K4.5.5_GCC6.1.1/i686-native-linuxapp-gcc/440c8c7090f740d2ad889733b7fdae92/dpdk/lib/librte_eventdev/rte_event_timer_adapter.c:802:8: warning: implicit declaration of function ‘rte_timer_data_alloc’ [-Wimplicit-function-declaration]
  ret = rte_timer_data_alloc(&sw->timer_data_id);
        ^~~~~~~~~~~~~~~~~~~~
/tmp/FC24_K4.5.5_GCC6.1.1/i686-native-linuxapp-gcc/440c8c7090f740d2ad889733b7fdae92/dpdk/lib/librte_eventdev/rte_event_timer_adapter.c:802:2: warning: nested extern declaration of ‘rte_timer_data_alloc’ [-Wnested-externs]
  ret = rte_timer_data_alloc(&sw->timer_data_id);
  ^~~
/tmp/FC24_K4.5.5_GCC6.1.1/i686-native-linuxapp-gcc/440c8c7090f740d2ad889733b7fdae92/dpdk/lib/librte_eventdev/rte_event_timer_adapter.c: In function ‘swtim_uninit’:
/tmp/FC24_K4.5.5_GCC6.1.1/i686-native-linuxapp-gcc/440c8c7090f740d2ad889733b7fdae92/dpdk/lib/librte_eventdev/rte_event_timer_adapter.c:864:2: warning: implicit declaration of function ‘rte_timer_stop_all’ [-Wimplicit-function-declaration]
  rte_timer_stop_all(sw->timer_data_id,
  ^~~~~~~~~~~~~~~~~~
/tmp/FC24_K4.5.5_GCC6.1.1/i686-native-linuxapp-gcc/440c8c7090f740d2ad889733b7fdae92/dpdk/lib/librte_eventdev/rte_event_timer_adapter.c:864:2: warning: nested extern declaration of ‘rte_timer_stop_all’ [-Wnested-externs]
/tmp/FC24_K4.5.5_GCC6.1.1/i686-native-linuxapp-gcc/440c8c7090f740d2ad889733b7fdae92/dpdk/lib/librte_eventdev/rte_event_timer_adapter.c: In function ‘swtim_cancel_burst’:
/tmp/FC24_K4.5.5_GCC6.1.1/i686-native-linuxapp-gcc/440c8c7090f740d2ad889733b7fdae92/dpdk/lib/librte_eventdev/rte_event_timer_adapter.c:1102:9: warning: implicit declaration of function ‘rte_timer_alt_stop’ [-Wimplicit-function-declaration]
   ret = rte_timer_alt_stop(sw->timer_data_id, timp);
         ^~~~~~~~~~~~~~~~~~
/tmp/FC24_K4.5.5_GCC6.1.1/i686-native-linuxapp-gcc/440c8c7090f740d2ad889733b7fdae92/dpdk/lib/librte_eventdev/rte_event_timer_adapter.c:1102:3: warning: nested extern declaration of ‘rte_timer_alt_stop’ [-Wnested-externs]
   ret = rte_timer_alt_stop(sw->timer_data_id, timp);
   ^~~
/tmp/FC24_K4.5.5_GCC6.1.1/i686-native-linuxapp-gcc/440c8c7090f740d2ad889733b7fdae92/dpdk/mk/internal/rte.compile-pre.mk:114: recipe for target 'rte_event_timer_adapter.o' failed
make[5]: *** [rte_event_timer_adapter.o] Error 1
/tmp/FC24_K4.5.5_GCC6.1.1/i686-native-linuxapp-gcc/440c8c7090f740d2ad889733b7fdae92/dpdk/mk/rte.subdir.mk:35: recipe for target 'librte_eventdev' failed
make[4]: *** [librte_eventdev] Error 2
make[4]: *** Waiting for unfinished jobs....
  CC vhost_user.o
  CC virtio_net.o
  CC vdpa.o
  CC vhost_crypto.o
  AR librte_vhost.a
  INSTALL-LIB librte_vhost.a
/tmp/FC24_K4.5.5_GCC6.1.1/i686-native-linuxapp-gcc/440c8c7090f740d2ad889733b7fdae92/dpdk/mk/rte.sdkbuild.mk:49: recipe for target 'lib' failed
make[3]: *** [lib] Error 2
/tmp/FC24_K4.5.5_GCC6.1.1/i686-native-linuxapp-gcc/440c8c7090f740d2ad889733b7fdae92/dpdk/mk/rte.sdkroot.mk:100: recipe for target 'all' failed
make[2]: *** [all] Error 2
/tmp/FC24_K4.5.5_GCC6.1.1/i686-native-linuxapp-gcc/440c8c7090f740d2ad889733b7fdae92/dpdk/mk/rte.sdkinstall.mk:57: recipe for target 'pre_install' failed
make[1]: *** [pre_install] Error 2
/tmp/FC24_K4.5.5_GCC6.1.1/i686-native-linuxapp-gcc/440c8c7090f740d2ad889733b7fdae92/dpdk/mk/rte.sdkroot.mk:79: recipe for target 'install' failed
make: *** [install] Error 2

*Failed Build #12:
OS: FC25
Target: x86_64-native-linuxapp-gcc-debug
  INSTALL-LIB librte_security.a
  CC rte_event_ring.o
  CC rte_event_eth_rx_adapter.o
  CC rte_event_timer_adapter.o
/tmp/FC25_K4.8.6_GCC6.3.1/x86_64-native-linuxapp-gcc-debug/440c8c7090f740d2ad889733b7fdae92/dpdk/lib/librte_eventdev/rte_event_timer_adapter.c: In function ‘swtim_callback’:
/tmp/FC25_K4.8.6_GCC6.3.1/x86_64-native-linuxapp-gcc-debug/440c8c7090f740d2ad889733b7fdae92/dpdk/lib/librte_eventdev/rte_event_timer_adapter.c:573:3: warning: implicit declaration of function ‘rte_timer_alt_reset’ [-Wimplicit-function-declaration]
   rte_timer_alt_reset(sw->timer_data_id, tim, 0, SINGLE,
   ^~~~~~~~~~~~~~~~~~~
/tmp/FC25_K4.8.6_GCC6.3.1/x86_64-native-linuxapp-gcc-debug/440c8c7090f740d2ad889733b7fdae92/dpdk/lib/librte_eventdev/rte_event_timer_adapter.c:573:3: warning: nested extern declaration of ‘rte_timer_alt_reset’ [-Wnested-externs]
/tmp/FC25_K4.8.6_GCC6.3.1/x86_64-native-linuxapp-gcc-debug/440c8c7090f740d2ad889733b7fdae92/dpdk/lib/librte_eventdev/rte_event_timer_adapter.c: In function ‘swtim_service_func’:
/tmp/FC25_K4.8.6_GCC6.3.1/x86_64-native-linuxapp-gcc-debug/440c8c7090f740d2ad889733b7fdae92/dpdk/lib/librte_eventdev/rte_event_timer_adapter.c:690:3: warning: implicit declaration of function ‘rte_timer_alt_manage’ [-Wimplicit-function-declaration]
   rte_timer_alt_manage(sw->timer_data_id,
   ^~~~~~~~~~~~~~~~~~~~
/tmp/FC25_K4.8.6_GCC6.3.1/x86_64-native-linuxapp-gcc-debug/440c8c7090f740d2ad889733b7fdae92/dpdk/lib/librte_eventdev/rte_event_timer_adapter.c:690:3: warning: nested extern declaration of ‘rte_timer_alt_manage’ [-Wnested-externs]
/tmp/FC25_K4.8.6_GCC6.3.1/x86_64-native-linuxapp-gcc-debug/440c8c7090f740d2ad889733b7fdae92/dpdk/lib/librte_eventdev/rte_event_timer_adapter.c: In function ‘swtim_init’:
/tmp/FC25_K4.8.6_GCC6.3.1/x86_64-native-linuxapp-gcc-debug/440c8c7090f740d2ad889733b7fdae92/dpdk/lib/librte_eventdev/rte_event_timer_adapter.c:793:6: error: void value not ignored as it ought to be
  ret = rte_timer_subsystem_init();
      ^
/tmp/FC25_K4.8.6_GCC6.3.1/x86_64-native-linuxapp-gcc-debug/440c8c7090f740d2ad889733b7fdae92/dpdk/lib/librte_eventdev/rte_event_timer_adapter.c:802:8: warning: implicit declaration of function ‘rte_timer_data_alloc’ [-Wimplicit-function-declaration]
  ret = rte_timer_data_alloc(&sw->timer_data_id);
        ^~~~~~~~~~~~~~~~~~~~
/tmp/FC25_K4.8.6_GCC6.3.1/x86_64-native-linuxapp-gcc-debug/440c8c7090f740d2ad889733b7fdae92/dpdk/lib/librte_eventdev/rte_event_timer_adapter.c:802:2: warning: nested extern declaration of ‘rte_timer_data_alloc’ [-Wnested-externs]
  ret = rte_timer_data_alloc(&sw->timer_data_id);
  ^~~
/tmp/FC25_K4.8.6_GCC6.3.1/x86_64-native-linuxapp-gcc-debug/440c8c7090f740d2ad889733b7fdae92/dpdk/lib/librte_eventdev/rte_event_timer_adapter.c: In function ‘swtim_uninit’:
/tmp/FC25_K4.8.6_GCC6.3.1/x86_64-native-linuxapp-gcc-debug/440c8c7090f740d2ad889733b7fdae92/dpdk/lib/librte_eventdev/rte_event_timer_adapter.c:864:2: warning: implicit declaration of function ‘rte_timer_stop_all’ [-Wimplicit-function-declaration]
  rte_timer_stop_all(sw->timer_data_id,
  ^~~~~~~~~~~~~~~~~~
/tmp/FC25_K4.8.6_GCC6.3.1/x86_64-native-linuxapp-gcc-debug/440c8c7090f740d2ad889733b7fdae92/dpdk/lib/librte_eventdev/rte_event_timer_adapter.c:864:2: warning: nested extern declaration of ‘rte_timer_stop_all’ [-Wnested-externs]
/tmp/FC25_K4.8.6_GCC6.3.1/x86_64-native-linuxapp-gcc-debug/440c8c7090f740d2ad889733b7fdae92/dpdk/lib/librte_eventdev/rte_event_timer_adapter.c: In function ‘swtim_cancel_burst’:
/tmp/FC25_K4.8.6_GCC6.3.1/x86_64-native-linuxapp-gcc-debug/440c8c7090f740d2ad889733b7fdae92/dpdk/lib/librte_eventdev/rte_event_timer_adapter.c:1102:9: warning: implicit declaration of function ‘rte_timer_alt_stop’ [-Wimplicit-function-declaration]
   ret = rte_timer_alt_stop(sw->timer_data_id, timp);
         ^~~~~~~~~~~~~~~~~~
/tmp/FC25_K4.8.6_GCC6.3.1/x86_64-native-linuxapp-gcc-debug/440c8c7090f740d2ad889733b7fdae92/dpdk/lib/librte_eventdev/rte_event_timer_adapter.c:1102:3: warning: nested extern declaration of ‘rte_timer_alt_stop’ [-Wnested-externs]
   ret = rte_timer_alt_stop(sw->timer_data_id, timp);
   ^~~
/tmp/FC25_K4.8.6_GCC6.3.1/x86_64-native-linuxapp-gcc-debug/440c8c7090f740d2ad889733b7fdae92/dpdk/mk/internal/rte.compile-pre.mk:114: recipe for target 'rte_event_timer_adapter.o' failed
make[5]: *** [rte_event_timer_adapter.o] Error 1
make[5]: *** Waiting for unfinished jobs....
== Build lib/librte_rawdev
  SYMLINK-FILE include/rte_rawdev.h
  SYMLINK-FILE include/rte_rawdev_pmd.h
--
  AR librte_rawdev.a
  INSTALL-LIB librte_rawdev.a
== Build lib/librte_vhost
  SYMLINK-FILE include/rte_vhost.h
  SYMLINK-FILE include/rte_vdpa.h
/tmp/FC25_K4.8.6_GCC6.3.1/x86_64-native-linuxapp-gcc-debug/440c8c7090f740d2ad889733b7fdae92/dpdk/mk/rte.subdir.mk:35: recipe for target 'librte_eventdev' failed
make[4]: *** [librte_eventdev] Error 2
make[4]: *** Waiting for unfinished jobs....
  SYMLINK-FILE include/rte_vhost_crypto.h
  CC fd_man.o
  CC iotlb.o
--
  CC virtio_net.o
  CC vdpa.o
  CC vhost_crypto.o
  AR librte_vhost.a
  INSTALL-LIB librte_vhost.a
/tmp/FC25_K4.8.6_GCC6.3.1/x86_64-native-linuxapp-gcc-debug/440c8c7090f740d2ad889733b7fdae92/dpdk/mk/rte.sdkbuild.mk:49: recipe for target 'lib' failed
make[3]: *** [lib] Error 2
/tmp/FC25_K4.8.6_GCC6.3.1/x86_64-native-linuxapp-gcc-debug/440c8c7090f740d2ad889733b7fdae92/dpdk/mk/rte.sdkroot.mk:100: recipe for target 'all' failed
make[2]: *** [all] Error 2
/tmp/FC25_K4.8.6_GCC6.3.1/x86_64-native-linuxapp-gcc-debug/440c8c7090f740d2ad889733b7fdae92/dpdk/mk/rte.sdkinstall.mk:57: recipe for target 'pre_install' failed
make[1]: *** [pre_install] Error 2
/tmp/FC25_K4.8.6_GCC6.3.1/x86_64-native-linuxapp-gcc-debug/440c8c7090f740d2ad889733b7fdae92/dpdk/mk/rte.sdkroot.mk:79: recipe for target 'install' failed
make: *** [install] Error 2

*Failed Build #13:
OS: FC24
Target: x86_64-native-linuxapp-clang
  AR librte_security.a
  INSTALL-LIB librte_security.a
  CC rte_event_ring.o
  CC rte_event_eth_rx_adapter.o
  CC rte_event_timer_adapter.o
/tmp/FC24_K4.9.13_GCC6.2.1/x86_64-native-linuxapp-clang/440c8c7090f740d2ad889733b7fdae92/dpdk/lib/librte_eventdev/rte_event_timer_adapter.c:573:3: warning: implicit declaration of function 'rte_timer_alt_reset' is invalid in C99 [-Wimplicit-function-declaration]
                rte_timer_alt_reset(sw->timer_data_id, tim, 0, SINGLE,
                ^
/tmp/FC24_K4.9.13_GCC6.2.1/x86_64-native-linuxapp-clang/440c8c7090f740d2ad889733b7fdae92/dpdk/lib/librte_eventdev/rte_event_timer_adapter.c:690:3: warning: implicit declaration of function 'rte_timer_alt_manage' is invalid in C99 [-Wimplicit-function-declaration]
                rte_timer_alt_manage(sw->timer_data_id,
                ^
/tmp/FC24_K4.9.13_GCC6.2.1/x86_64-native-linuxapp-clang/440c8c7090f740d2ad889733b7fdae92/dpdk/lib/librte_eventdev/rte_event_timer_adapter.c:793:6: error: assigning to 'int' from incompatible type 'void'
        ret = rte_timer_subsystem_init();
            ^ ~~~~~~~~~~~~~~~~~~~~~~~~~~
/tmp/FC24_K4.9.13_GCC6.2.1/x86_64-native-linuxapp-clang/440c8c7090f740d2ad889733b7fdae92/dpdk/lib/librte_eventdev/rte_event_timer_adapter.c:802:8: warning: implicit declaration of function 'rte_timer_data_alloc' is invalid in C99 [-Wimplicit-function-declaration]
        ret = rte_timer_data_alloc(&sw->timer_data_id);
              ^
/tmp/FC24_K4.9.13_GCC6.2.1/x86_64-native-linuxapp-clang/440c8c7090f740d2ad889733b7fdae92/dpdk/lib/librte_eventdev/rte_event_timer_adapter.c:864:2: warning: implicit declaration of function 'rte_timer_stop_all' is invalid in C99 [-Wimplicit-function-declaration]
        rte_timer_stop_all(sw->timer_data_id,
        ^
/tmp/FC24_K4.9.13_GCC6.2.1/x86_64-native-linuxapp-clang/440c8c7090f740d2ad889733b7fdae92/dpdk/lib/librte_eventdev/rte_event_timer_adapter.c:1102:9: warning: implicit declaration of function 'rte_timer_alt_stop' is invalid in C99 [-Wimplicit-function-declaration]
                ret = rte_timer_alt_stop(sw->timer_data_id, timp);
                      ^
5 warnings and 1 error generated.
/tmp/FC24_K4.9.13_GCC6.2.1/x86_64-native-linuxapp-clang/440c8c7090f740d2ad889733b7fdae92/dpdk/mk/internal/rte.compile-pre.mk:114: recipe for target 'rte_event_timer_adapter.o' failed
make[5]: *** [rte_event_timer_adapter.o] Error 1
make[5]: *** Waiting for unfinished jobs....
== Build lib/librte_rawdev
  SYMLINK-FILE include/rte_rawdev.h
  SYMLINK-FILE include/rte_rawdev_pmd.h
  CC rte_rawdev.o
/tmp/FC24_K4.9.13_GCC6.2.1/x86_64-native-linuxapp-clang/440c8c7090f740d2ad889733b7fdae92/dpdk/mk/rte.subdir.mk:35: recipe for target 'librte_eventdev' failed
make[4]: *** [librte_eventdev] Error 2
make[4]: *** Waiting for unfinished jobs....
  AR librte_rawdev.a
  INSTALL-LIB librte_rawdev.a
/tmp/FC24_K4.9.13_GCC6.2.1/x86_64-native-linuxapp-clang/440c8c7090f740d2ad889733b7fdae92/dpdk/mk/rte.sdkbuild.mk:49: recipe for target 'lib' failed
make[3]: *** [lib] Error 2
/tmp/FC24_K4.9.13_GCC6.2.1/x86_64-native-linuxapp-clang/440c8c7090f740d2ad889733b7fdae92/dpdk/mk/rte.sdkroot.mk:100: recipe for target 'all' failed
make[2]: *** [all] Error 2
/tmp/FC24_K4.9.13_GCC6.2.1/x86_64-native-linuxapp-clang/440c8c7090f740d2ad889733b7fdae92/dpdk/mk/rte.sdkinstall.mk:57: recipe for target 'pre_install' failed
make[1]: *** [pre_install] Error 2
/tmp/FC24_K4.9.13_GCC6.2.1/x86_64-native-linuxapp-clang/440c8c7090f740d2ad889733b7fdae92/dpdk/mk/rte.sdkroot.mk:79: recipe for target 'install' failed
make: *** [install] Error 2

*Failed Build #14:
OS: FC24
Target: x86_64-native-linuxapp-gcc-shared
  CC iotlb.o
  CC socket.o
  CC rte_event_timer_adapter.o
  CC vhost.o
/tmp/FC24_K4.9.13_GCC6.2.1/x86_64-native-linuxapp-gcc-shared/440c8c7090f740d2ad889733b7fdae92/dpdk/lib/librte_eventdev/rte_event_timer_adapter.c: In function ‘swtim_callback’:
/tmp/FC24_K4.9.13_GCC6.2.1/x86_64-native-linuxapp-gcc-shared/440c8c7090f740d2ad889733b7fdae92/dpdk/lib/librte_eventdev/rte_event_timer_adapter.c:573:3: warning: implicit declaration of function ‘rte_timer_alt_reset’ [-Wimplicit-function-declaration]
   rte_timer_alt_reset(sw->timer_data_id, tim, 0, SINGLE,
   ^~~~~~~~~~~~~~~~~~~
/tmp/FC24_K4.9.13_GCC6.2.1/x86_64-native-linuxapp-gcc-shared/440c8c7090f740d2ad889733b7fdae92/dpdk/lib/librte_eventdev/rte_event_timer_adapter.c:573:3: warning: nested extern declaration of ‘rte_timer_alt_reset’ [-Wnested-externs]
/tmp/FC24_K4.9.13_GCC6.2.1/x86_64-native-linuxapp-gcc-shared/440c8c7090f740d2ad889733b7fdae92/dpdk/lib/librte_eventdev/rte_event_timer_adapter.c: In function ‘swtim_service_func’:
/tmp/FC24_K4.9.13_GCC6.2.1/x86_64-native-linuxapp-gcc-shared/440c8c7090f740d2ad889733b7fdae92/dpdk/lib/librte_eventdev/rte_event_timer_adapter.c:690:3: warning: implicit declaration of function ‘rte_timer_alt_manage’ [-Wimplicit-function-declaration]
   rte_timer_alt_manage(sw->timer_data_id,
   ^~~~~~~~~~~~~~~~~~~~
/tmp/FC24_K4.9.13_GCC6.2.1/x86_64-native-linuxapp-gcc-shared/440c8c7090f740d2ad889733b7fdae92/dpdk/lib/librte_eventdev/rte_event_timer_adapter.c:690:3: warning: nested extern declaration of ‘rte_timer_alt_manage’ [-Wnested-externs]
/tmp/FC24_K4.9.13_GCC6.2.1/x86_64-native-linuxapp-gcc-shared/440c8c7090f740d2ad889733b7fdae92/dpdk/lib/librte_eventdev/rte_event_timer_adapter.c: In function ‘swtim_init’:
/tmp/FC24_K4.9.13_GCC6.2.1/x86_64-native-linuxapp-gcc-shared/440c8c7090f740d2ad889733b7fdae92/dpdk/lib/librte_eventdev/rte_event_timer_adapter.c:793:6: error: void value not ignored as it ought to be
  ret = rte_timer_subsystem_init();
      ^
/tmp/FC24_K4.9.13_GCC6.2.1/x86_64-native-linuxapp-gcc-shared/440c8c7090f740d2ad889733b7fdae92/dpdk/lib/librte_eventdev/rte_event_timer_adapter.c:802:8: warning: implicit declaration of function ‘rte_timer_data_alloc’ [-Wimplicit-function-declaration]
  ret = rte_timer_data_alloc(&sw->timer_data_id);
        ^~~~~~~~~~~~~~~~~~~~
/tmp/FC24_K4.9.13_GCC6.2.1/x86_64-native-linuxapp-gcc-shared/440c8c7090f740d2ad889733b7fdae92/dpdk/lib/librte_eventdev/rte_event_timer_adapter.c:802:2: warning: nested extern declaration of ‘rte_timer_data_alloc’ [-Wnested-externs]
  ret = rte_timer_data_alloc(&sw->timer_data_id);
  ^~~
/tmp/FC24_K4.9.13_GCC6.2.1/x86_64-native-linuxapp-gcc-shared/440c8c7090f740d2ad889733b7fdae92/dpdk/lib/librte_eventdev/rte_event_timer_adapter.c: In function ‘swtim_uninit’:
/tmp/FC24_K4.9.13_GCC6.2.1/x86_64-native-linuxapp-gcc-shared/440c8c7090f740d2ad889733b7fdae92/dpdk/lib/librte_eventdev/rte_event_timer_adapter.c:864:2: warning: implicit declaration of function ‘rte_timer_stop_all’ [-Wimplicit-function-declaration]
  rte_timer_stop_all(sw->timer_data_id,
  ^~~~~~~~~~~~~~~~~~
/tmp/FC24_K4.9.13_GCC6.2.1/x86_64-native-linuxapp-gcc-shared/440c8c7090f740d2ad889733b7fdae92/dpdk/lib/librte_eventdev/rte_event_timer_adapter.c:864:2: warning: nested extern declaration of ‘rte_timer_stop_all’ [-Wnested-externs]
/tmp/FC24_K4.9.13_GCC6.2.1/x86_64-native-linuxapp-gcc-shared/440c8c7090f740d2ad889733b7fdae92/dpdk/lib/librte_eventdev/rte_event_timer_adapter.c: In function ‘swtim_cancel_burst’:
/tmp/FC24_K4.9.13_GCC6.2.1/x86_64-native-linuxapp-gcc-shared/440c8c7090f740d2ad889733b7fdae92/dpdk/lib/librte_eventdev/rte_event_timer_adapter.c:1102:9: warning: implicit declaration of function ‘rte_timer_alt_stop’ [-Wimplicit-function-declaration]
   ret = rte_timer_alt_stop(sw->timer_data_id, timp);
         ^~~~~~~~~~~~~~~~~~
/tmp/FC24_K4.9.13_GCC6.2.1/x86_64-native-linuxapp-gcc-shared/440c8c7090f740d2ad889733b7fdae92/dpdk/lib/librte_eventdev/rte_event_timer_adapter.c:1102:3: warning: nested extern declaration of ‘rte_timer_alt_stop’ [-Wnested-externs]
   ret = rte_timer_alt_stop(sw->timer_data_id, timp);
   ^~~
/tmp/FC24_K4.9.13_GCC6.2.1/x86_64-native-linuxapp-gcc-shared/440c8c7090f740d2ad889733b7fdae92/dpdk/mk/internal/rte.compile-pre.mk:114: recipe for target 'rte_event_timer_adapter.o' failed
make[5]: *** [rte_event_timer_adapter.o] Error 1
/tmp/FC24_K4.9.13_GCC6.2.1/x86_64-native-linuxapp-gcc-shared/440c8c7090f740d2ad889733b7fdae92/dpdk/mk/rte.subdir.mk:35: recipe for target 'librte_eventdev' failed
make[4]: *** [librte_eventdev] Error 2
make[4]: *** Waiting for unfinished jobs....
  CC vhost_user.o
  CC virtio_net.o
  CC vdpa.o
  CC vhost_crypto.o
  LD librte_vhost.so.4.1
  INSTALL-LIB librte_vhost.so.4.1
/tmp/FC24_K4.9.13_GCC6.2.1/x86_64-native-linuxapp-gcc-shared/440c8c7090f740d2ad889733b7fdae92/dpdk/mk/rte.sdkbuild.mk:49: recipe for target 'lib' failed
make[3]: *** [lib] Error 2
/tmp/FC24_K4.9.13_GCC6.2.1/x86_64-native-linuxapp-gcc-shared/440c8c7090f740d2ad889733b7fdae92/dpdk/mk/rte.sdkroot.mk:100: recipe for target 'all' failed
make[2]: *** [all] Error 2
/tmp/FC24_K4.9.13_GCC6.2.1/x86_64-native-linuxapp-gcc-shared/440c8c7090f740d2ad889733b7fdae92/dpdk/mk/rte.sdkinstall.mk:57: recipe for target 'pre_install' failed
make[1]: *** [pre_install] Error 2
/tmp/FC24_K4.9.13_GCC6.2.1/x86_64-native-linuxapp-gcc-shared/440c8c7090f740d2ad889733b7fdae92/dpdk/mk/rte.sdkroot.mk:79: recipe for target 'install' failed
make: *** [install] Error 2

*Failed Build #15:
OS: FreeBSD
Target: x86_64-native-bsdapp-gcc
  CC rte_ipv4_fragmentation.o
  CC rte_ipv6_fragmentation.o
  CC rte_ipv4_reassembly.o
  CC rte_event_timer_adapter.o
/tmp/FreeBSD_K10.3_GCC4.8.5/x86_64-native-bsdapp-gcc/440c8c7090f740d2ad889733b7fdae92/dpdk/lib/librte_eventdev/rte_event_timer_adapter.c: In function 'swtim_callback':
/tmp/FreeBSD_K10.3_GCC4.8.5/x86_64-native-bsdapp-gcc/440c8c7090f740d2ad889733b7fdae92/dpdk/lib/librte_eventdev/rte_event_timer_adapter.c:573:3: warning: implicit declaration of function 'rte_timer_alt_reset'; did you mean 'rte_timer_reset'? [-Wimplicit-function-declaration]
   rte_timer_alt_reset(sw->timer_data_id, tim, 0, SINGLE,
   ^~~~~~~~~~~~~~~~~~~
   rte_timer_reset
/tmp/FreeBSD_K10.3_GCC4.8.5/x86_64-native-bsdapp-gcc/440c8c7090f740d2ad889733b7fdae92/dpdk/lib/librte_eventdev/rte_event_timer_adapter.c:573:3: warning: nested extern declaration of 'rte_timer_alt_reset' [-Wnested-externs]
/tmp/FreeBSD_K10.3_GCC4.8.5/x86_64-native-bsdapp-gcc/440c8c7090f740d2ad889733b7fdae92/dpdk/lib/librte_eventdev/rte_event_timer_adapter.c: In function 'swtim_service_func':
/tmp/FreeBSD_K10.3_GCC4.8.5/x86_64-native-bsdapp-gcc/440c8c7090f740d2ad889733b7fdae92/dpdk/lib/librte_eventdev/rte_event_timer_adapter.c:690:3: warning: implicit declaration of function 'rte_timer_alt_manage'; did you mean 'rte_timer_manage'? [-Wimplicit-function-declaration]
   rte_timer_alt_manage(sw->timer_data_id,
   ^~~~~~~~~~~~~~~~~~~~
   rte_timer_manage
/tmp/FreeBSD_K10.3_GCC4.8.5/x86_64-native-bsdapp-gcc/440c8c7090f740d2ad889733b7fdae92/dpdk/lib/librte_eventdev/rte_event_timer_adapter.c:690:3: warning: nested extern declaration of 'rte_timer_alt_manage' [-Wnested-externs]
/tmp/FreeBSD_K10.3_GCC4.8.5/x86_64-native-bsdapp-gcc/440c8c7090f740d2ad889733b7fdae92/dpdk/lib/librte_eventdev/rte_event_timer_adapter.c: In function 'swtim_init':
/tmp/FreeBSD_K10.3_GCC4.8.5/x86_64-native-bsdapp-gcc/440c8c7090f740d2ad889733b7fdae92/dpdk/lib/librte_eventdev/rte_event_timer_adapter.c:793:6: error: void value not ignored as it ought to be
  ret = rte_timer_subsystem_init();
      ^
/tmp/FreeBSD_K10.3_GCC4.8.5/x86_64-native-bsdapp-gcc/440c8c7090f740d2ad889733b7fdae92/dpdk/lib/librte_eventdev/rte_event_timer_adapter.c:802:8: warning: implicit declaration of function 'rte_timer_data_alloc'; did you mean 'rte_timer_dump_stats'? [-Wimplicit-function-declaration]
  ret = rte_timer_data_alloc(&sw->timer_data_id);
        ^~~~~~~~~~~~~~~~~~~~
        rte_timer_dump_stats
/tmp/FreeBSD_K10.3_GCC4.8.5/x86_64-native-bsdapp-gcc/440c8c7090f740d2ad889733b7fdae92/dpdk/lib/librte_eventdev/rte_event_timer_adapter.c:802:8: warning: nested extern declaration of 'rte_timer_data_alloc' [-Wnested-externs]
/tmp/FreeBSD_K10.3_GCC4.8.5/x86_64-native-bsdapp-gcc/440c8c7090f740d2ad889733b7fdae92/dpdk/lib/librte_eventdev/rte_event_timer_adapter.c: In function 'swtim_uninit':
/tmp/FreeBSD_K10.3_GCC4.8.5/x86_64-native-bsdapp-gcc/440c8c7090f740d2ad889733b7fdae92/dpdk/lib/librte_eventdev/rte_event_timer_adapter.c:864:2: warning: implicit declaration of function 'rte_timer_stop_all'; did you mean 'rte_timer_stop_sync'? [-Wimplicit-function-declaration]
  rte_timer_stop_all(sw->timer_data_id,
  ^~~~~~~~~~~~~~~~~~
  rte_timer_stop_sync
/tmp/FreeBSD_K10.3_GCC4.8.5/x86_64-native-bsdapp-gcc/440c8c7090f740d2ad889733b7fdae92/dpdk/lib/librte_eventdev/rte_event_timer_adapter.c:864:2: warning: nested extern declaration of 'rte_timer_stop_all' [-Wnested-externs]
  CC rte_ipv6_reassembly.o
/tmp/FreeBSD_K10.3_GCC4.8.5/x86_64-native-bsdapp-gcc/440c8c7090f740d2ad889733b7fdae92/dpdk/lib/librte_eventdev/rte_event_timer_adapter.c: In function 'swtim_cancel_burst':
/tmp/FreeBSD_K10.3_GCC4.8.5/x86_64-native-bsdapp-gcc/440c8c7090f740d2ad889733b7fdae92/dpdk/lib/librte_eventdev/rte_event_timer_adapter.c:1102:9: warning: implicit declaration of function 'rte_timer_alt_stop'; did you mean 'rte_timer_stop'? [-Wimplicit-function-declaration]
   ret = rte_timer_alt_stop(sw->timer_data_id, timp);
         ^~~~~~~~~~~~~~~~~~
         rte_timer_stop
/tmp/FreeBSD_K10.3_GCC4.8.5/x86_64-native-bsdapp-gcc/440c8c7090f740d2ad889733b7fdae92/dpdk/lib/librte_eventdev/rte_event_timer_adapter.c:1102:9: warning: nested extern declaration of 'rte_timer_alt_stop' [-Wnested-externs]
gmake[5]: *** [/tmp/FreeBSD_K10.3_GCC4.8.5/x86_64-native-bsdapp-gcc/440c8c7090f740d2ad889733b7fdae92/dpdk/mk/internal/rte.compile-pre.mk:116: rte_event_timer_adapter.o] Error 1
gmake[4]: *** [/tmp/FreeBSD_K10.3_GCC4.8.5/x86_64-native-bsdapp-gcc/440c8c7090f740d2ad889733b7fdae92/dpdk/mk/rte.subdir.mk:37: librte_eventdev] Error 2
gmake[4]: *** Waiting for unfinished jobs....
  CC rte_ip_frag_common.o
  CC ip_frag_internal.o

DPDK STV team


More information about the test-report mailing list