[dpdk-test-report] |FAILURE| pw46656[2/2] examples: sleep while waiting worker threads to terminate

sys_stv at intel.com sys_stv at intel.com
Thu Oct 11 21:12:13 CEST 2018


Test-Label: Intel-compilation
Test-Status: FAILURE
http://dpdk.org/patch/46656

_Compilation issues_

Submitter: Ferruh Yigit <ferruh.yigit at intel.com>
Date: 2018-10-11 19:57:53
DPDK git baseline: Repo:dpdk-master, CommitID: 911462eb4a5fc38b4e3581d167a1541207a69d5c

Build Summary: 15 Builds Done, 14 Successful, 1 Failures

Test environment and configuration as below:

OS: FC25
	Kernel Version: 4.5.5-300.fc24.x86_64
	CPU info: Intel(R) Xeon(R) CPU E5-2699 v3 @ 2.30GHz
	GCC Version: gcc (GCC) 6.1.1 20160510 (Red Hat 6.1.1-2)
	Clang Version: 3.8.0 (tags/RELEASE_380/final)
	x86_64-native-linuxapp-gcc
	x86_64-native-linuxapp-gcc-debug

OS: FC24
	Kernel Version: 4.9.13-100.fc24.x86_64
	CPU info: Intel(R) Xeon(R) CPU E5-2699 v3 @ 2.30GHz
	GCC Version: gcc (GCC) 6.2.1 20160916 (Red Hat 6.2.1-2)
	Clang Version: 3.8.0 (tags/RELEASE_380/final)
	x86_64-native-linuxapp-gcc-shared
	i686-native-linuxapp-gcc
	x86_64-native-linuxapp-clang

OS: CENTOS
	Kernel Version: 3.10.0-514.10.2.el7.x86_64
	CPU info: Intel(R) Xeon(R) CPU E5-2699 v3 @ 2.30GHz
	GCC Version: gcc (GCC) 4.8.5 20150623 (Red Hat 4.8.5-4)
	Clang Version: 3.4.2 (tags/RELEASE_34/dot2-final)
	x86_64-native-linuxapp-clang
	i686-native-linuxapp-gcc
	x86_64-native-linuxapp-gcc
	x86_64-native-linuxapp-gcc-shared

OS: UB1604
	Kernel Version: 4.4.0-137-generic
	CPU info: Intel(R) Xeon(R) CPU E5-2699 v3 @ 2.30GHz
	GCC Version: gcc (Ubuntu 5.4.0-6ubuntu1~16.04.10) 5.4.0 20160609
	Clang Version: 3.8.0-2ubuntu4 (tags/RELEASE_380/final)
	x86_64-native-linuxapp-gcc
	x86_64-native-linuxapp-clang
	i686-native-linuxapp-gcc
	x86_64-native-linuxapp-gcc-shared

OS: FreeBSD
	Kernel Version: 10.3-RELEASE
	CPU info: cat: /proc/cpuinfo: No such file or directory
	GCC Version: gcc (FreeBSD Ports Collection) 7.3.0
	Clang Version: 3.4.1 (tags/RELEASE_34/dot1-final 208032) 20140512
	x86_64-native-bsdapp-clang
	x86_64-native-bsdapp-gcc

*Failed Build #1:
OS: FC24
Target: x86_64-native-linuxapp-gcc-shared
  SYMLINK-FILE include/exec-env/rte_kni_common.h
  CC eal.o
  CC eal_cpuflags.o
  CC eal_hugepage_info.o
  CC eal_memory.o
/tmp/FC24_K4.9.13_GCC6.2.1/x86_64-native-linuxapp-gcc-shared/9c9f9fb964694c61a487afdeb0f39b9b/dpdk/lib/librte_eal/linuxapp/eal/eal_memory.c:28:18: fatal error: numa.h: No such file or directory
 #include <numa.h>
                  ^
compilation terminated.
/tmp/FC24_K4.9.13_GCC6.2.1/x86_64-native-linuxapp-gcc-shared/9c9f9fb964694c61a487afdeb0f39b9b/dpdk/mk/internal/rte.compile-pre.mk:114: recipe for target 'eal_memory.o' failed
make[7]: *** [eal_memory.o] Error 1
make[7]: *** Waiting for unfinished jobs....
/tmp/FC24_K4.9.13_GCC6.2.1/x86_64-native-linuxapp-gcc-shared/9c9f9fb964694c61a487afdeb0f39b9b/dpdk/mk/rte.subdir.mk:35: recipe for target 'eal' failed
make[6]: *** [eal] Error 2
/tmp/FC24_K4.9.13_GCC6.2.1/x86_64-native-linuxapp-gcc-shared/9c9f9fb964694c61a487afdeb0f39b9b/dpdk/mk/rte.subdir.mk:35: recipe for target 'linuxapp' failed
make[5]: *** [linuxapp] Error 2
/tmp/FC24_K4.9.13_GCC6.2.1/x86_64-native-linuxapp-gcc-shared/9c9f9fb964694c61a487afdeb0f39b9b/dpdk/mk/rte.subdir.mk:35: recipe for target 'librte_eal' failed
make[4]: *** [librte_eal] Error 2
/tmp/FC24_K4.9.13_GCC6.2.1/x86_64-native-linuxapp-gcc-shared/9c9f9fb964694c61a487afdeb0f39b9b/dpdk/mk/rte.sdkbuild.mk:49: recipe for target 'lib' failed
make[3]: *** [lib] Error 2
/tmp/FC24_K4.9.13_GCC6.2.1/x86_64-native-linuxapp-gcc-shared/9c9f9fb964694c61a487afdeb0f39b9b/dpdk/mk/rte.sdkroot.mk:100: recipe for target 'all' failed
make[2]: *** [all] Error 2
/tmp/FC24_K4.9.13_GCC6.2.1/x86_64-native-linuxapp-gcc-shared/9c9f9fb964694c61a487afdeb0f39b9b/dpdk/mk/rte.sdkinstall.mk:57: recipe for target 'pre_install' failed
make[1]: *** [pre_install] Error 2
/tmp/FC24_K4.9.13_GCC6.2.1/x86_64-native-linuxapp-gcc-shared/9c9f9fb964694c61a487afdeb0f39b9b/dpdk/mk/rte.sdkroot.mk:79: recipe for target 'install' failed
make: *** [install] Error 2

DPDK STV team


More information about the test-report mailing list