[dpdk-test-report] |FAILURE| pw51926[v2, 15/15] drivers/raw/ifpga_rawdev: add IPN3KE support for IFPGA Rawdev

sys_stv at intel.com sys_stv at intel.com
Mon Apr 1 11:22:39 CEST 2019


Test-Label: Intel-compilation
Test-Status: FAILURE
http://dpdk.org/patch/51926

_Compilation issues_

Submitter: Rosen Xu <rosen.xu at intel.com>
Date: 2019-03-29 15:58:19
Reply_mail: 1553875099-166351-16-git-send-email-rosen.xu at intel.com
DPDK git baseline: Repo:dpdk-master, CommitID: a2fe4c1b3803f3b4c060c03fd51fdc376c05ec43

Build Summary: 26 Builds Done, 0 Successful, 26 Failures

Test environment and configuration as below:

OS: SUSE15
	Kernel Version: 4.12.14-lp150.12.22-default
	CPU info: Intel(R) Xeon(R) CPU E5-2699 v3 @ 2.30GHz
	GCC Version: gcc (SUSE Linux) 7.3.1 20180323 [gcc-7-branch revision 258812]
	Clang Version: 5.0.1 (tags/RELEASE_501/final 312548)
	x86_64-native-linuxapp-gcc

OS: CENTOS76
	Kernel Version: 3.10.0-957.5.1.el7.x86_64
	CPU info: Intel(R) Xeon(R) CPU E5-2699 v4 @ 2.20GHz
	GCC Version: gcc (GCC) 4.8.5 20150623 (Red Hat 4.8.5-36)
	Clang Version: 3.4.2 (tags/RELEASE_34/dot2-final)
	x86_64-native-linuxapp-gcc

OS: UBT144-32
	Kernel Version: 3.13.0-161-generic
	CPU info: Intel(R) Xeon(R) CPU E5-2699 v3 @ 2.30GHz
	GCC Version: gcc (Ubuntu 4.8.4-2ubuntu1~14.04.4) 4.8.4
	Clang Version: NA
	i686-native-linuxapp-gcc

OS: UBT164-32
	Kernel Version: 4.4.0-131-generic
	CPU info: Intel(R) Xeon(R) CPU E5-2699 v3 @ 2.30GHz
	GCC Version: gcc (Ubuntu 5.4.0-6ubuntu1~16.04.10) 5.4.0 20160609
	Clang Version: NA
	i686-native-linuxapp-gcc

OS: SUSE12
	Kernel Version: 4.4.73-5-default
	CPU info: Intel(R) Xeon(R) CPU E5-2699 v4 @ 2.20GHz
	GCC Version: gcc (SUSE Linux) 7.1.1 20170607 [gcc-7-branch revision 248970]
	Clang Version: 3.8.0 (tags/RELEASE_380/final 262553)
	x86_64-native-linuxapp-gcc

OS: FreeBSD12.0
	Kernel Version: 12.0-RC3
	CPU info: Intel(R) Xeon(R) CPU E5-2699 v3 @ 2.30GHz (2294.75-MHz K8-class CPU)
	GCC Version: gcc (FreeBSD Ports Collection) 7.3.0
	Clang Version: 6.0.1 (tags/RELEASE_601/final 335540) (based on LLVM 6.0.1)
	x86_64-native-bsdapp-clang
	x86_64-native-bsdapp-gcc

OS: UBT144-64
	Kernel Version: 4.2.0-27-generic
	CPU info: Intel(R) Xeon(R) CPU E5-2699 v3 @ 2.30GHz
	GCC Version: gcc (Ubuntu 4.8.4-2ubuntu1~14.04.4) 4.8.4
	Clang Version: 3.4-1ubuntu3 (tags/RELEASE_34/final) (based on LLVM 3.4)
	x86_64-native-linuxapp-gcc

OS: CENTOS75
	Kernel Version: 3.10.0-957.5.1.el7.x86_64
	CPU info: Intel(R) Xeon(R) CPU E5-2699 v4 @ 2.20GHz
	GCC Version: gcc (GCC) 4.8.5 20150623 (Red Hat 4.8.5-36)
	Clang Version: 3.4.2 (tags/RELEASE_34/dot2-final)
	x86_64-native-linuxapp-gcc

OS: UBT1804
	Kernel Version: 4.15.0-20-generic
	CPU info: Intel(R) Xeon(R) CPU E5-2699 v3 @ 2.30GHz
	GCC Version: gcc (Ubuntu 7.3.0-27ubuntu1~18.04) 7.3.0
	Clang Version: 6.0.0-1ubuntu2 (tags/RELEASE_600/final)
	x86_64-native-linuxapp-gcc
	x86_64-native-linuxapp-clang
	x86_64-native-linuxapp-icc

OS: UBT1810
	Kernel Version: 4.18.0-10-generic
	CPU info: Intel(R) Xeon(R) CPU E5-2699 v3 @ 2.30GHz
	GCC Version: gcc (Ubuntu 8.2.0-7ubuntu1) 8.2.0
	Clang Version: 7.0.0-3 (tags/RELEASE_700/final)
	x86_64-native-linuxapp-gcc

OS: RHEL74
	Kernel Version: 3.10.0-693.el7.x86_64
	CPU info: Intel(R) Xeon(R) CPU E5-2699 v4 @ 2.20GHz
	GCC Version: gcc (GCC) 4.8.5 20150623 (Red Hat 4.8.5-16)
	Clang Version: NA
	x86_64-native-linuxapp-gcc

OS: CENTOS74
	Kernel Version: 3.10.0-862.14.4.el7.x86_64
	CPU info: Intel(R) Xeon(R) CPU E5-2699 v4 @ 2.20GHz
	GCC Version: gcc (GCC) 4.8.5 20150623 (Red Hat 4.8.5-28)
	Clang Version: 3.4.2 (tags/RELEASE_34/dot2-final)
	x86_64-native-linuxapp-gcc

OS: FreeBSD11.2
	Kernel Version: 11.2-RELEASE
	CPU info: Intel(R) Xeon(R) CPU E5-2699 v3 @ 2.30GHz (2294.74-MHz K8-class CPU)
	GCC Version: gcc (FreeBSD Ports Collection) 6.4.0
	Clang Version: 6.0.0 (tags/RELEASE_600/final 326565) (based on LLVM 6.0.0)
	x86_64-native-bsdapp-gcc
	x86_64-native-bsdapp-clang

OS: UBT164-64
	Kernel Version: 4.4.0-47-generic
	CPU info: Intel(R) Xeon(R) CPU E5-2699 v3 @ 2.30GHz
	GCC Version: gcc (Ubuntu 5.4.0-6ubuntu1~16.04.10) 5.4.0 20160609
	Clang Version: 3.8.0-2ubuntu4 (tags/RELEASE_380/final)
	x86_64-native-linuxapp-gcc

OS: FC28
	Kernel Version: 4.16.3-301.fc28.x86_64
	CPU info: Intel(R) Xeon(R) CPU E5-2699 v4 @ 2.20GHz
	GCC Version: gcc (GCC) 8.1.1 20180712 (Red Hat 8.1.1-5)
	Clang Version: 6.0.1 (tags/RELEASE_601/final)
	x86_64-native-linuxapp-gcc
	x86_64-native-linuxapp-clang
	x86_64-native-linuxapp-icc

OS: RHEL76
	Kernel Version: 3.10.0-957.el7.x86_64
	CPU info: Intel(R) Xeon(R) CPU E5-2699 v4 @ 2.20GHz
	GCC Version: gcc (GCC) 4.8.5 20150623 (Red Hat 4.8.5-36)
	Clang Version: NA
	x86_64-native-linuxapp-gcc

OS: FC29
	Kernel Version: 4.18.16-300.fc29.x86_64
	CPU info: Intel(R) Xeon(R) CPU E5-2699 v4 @ 2.20GHz
	GCC Version: gcc (GCC) 8.2.1 20181215 (Red Hat 8.2.1-6)
	Clang Version: NA
	x86_64-native-linuxapp-gcc
	x86_64-native-linuxapp-clang
	x86_64-native-linuxapp-icc

OS: RHEL75
	Kernel Version: 3.10.0-862.el7.x86_64
	CPU info: Intel(R) Xeon(R) CPU E5-2699 v4 @ 2.20GHz
	GCC Version: gcc (GCC) 4.8.5 20150623 (Red Hat 4.8.5-28)
	Clang Version: NA
	x86_64-native-linuxapp-gcc

*Failed Build #1:
OS: UBT144-64
Target: x86_64-native-linuxapp-gcc
  CC rte_hypervisor.o
  CC rte_spinlock.o
  CC rte_cycles.o
  AR librte_eal.a
  INSTALL-LIB librte_eal.a
make[7]: warning:  Clock skew detected.  Your build may be incomplete.
== Build lib/librte_pci
== Build lib/librte_ring
== Build lib/librte_timer
== Build lib/librte_meter
== Build lib/librte_cmdline
--
  CC rte_mbuf.o
  CC rte_mbuf_ptype.o
  CC rte_mbuf_pool_ops.o
  AR librte_mbuf.a
  INSTALL-LIB librte_mbuf.a
make[5]: warning:  Clock skew detected.  Your build may be incomplete.
== Build lib/librte_net
== Build lib/librte_bbdev
== Build lib/librte_cryptodev
== Build lib/librte_compressdev
== Build lib/librte_reorder
--
  INSTALL-LIB librte_reorder.a
== Build lib/librte_lpm
== Build lib/librte_member
  AR librte_net.a
  INSTALL-LIB librte_net.a
make[5]: warning:  Clock skew detected.  Your build may be incomplete.
== Build lib/librte_sched
== Build lib/librte_ethdev
  SYMLINK-FILE include/rte_efd.h
  CC rte_efd.o
  AR librte_bbdev.a
--
  INSTALL-LIB librte_member.a
  AR librte_sched.a
  INSTALL-LIB librte_sched.a
  AR librte_ethdev.a
  INSTALL-LIB librte_ethdev.a
make[5]: warning:  Clock skew detected.  Your build may be incomplete.
== Build lib/librte_security
== Build lib/librte_eventdev
== Build lib/librte_rawdev
== Build lib/librte_vhost
== Build lib/librte_ip_frag
--
  SYMLINK-FILE include/rte_port_fd.h
  CC vhost_user.o
  AR librte_ipsec.a
  INSTALL-LIB librte_ipsec.a
  SYMLINK-FILE include/rte_port_kni.h
make[5]: warning:  Clock skew detected.  Your build may be incomplete.
  SYMLINK-FILE include/rte_port_source_sink.h
  CC virtio_net.o
  SYMLINK-FILE include/rte_port_sym_crypto.h
  CC vdpa.o
  CC rte_port_ethdev.o
--
  CC linux/vmbus_bus.o
  CC linux/vmbus_uio.o
  AR librte_bus_ifpga.a
  INSTALL-LIB librte_bus_ifpga.a
  MODPOST 1 modules
make[6]: warning:  Clock skew detected.  Your build may be incomplete.
  CC qbman/qbman_debug.o
  CC vmbus_common.o
  CC vdev_params.o
  CC vmbus_channel.o
  CC base/fman/fman_hw.o
--
  INSTALL-LIB librte_pmd_caam_jr.a
  CC ice_switch.o
  CC iavf_rxtx.o
  AR librte_pmd_ipn3ke.a
  INSTALL-LIB librte_pmd_ipn3ke.a
make[6]: warning:  Clock skew detected.  Your build may be incomplete.
== Build drivers/net/netvsc
  CC virtqueue.o
  CC lio_ethdev.o
  CC virtio_pci.o
  CC hn_ethdev.o
--
  CC medford2_nic.o
  AR librte_pmd_sfc_efx.a
  INSTALL-LIB librte_pmd_sfc_efx.a
  AR librte_pmd_softnic.a
  INSTALL-LIB librte_pmd_softnic.a
make[5]: warning:  Clock skew detected.  Your build may be incomplete.
== Build drivers/event
== Build drivers/event/dsw
== Build drivers/event/skeleton
== Build drivers/event/sw
== Build drivers/event/octeontx
--
  CC ifpga_fme_iperf.o
  CC ifpga_fme_dperf.o
  PMDINFO dpaa2_cmdif.o.pmd.c
  CC dpaa2_cmdif.o.pmd.o
  LD dpaa2_cmdif.o
  CC ifpga_fme_error.o
  PMDINFO skeleton_rawdev.o.pmd.c
  CC skeleton_rawdev.o.pmd.o
  CC ifpga_port.o
  AR librte_pmd_dpaa2_cmdif.a
  LD skeleton_rawdev.o
  INSTALL-LIB librte_pmd_dpaa2_cmdif.a
  CC ifpga_port_error.o
  PMDINFO dpaa2_qdma.o.pmd.c
  CC dpaa2_qdma.o.pmd.o
  CC opae_hw_api.o
  CC opae_ifpga_hw_api.o
  LD dpaa2_qdma.o
--
  CC ifpga_fme_pr.o
  CC opae_spi.o
  CC opae_spi_transaction.o
  CC opae_intel_max10.o
  CC opae_i2c.o
/tmp/UBT144-64_K4.2.0_GCC4.8.4/x86_64-native-linuxapp-gcc/fc7ae441052f49ad94251bf385f2ff6f/dpdk/drivers/raw/ifpga_rawdev/base/opae_intel_max10.c:6:20: fatal error: libfdt.h: No such file or directory
 #include <libfdt.h>
                    ^
compilation terminated.
  CC opae_at24_eeprom.o
make[6]: *** [opae_intel_max10.o] Error 1

*Failed Build #2:
OS: UBT164-64
Target: x86_64-native-linuxapp-gcc
  CC rte_hypervisor.o
  CC rte_spinlock.o
  CC rte_cycles.o
  AR librte_eal.a
  INSTALL-LIB librte_eal.a
make[7]: warning:  Clock skew detected.  Your build may be incomplete.
== Build lib/librte_ring
== Build lib/librte_jobstats
== Build lib/librte_cmdline
== Build lib/librte_pci
== Build lib/librte_meter
--
  CC rte_mbuf_pool_ops.o
  AR librte_acl.a
  INSTALL-LIB librte_acl.a
  AR librte_mbuf.a
  INSTALL-LIB librte_mbuf.a
make[5]: warning:  Clock skew detected.  Your build may be incomplete.
== Build lib/librte_net
== Build lib/librte_bbdev
== Build lib/librte_cryptodev
== Build lib/librte_compressdev
== Build lib/librte_reorder
--
== Build lib/librte_member
  AR librte_cryptodev.a
  INSTALL-LIB librte_cryptodev.a
  AR librte_net.a
  INSTALL-LIB librte_net.a
make[5]: warning:  Clock skew detected.  Your build may be incomplete.
== Build lib/librte_sched
== Build lib/librte_ethdev
  AR librte_reorder.a
  INSTALL-LIB librte_reorder.a
  SYMLINK-FILE include/rte_efd.h
--
  INSTALL-LIB librte_member.a
  AR librte_sched.a
  INSTALL-LIB librte_sched.a
  AR librte_ethdev.a
  INSTALL-LIB librte_ethdev.a
make[5]: warning:  Clock skew detected.  Your build may be incomplete.
== Build lib/librte_eventdev
== Build lib/librte_latencystats
== Build lib/librte_vhost
== Build lib/librte_rawdev
== Build lib/librte_gro
--
  AR librte_gso.a
  INSTALL-LIB librte_gso.a
  CC rte_event_crypto_adapter.o
  AR librte_ipsec.a
  INSTALL-LIB librte_ipsec.a
make[5]: warning:  Clock skew detected.  Your build may be incomplete.
  CC rte_event_eth_tx_adapter.o
  SYMLINK-FILE include/rte_port.h
  SYMLINK-FILE include/rte_port_ethdev.h
  SYMLINK-FILE include/rte_port_ring.h
  SYMLINK-FILE include/rte_port_frag.h
--
  CC base/fman/of.o
  AR librte_bus_ifpga.a
  INSTALL-LIB librte_bus_ifpga.a
  CC linux/pci_uio.o
  CC      /tmp/UBT164-64_K4.4.0_GCC5.4.0/x86_64-native-linuxapp-gcc/fc7ae441052f49ad94251bf385f2ff6f/dpdk/x86_64-native-linuxapp-gcc/build/kernel/linux/igb_uio/igb_uio.mod.o
make[6]: warning:  Clock skew detected.  Your build may be incomplete.
  CC linux/pci_vfio.o
  CC vmbus_common_uio.o
  CC base/fman/netcfg_layer.o
  CC mc/dpio.o
  CC base/qbman/process.o
--
  CC ixgbe_82599.o
  CC bnxt_filter.o
  CC ice_dcb.o
  AR librte_pmd_ipn3ke.a
  INSTALL-LIB librte_pmd_ipn3ke.a
make[6]: warning:  Clock skew detected.  Your build may be incomplete.
== Build drivers/net/null
  CC hn_rndis.o
  CC lio_23xx_vf.o
  CC bnxt_flow.o
  CC ice_fdir.o
--
  CC medford2_nic.o
  AR librte_pmd_ixgbe.a
  INSTALL-LIB librte_pmd_ixgbe.a
  AR librte_pmd_sfc_efx.a
  INSTALL-LIB librte_pmd_sfc_efx.a
make[5]: warning:  Clock skew detected.  Your build may be incomplete.
== Build drivers/event
== Build drivers/event/opdl
== Build drivers/event/dpaa2
== Build drivers/event/skeleton
== Build drivers/event/dpaa
--
  PMDINFO dpaa2_cmdif.o.pmd.c
  CC dpaa2_cmdif.o.pmd.o
  LD dpaa2_cmdif.o
  AR librte_pmd_dpaa2_cmdif.a
  INSTALL-LIB librte_pmd_dpaa2_cmdif.a
  CC ifpga_fme_error.o
  CC ifpga_port.o
  CC ifpga_port_error.o
  PMDINFO skeleton_rawdev.o.pmd.c
  CC skeleton_rawdev.o.pmd.o
  LD skeleton_rawdev.o
  CC opae_hw_api.o
  CC opae_ifpga_hw_api.o
--
  CC opae_intel_max10.o
  CC opae_i2c.o
  CC opae_at24_eeprom.o
  CC opae_eth_group.o
  CC ifpga_rawdev.o
/tmp/UBT164-64_K4.4.0_GCC5.4.0/x86_64-native-linuxapp-gcc/fc7ae441052f49ad94251bf385f2ff6f/dpdk/drivers/raw/ifpga_rawdev/base/opae_intel_max10.c:6:20: fatal error: libfdt.h: No such file or directory
compilation terminated.
/tmp/UBT164-64_K4.4.0_GCC5.4.0/x86_64-native-linuxapp-gcc/fc7ae441052f49ad94251bf385f2ff6f/dpdk/mk/internal/rte.compile-pre.mk:114: recipe for target 'opae_intel_max10.o' failed
make[6]: *** [opae_intel_max10.o] Error 1
make[6]: *** Waiting for unfinished jobs....
  AR librte_pmd_dpaa2_qdma.a
  INSTALL-LIB librte_pmd_dpaa2_qdma.a
  PMDINFO ifpga_rawdev.o.pmd.c
  CC ifpga_rawdev.o.pmd.o
  LD ifpga_rawdev.o
/tmp/UBT164-64_K4.4.0_GCC5.4.0/x86_64-native-linuxapp-gcc/fc7ae441052f49ad94251bf385f2ff6f/dpdk/mk/rte.subdir.mk:35: recipe for target 'ifpga_rawdev' failed
make[5]: *** [ifpga_rawdev] Error 2
/tmp/UBT164-64_K4.4.0_GCC5.4.0/x86_64-native-linuxapp-gcc/fc7ae441052f49ad94251bf385f2ff6f/dpdk/mk/rte.subdir.mk:35: recipe for target 'raw' failed
make[4]: *** [raw] Error 2
/tmp/UBT164-64_K4.4.0_GCC5.4.0/x86_64-native-linuxapp-gcc/fc7ae441052f49ad94251bf385f2ff6f/dpdk/mk/rte.sdkbuild.mk:46: recipe for target 'drivers' failed
make[3]: *** [drivers] Error 2
/tmp/UBT164-64_K4.4.0_GCC5.4.0/x86_64-native-linuxapp-gcc/fc7ae441052f49ad94251bf385f2ff6f/dpdk/mk/rte.sdkroot.mk:98: recipe for target 'all' failed
make[2]: *** [all] Error 2
/tmp/UBT164-64_K4.4.0_GCC5.4.0/x86_64-native-linuxapp-gcc/fc7ae441052f49ad94251bf385f2ff6f/dpdk/mk/rte.sdkinstall.mk:60: recipe for target 'pre_install' failed
make[1]: *** [pre_install] Error 2
/tmp/UBT164-64_K4.4.0_GCC5.4.0/x86_64-native-linuxapp-gcc/fc7ae441052f49ad94251bf385f2ff6f/dpdk/mk/rte.sdkroot.mk:77: recipe for target 'install' failed
make: *** [install] Error 2

*Failed Build #3:
OS: UBT164-32
Target: i686-native-linuxapp-gcc
  CC rte_hypervisor.o
  CC rte_spinlock.o
  CC rte_cycles.o
  AR librte_eal.a
  INSTALL-LIB librte_eal.a
make[7]: warning:  Clock skew detected.  Your build may be incomplete.
== Build lib/librte_jobstats
== Build lib/librte_cmdline
== Build lib/librte_metrics
== Build lib/librte_timer
== Build lib/librte_pci
--
  CC rte_mbuf.o
  CC rte_mbuf_ptype.o
  CC rte_mbuf_pool_ops.o
  AR librte_mbuf.a
  INSTALL-LIB librte_mbuf.a
make[5]: warning:  Clock skew detected.  Your build may be incomplete.
== Build lib/librte_compressdev
== Build lib/librte_reorder
== Build lib/librte_cryptodev
== Build lib/librte_net
== Build lib/librte_bbdev
--
  INSTALL-LIB librte_member.a
  AR librte_bbdev.a
  INSTALL-LIB librte_bbdev.a
  AR librte_net.a
  INSTALL-LIB librte_net.a
make[5]: warning:  Clock skew detected.  Your build may be incomplete.
== Build lib/librte_sched
== Build lib/librte_ethdev
  SYMLINK-FILE include/rte_sched.h
  SYMLINK-FILE include/rte_sched_common.h
  SYMLINK-FILE include/rte_red.h
--
  CC ethdev_profile.o
  AR librte_sched.a
  INSTALL-LIB librte_sched.a
  AR librte_ethdev.a
  INSTALL-LIB librte_ethdev.a
make[5]: warning:  Clock skew detected.  Your build may be incomplete.
== Build lib/librte_latencystats
== Build lib/librte_gro
== Build lib/librte_rawdev
== Build lib/librte_ip_frag
== Build lib/librte_eventdev
--
  CC rte_event_crypto_adapter.o
  CC gso_udp4.o
  CC rte_event_eth_tx_adapter.o
  AR librte_ipsec.a
  INSTALL-LIB librte_ipsec.a
make[5]: warning:  Clock skew detected.  Your build may be incomplete.
  CC bpf_pkt.o
  CC bpf_validate.o
  AR librte_gso.a
  INSTALL-LIB librte_gso.a
  CC rte_port_ring.o
--
  CC vmbus_common.o
  CC base/fman/fman_hw.o
  AR librte_bus_ifpga.a
  INSTALL-LIB librte_bus_ifpga.a
  CC mc/dpio.o
make[6]: warning:  Clock skew detected.  Your build may be incomplete.
  CC base/fman/of.o
  CC base/fman/netcfg_layer.o
  CC mc/mc_sys.o
  LD [M]  /tmp/UBT164-32_K4.4.0_GCC5.4.0/i686-native-linuxapp-gcc/fc7ae441052f49ad94251bf385f2ff6f/dpdk/i686-native-linuxapp-gcc/build/kernel/linux/igb_uio/igb_uio.ko
INSTALL-MODULE igb_uio.ko
--
  CC ipn3ke_ethdev.o
  CC failsafe_ether.o
  CC fm10k_common.o
  CC ice_sched.o
/tmp/UBT164-32_K4.4.0_GCC5.4.0/i686-native-linuxapp-gcc/fc7ae441052f49ad94251bf385f2ff6f/dpdk/drivers/net/ipn3ke/ipn3ke_ethdev.c: In function ‘ipn3ke_indirect_read’:
/tmp/UBT164-32_K4.4.0_GCC5.4.0/i686-native-linuxapp-gcc/fc7ae441052f49ad94251bf385f2ff6f/dpdk/drivers/net/ipn3ke/ipn3ke_ethdev.c:68:19: warning: cast to pointer from integer of different size [-Wint-to-pointer-cast]
  indirect_addrs = (volatile void *)(base_addr | 0x10);
                   ^
/tmp/UBT164-32_K4.4.0_GCC5.4.0/i686-native-linuxapp-gcc/fc7ae441052f49ad94251bf385f2ff6f/dpdk/drivers/net/ipn3ke/ipn3ke_ethdev.c:76:19: warning: cast to pointer from integer of different size [-Wint-to-pointer-cast]
  indirect_addrs = (volatile void *)(base_addr | 0x18);
                   ^
/tmp/UBT164-32_K4.4.0_GCC5.4.0/i686-native-linuxapp-gcc/fc7ae441052f49ad94251bf385f2ff6f/dpdk/drivers/net/ipn3ke/ipn3ke_ethdev.c: In function ‘ipn3ke_indirect_write’:
/tmp/UBT164-32_K4.4.0_GCC5.4.0/i686-native-linuxapp-gcc/fc7ae441052f49ad94251bf385f2ff6f/dpdk/drivers/net/ipn3ke/ipn3ke_ethdev.c:118:19: warning: cast to pointer from integer of different size [-Wint-to-pointer-cast]
  indirect_addrs = (volatile void *)(base_addr | 0x10);
                   ^
  CC fm10k_mbx.o
  SYMLINK-FILE include/rte_pmd_ixgbe.h
  CC i40e_diag.o
--
  CC ipn3ke_representor.o
  CC failsafe_flow.o
  CC ipn3ke_tm.o
In file included from /tmp/UBT164-32_K4.4.0_GCC5.4.0/i686-native-linuxapp-gcc/fc7ae441052f49ad94251bf385f2ff6f/dpdk/drivers/net/ipn3ke/ipn3ke_representor.c:25:0:
/tmp/UBT164-32_K4.4.0_GCC5.4.0/i686-native-linuxapp-gcc/fc7ae441052f49ad94251bf385f2ff6f/dpdk/drivers/net/ipn3ke/ipn3ke_representor.c: In function ‘ipn3ke_update_link’:
/tmp/UBT164-32_K4.4.0_GCC5.4.0/i686-native-linuxapp-gcc/fc7ae441052f49ad94251bf385f2ff6f/dpdk/drivers/net/ipn3ke/ipn3ke_logs.h:13:49: warning: format ‘%lx’ expects argument of type ‘long unsigned int’, but argument 4 has type ‘uint64_t {aka long long unsigned int}’ [-Wformat=]
  rte_log(RTE_LOG_ ## level, ipn3ke_afu_logtype, "ipn3ke_afu: " fmt, \
                                                 ^
/tmp/UBT164-32_K4.4.0_GCC5.4.0/i686-native-linuxapp-gcc/fc7ae441052f49ad94251bf385f2ff6f/dpdk/drivers/net/ipn3ke/ipn3ke_logs.h:19:2: note: in expansion of macro ‘IPN3KE_AFU_PMD_LOG’
  IPN3KE_AFU_PMD_LOG(DEBUG, fmt, ## args)
  ^
--
  CC scheduler_pkt_size_distr.o
  CC lio_ethdev.o
  AR librte_pmd_ipn3ke.a
  INSTALL-LIB librte_pmd_ipn3ke.a
  CC i40e_nvm.o
make[6]: warning:  Clock skew detected.  Your build may be incomplete.
  CC i40e_dcb.o
  CC i40e_ethdev.o
  CC em_ethdev.o
  CC ice_switch.o
  AR librte_pmd_fm10k.a
--
  LD qede_ethdev.o
  AR librte_pmd_softnic.a
  INSTALL-LIB librte_pmd_softnic.a
  AR librte_pmd_qede.a
  INSTALL-LIB librte_pmd_qede.a
make[5]: warning:  Clock skew detected.  Your build may be incomplete.
== Build drivers/event
== Build drivers/event/octeontx
== Build drivers/event/skeleton
== Build drivers/event/opdl
== Build drivers/event/dsw
--
  PMDINFO dpaa2_cmdif.o.pmd.c
  CC dpaa2_cmdif.o.pmd.o
  LD dpaa2_cmdif.o
  AR librte_pmd_dpaa2_cmdif.a
  INSTALL-LIB librte_pmd_dpaa2_cmdif.a
  CC ifpga_fme_error.o
  PMDINFO skeleton_rawdev.o.pmd.c
  CC skeleton_rawdev.o.pmd.o
  LD skeleton_rawdev.o
  CC ifpga_port.o
  CC ifpga_port_error.o
  CC opae_hw_api.o
  CC opae_ifpga_hw_api.o
  CC opae_debug.o
  PMDINFO dpaa2_qdma.o.pmd.c
  CC dpaa2_qdma.o.pmd.o
--
  CC opae_at24_eeprom.o
  AR librte_pmd_dpaa2_qdma.a
  CC opae_eth_group.o
  INSTALL-LIB librte_pmd_dpaa2_qdma.a
  CC ifpga_rawdev.o
/tmp/UBT164-32_K4.4.0_GCC5.4.0/i686-native-linuxapp-gcc/fc7ae441052f49ad94251bf385f2ff6f/dpdk/drivers/raw/ifpga_rawdev/base/opae_intel_max10.c:6:20: fatal error: libfdt.h: No such file or directory
compilation terminated.
/tmp/UBT164-32_K4.4.0_GCC5.4.0/i686-native-linuxapp-gcc/fc7ae441052f49ad94251bf385f2ff6f/dpdk/mk/internal/rte.compile-pre.mk:114: recipe for target 'opae_intel_max10.o' failed
make[6]: *** [opae_intel_max10.o] Error 1
make[6]: *** Waiting for unfinished jobs....
/tmp/UBT164-32_K4.4.0_GCC5.4.0/i686-native-linuxapp-gcc/fc7ae441052f49ad94251bf385f2ff6f/dpdk/drivers/raw/ifpga_rawdev/ifpga_rawdev.c: In function ‘ifgpa_rawdev_get_attr’:
/tmp/UBT164-32_K4.4.0_GCC5.4.0/i686-native-linuxapp-gcc/fc7ae441052f49ad94251bf385f2ff6f/dpdk/drivers/raw/ifpga_rawdev/ifpga_rawdev.c:484:17: warning: cast from pointer to integer of different size [-Wpointer-to-int-cast]
   *attr_value = (uint64_t)opae_eth_grp_reg_info.addr;
                 ^
/tmp/UBT164-32_K4.4.0_GCC5.4.0/i686-native-linuxapp-gcc/fc7ae441052f49ad94251bf385f2ff6f/dpdk/drivers/raw/ifpga_rawdev/ifpga_rawdev.c:522:17: warning: cast from pointer to integer of different size [-Wpointer-to-int-cast]
   *attr_value = (uint64_t)opae_eth_grp_reg_info.addr;
                 ^
  PMDINFO ifpga_rawdev.o.pmd.c
  CC ifpga_rawdev.o.pmd.o
  LD ifpga_rawdev.o
/tmp/UBT164-32_K4.4.0_GCC5.4.0/i686-native-linuxapp-gcc/fc7ae441052f49ad94251bf385f2ff6f/dpdk/mk/rte.subdir.mk:35: recipe for target 'ifpga_rawdev' failed
make[5]: *** [ifpga_rawdev] Error 2
/tmp/UBT164-32_K4.4.0_GCC5.4.0/i686-native-linuxapp-gcc/fc7ae441052f49ad94251bf385f2ff6f/dpdk/mk/rte.subdir.mk:35: recipe for target 'raw' failed
make[4]: *** [raw] Error 2
/tmp/UBT164-32_K4.4.0_GCC5.4.0/i686-native-linuxapp-gcc/fc7ae441052f49ad94251bf385f2ff6f/dpdk/mk/rte.sdkbuild.mk:46: recipe for target 'drivers' failed
make[3]: *** [drivers] Error 2
/tmp/UBT164-32_K4.4.0_GCC5.4.0/i686-native-linuxapp-gcc/fc7ae441052f49ad94251bf385f2ff6f/dpdk/mk/rte.sdkroot.mk:98: recipe for target 'all' failed
make[2]: *** [all] Error 2
/tmp/UBT164-32_K4.4.0_GCC5.4.0/i686-native-linuxapp-gcc/fc7ae441052f49ad94251bf385f2ff6f/dpdk/mk/rte.sdkinstall.mk:60: recipe for target 'pre_install' failed
make[1]: *** [pre_install] Error 2
/tmp/UBT164-32_K4.4.0_GCC5.4.0/i686-native-linuxapp-gcc/fc7ae441052f49ad94251bf385f2ff6f/dpdk/mk/rte.sdkroot.mk:77: recipe for target 'install' failed
make: *** [install] Error 2

*Failed Build #4:
OS: UBT1804
Target: x86_64-native-linuxapp-gcc
  CC rte_hypervisor.o
  CC rte_spinlock.o
  CC rte_cycles.o
  AR librte_eal.a
  INSTALL-LIB librte_eal.a
make[7]: warning:  Clock skew detected.  Your build may be incomplete.
== Build lib/librte_pci
== Build lib/librte_meter
== Build lib/librte_ring
== Build lib/librte_cmdline
== Build lib/librte_timer
--
  CC rte_member.o
  CC rte_member_ht.o
  CC rte_member_vbf.o
  AR librte_mbuf.a
  INSTALL-LIB librte_mbuf.a
make[5]: warning:  Clock skew detected.  Your build may be incomplete.
== Build lib/librte_bbdev
== Build lib/librte_compressdev
== Build lib/librte_net
== Build lib/librte_cryptodev
== Build lib/librte_reorder
--
  INSTALL-LIB librte_member.a
  INSTALL-LIB librte_reorder.a
  CC rte_arp.o
  AR librte_net.a
  INSTALL-LIB librte_net.a
make[5]: warning:  Clock skew detected.  Your build may be incomplete.
== Build lib/librte_sched
== Build lib/librte_ethdev
  AR librte_compressdev.a
  AR librte_bbdev.a
  INSTALL-LIB librte_compressdev.a
--
  CC rte_approx.o
  AR librte_sched.a
  INSTALL-LIB librte_sched.a
  AR librte_ethdev.a
  INSTALL-LIB librte_ethdev.a
make[5]: warning:  Clock skew detected.  Your build may be incomplete.
== Build lib/librte_ip_frag
== Build lib/librte_vhost
== Build lib/librte_bitratestats
== Build lib/librte_rawdev
== Build lib/librte_security
--
  CC bpf_pkt.o
  CC bpf_validate.o
  CC bpf_jit_x86.o
  AR librte_ipsec.a
  INSTALL-LIB librte_ipsec.a
make[5]: warning:  Clock skew detected.  Your build may be incomplete.
  CC vdpa.o
  CC rte_event_eth_tx_adapter.o
  CC vhost_crypto.o
  CC rte_port_ras.o
  CC rte_port_sched.o
--
  CC [M]  /tmp/UBT1804_K4.15.0_GCC7.3.0/x86_64-native-linuxapp-gcc/fc7ae441052f49ad94251bf385f2ff6f/dpdk/x86_64-native-linuxapp-gcc/build/kernel/linux/kni/kni_net.o
  CC vmbus_bufring.o
  CC vmbus_channel.o
  AR librte_bus_ifpga.a
  INSTALL-LIB librte_bus_ifpga.a
make[6]: warning:  Clock skew detected.  Your build may be incomplete.
  CC mc/dpbp.o
  CC mc/dpio.o
  CC mc/mc_sys.o
  CC mc/dpcon.o
  CC pci_params.o
--
  CC lio_ethdev.o
  CC iavf_rxtx.o
  CC ice_fdir.o
  AR librte_pmd_ipn3ke.a
  INSTALL-LIB librte_pmd_ipn3ke.a
make[6]: warning:  Clock skew detected.  Your build may be incomplete.
== Build drivers/net/netvsc
  CC i40e_dcb.o
  AR librte_pmd_e1000.a
  CC ixgbe_82598.o
  CC i40e_ethdev.o
--
  AR librte_pmd_softnic.a
  INSTALL-LIB librte_pmd_softnic.a
  CC medford2_nic.o
  AR librte_pmd_sfc_efx.a
  INSTALL-LIB librte_pmd_sfc_efx.a
make[5]: warning:  Clock skew detected.  Your build may be incomplete.
== Build drivers/event
== Build drivers/event/dsw
== Build drivers/event/sw
== Build drivers/event/skeleton
== Build drivers/event/dpaa
--
  AR librte_pmd_dpaa2_cmdif.a
  PMDINFO skeleton_rawdev.o.pmd.c
  INSTALL-LIB librte_pmd_dpaa2_cmdif.a
  CC skeleton_rawdev.o.pmd.o
  LD skeleton_rawdev.o
  CC ifpga_fme_error.o
  CC ifpga_port.o
  CC ifpga_port_error.o
  CC opae_hw_api.o
  CC opae_ifpga_hw_api.o
  CC opae_debug.o
  AR librte_pmd_skeleton_rawdev.a
  CC ifpga_fme_pr.o
--
  LD dpaa2_qdma.o
  CC opae_i2c.o
  CC opae_at24_eeprom.o
  CC opae_eth_group.o
  CC ifpga_rawdev.o
/tmp/UBT1804_K4.15.0_GCC7.3.0/x86_64-native-linuxapp-gcc/fc7ae441052f49ad94251bf385f2ff6f/dpdk/drivers/raw/ifpga_rawdev/base/opae_intel_max10.c:6:10: fatal error: libfdt.h: No such file or directory
 #include <libfdt.h>
          ^~~~~~~~~~
compilation terminated.
/tmp/UBT1804_K4.15.0_GCC7.3.0/x86_64-native-linuxapp-gcc/fc7ae441052f49ad94251bf385f2ff6f/dpdk/mk/internal/rte.compile-pre.mk:114: recipe for target 'opae_intel_max10.o' failed
make[6]: *** [opae_intel_max10.o] Error 1
make[6]: *** Waiting for unfinished jobs....
  AR librte_pmd_dpaa2_qdma.a
  INSTALL-LIB librte_pmd_dpaa2_qdma.a
  PMDINFO ifpga_rawdev.o.pmd.c
  CC ifpga_rawdev.o.pmd.o
  LD ifpga_rawdev.o
/tmp/UBT1804_K4.15.0_GCC7.3.0/x86_64-native-linuxapp-gcc/fc7ae441052f49ad94251bf385f2ff6f/dpdk/mk/rte.subdir.mk:35: recipe for target 'ifpga_rawdev' failed
make[5]: *** [ifpga_rawdev] Error 2
/tmp/UBT1804_K4.15.0_GCC7.3.0/x86_64-native-linuxapp-gcc/fc7ae441052f49ad94251bf385f2ff6f/dpdk/mk/rte.subdir.mk:35: recipe for target 'raw' failed
make[4]: *** [raw] Error 2
/tmp/UBT1804_K4.15.0_GCC7.3.0/x86_64-native-linuxapp-gcc/fc7ae441052f49ad94251bf385f2ff6f/dpdk/mk/rte.sdkbuild.mk:46: recipe for target 'drivers' failed
make[3]: *** [drivers] Error 2
/tmp/UBT1804_K4.15.0_GCC7.3.0/x86_64-native-linuxapp-gcc/fc7ae441052f49ad94251bf385f2ff6f/dpdk/mk/rte.sdkroot.mk:98: recipe for target 'all' failed
make[2]: *** [all] Error 2
/tmp/UBT1804_K4.15.0_GCC7.3.0/x86_64-native-linuxapp-gcc/fc7ae441052f49ad94251bf385f2ff6f/dpdk/mk/rte.sdkinstall.mk:60: recipe for target 'pre_install' failed
make[1]: *** [pre_install] Error 2
/tmp/UBT1804_K4.15.0_GCC7.3.0/x86_64-native-linuxapp-gcc/fc7ae441052f49ad94251bf385f2ff6f/dpdk/mk/rte.sdkroot.mk:77: recipe for target 'install' failed
make: *** [install] Error 2

*Failed Build #5:
OS: UBT1804
Target: x86_64-native-linuxapp-clang
  CC rte_hypervisor.o
  CC rte_spinlock.o
  CC rte_cycles.o
  AR librte_eal.a
  INSTALL-LIB librte_eal.a
make[7]: warning:  Clock skew detected.  Your build may be incomplete.
== Build lib/librte_pci
== Build lib/librte_ring
== Build lib/librte_cmdline
== Build lib/librte_jobstats
== Build lib/librte_timer
--
  CC rte_member_vbf.o
  CC rte_lpm.o
  CC rte_lpm6.o
  AR librte_mbuf.a
  INSTALL-LIB librte_mbuf.a
make[5]: warning:  Clock skew detected.  Your build may be incomplete.
== Build lib/librte_net
== Build lib/librte_compressdev
== Build lib/librte_bbdev
== Build lib/librte_cryptodev
== Build lib/librte_reorder
--
  CC rte_comp.o
  AR librte_reorder.a
  INSTALL-LIB librte_reorder.a
  AR librte_net.a
  INSTALL-LIB librte_net.a
make[5]: warning:  Clock skew detected.  Your build may be incomplete.
== Build lib/librte_sched
== Build lib/librte_ethdev
  SYMLINK-FILE include/rte_sched.h
  SYMLINK-FILE include/rte_sched_common.h
  SYMLINK-FILE include/rte_red.h
--
  INSTALL-LIB librte_sched.a
  AR librte_compressdev.a
  INSTALL-LIB librte_compressdev.a
  AR librte_ethdev.a
  INSTALL-LIB librte_ethdev.a
make[5]: warning:  Clock skew detected.  Your build may be incomplete.
== Build lib/librte_security
== Build lib/librte_rawdev
== Build lib/librte_eventdev
== Build lib/librte_ip_frag
== Build lib/librte_bitratestats
--
  SYMLINK-FILE include/rte_port_fd.h
  INSTALL-LIB librte_ipsec.a
  CC bpf_jit_x86.o
  AR librte_eventdev.a
  INSTALL-LIB librte_eventdev.a
make[5]: warning:  Clock skew detected.  Your build may be incomplete.
  SYMLINK-FILE include/rte_port_kni.h
  SYMLINK-FILE include/rte_port_source_sink.h
  SYMLINK-FILE include/rte_port_sym_crypto.h
  CC rte_port_ethdev.o
  CC rte_port_ring.o
--
  CC base/fman/of.o
  CC mc/dpmng.o
  AR librte_bus_ifpga.a
  INSTALL-LIB librte_bus_ifpga.a
  CC vmbus_channel.o
make[6]: warning:  Clock skew detected.  Your build may be incomplete.
  CC vmbus_bufring.o
  CC mc/dpbp.o
  AR librte_bus_pci.a
  CC vmbus_common_uio.o
  INSTALL-LIB librte_bus_pci.a
--
  AR librte_pmd_fm10k.a
  CC ixgbe_82598.o
  INSTALL-LIB librte_pmd_ipn3ke.a
  CC ixgbe_82599.o
  INSTALL-LIB librte_pmd_fm10k.a
make[6]: warning:  Clock skew detected.  Your build may be incomplete.
== Build drivers/net/liquidio
== Build drivers/net/netvsc
  CC lio_ethdev.o
  CC hn_ethdev.o
  AR librte_pmd_iavf.a
--
  CC hunt_nic.o
  CC medford_nic.o
  CC medford2_nic.o
  AR librte_pmd_sfc_efx.a
  INSTALL-LIB librte_pmd_sfc_efx.a
make[5]: warning:  Clock skew detected.  Your build may be incomplete.
== Build drivers/event
== Build drivers/event/skeleton
== Build drivers/event/dsw
== Build drivers/event/opdl
== Build drivers/event/sw
--
  LD dpaa2_cmdif.o
  AR librte_pmd_dpaa2_cmdif.a
  INSTALL-LIB librte_pmd_dpaa2_cmdif.a
  PMDINFO skeleton_rawdev.o.pmd.c
  CC skeleton_rawdev.o.pmd.o
  CC ifpga_fme_error.o
  LD skeleton_rawdev.o
  CC ifpga_port.o
  CC ifpga_port_error.o
  AR librte_pmd_skeleton_rawdev.a
  INSTALL-LIB librte_pmd_skeleton_rawdev.a
  CC opae_hw_api.o
  CC opae_ifpga_hw_api.o
  CC opae_debug.o
--
  CC opae_intel_max10.o
  CC opae_i2c.o
  CC opae_at24_eeprom.o
  CC opae_eth_group.o
  CC ifpga_rawdev.o
/tmp/UBT1804_K4.15.0_Clang6.0.0/x86_64-native-linuxapp-clang/fc7ae441052f49ad94251bf385f2ff6f/dpdk/drivers/raw/ifpga_rawdev/base/opae_intel_max10.c:6:10: fatal error: 'libfdt.h' file not found
#include <libfdt.h>
         ^~~~~~~~~~
1 error generated.
/tmp/UBT1804_K4.15.0_Clang6.0.0/x86_64-native-linuxapp-clang/fc7ae441052f49ad94251bf385f2ff6f/dpdk/mk/internal/rte.compile-pre.mk:114: recipe for target 'opae_intel_max10.o' failed
make[6]: *** [opae_intel_max10.o] Error 1
make[6]: *** Waiting for unfinished jobs....
  AR librte_pmd_dpaa2_qdma.a
  INSTALL-LIB librte_pmd_dpaa2_qdma.a
  PMDINFO ifpga_rawdev.o.pmd.c
  CC ifpga_rawdev.o.pmd.o
  LD ifpga_rawdev.o
/tmp/UBT1804_K4.15.0_Clang6.0.0/x86_64-native-linuxapp-clang/fc7ae441052f49ad94251bf385f2ff6f/dpdk/mk/rte.subdir.mk:35: recipe for target 'ifpga_rawdev' failed
make[5]: *** [ifpga_rawdev] Error 2
/tmp/UBT1804_K4.15.0_Clang6.0.0/x86_64-native-linuxapp-clang/fc7ae441052f49ad94251bf385f2ff6f/dpdk/mk/rte.subdir.mk:35: recipe for target 'raw' failed
make[4]: *** [raw] Error 2
/tmp/UBT1804_K4.15.0_Clang6.0.0/x86_64-native-linuxapp-clang/fc7ae441052f49ad94251bf385f2ff6f/dpdk/mk/rte.sdkbuild.mk:46: recipe for target 'drivers' failed
make[3]: *** [drivers] Error 2
/tmp/UBT1804_K4.15.0_Clang6.0.0/x86_64-native-linuxapp-clang/fc7ae441052f49ad94251bf385f2ff6f/dpdk/mk/rte.sdkroot.mk:98: recipe for target 'all' failed
make[2]: *** [all] Error 2
/tmp/UBT1804_K4.15.0_Clang6.0.0/x86_64-native-linuxapp-clang/fc7ae441052f49ad94251bf385f2ff6f/dpdk/mk/rte.sdkinstall.mk:60: recipe for target 'pre_install' failed
make[1]: *** [pre_install] Error 2
/tmp/UBT1804_K4.15.0_Clang6.0.0/x86_64-native-linuxapp-clang/fc7ae441052f49ad94251bf385f2ff6f/dpdk/mk/rte.sdkroot.mk:77: recipe for target 'install' failed
make: *** [install] Error 2

*Failed Build #6:
OS: UBT1804
Target: x86_64-native-linuxapp-icc
  CC rte_hypervisor.o
  CC rte_spinlock.o
  CC rte_cycles.o
  AR librte_eal.a
  INSTALL-LIB librte_eal.a
make[7]: warning:  Clock skew detected.  Your build may be incomplete.
== Build lib/librte_ring
== Build lib/librte_pci
== Build lib/librte_timer
== Build lib/librte_meter
== Build lib/librte_cmdline
--
  CC rte_mbuf.o
  CC rte_mbuf_pool_ops.o
  CC rte_mbuf_ptype.o
  AR librte_mbuf.a
  INSTALL-LIB librte_mbuf.a
make[5]: warning:  Clock skew detected.  Your build may be incomplete.
== Build lib/librte_net
== Build lib/librte_bbdev
== Build lib/librte_cryptodev
== Build lib/librte_compressdev
== Build lib/librte_reorder
--
  CC rte_comp.o
== Build lib/librte_efd
== Build lib/librte_lpm
  AR librte_net.a
  INSTALL-LIB librte_net.a
make[5]: warning:  Clock skew detected.  Your build may be incomplete.
== Build lib/librte_member
  AR librte_reorder.a
  INSTALL-LIB librte_reorder.a
== Build lib/librte_sched
  AR librte_cryptodev.a
--
  CC ethdev_profile.o
  AR librte_sched.a
  INSTALL-LIB librte_sched.a
  AR librte_ethdev.a
  INSTALL-LIB librte_ethdev.a
make[5]: warning:  Clock skew detected.  Your build may be incomplete.
== Build lib/librte_security
== Build lib/librte_eventdev
== Build lib/librte_vhost
== Build lib/librte_ip_frag
== Build lib/librte_rawdev
--
  CC bpf_jit_x86.o
  CC rte_port_sched.o
  AR librte_ipsec.a
  CC rte_port_fd.o
  INSTALL-LIB librte_ipsec.a
make[5]: warning:  Clock skew detected.  Your build may be incomplete.
  CC rte_port_kni.o
  CC rte_port_source_sink.o
  CC rte_port_sym_crypto.o
  AR librte_vhost.a
  INSTALL-LIB librte_vhost.a
--
  CC pci_params.o
  CC base/qbman/bman_driver.o
  AR librte_bus_ifpga.a
  INSTALL-LIB librte_bus_ifpga.a
  AR librte_bus_vdev.a
make[6]: warning:  Clock skew detected.  Your build may be incomplete.
  INSTALL-LIB librte_bus_vdev.a
  CC pci_common.o
  CC qbman/qbman_debug.o
  CC mc/dpmng.o
  CC vmbus_common.o
--
  CC bnxt_cpr.o
  CC ixgbe_82598.o
  CC ixgbe_82599.o
  AR librte_pmd_ipn3ke.a
  INSTALL-LIB librte_pmd_ipn3ke.a
make[6]: warning:  Clock skew detected.  Your build may be incomplete.
== Build drivers/net/null
  CC bnxt_ethdev.o
  CC lio_23xx_vf.o
  CC ice_switch.o
  CC ixgbe_x540.o
--
  PMDINFO virtio_user_ethdev.o.pmd.c
  CC virtio_user_ethdev.o.pmd.o
  LD virtio_user_ethdev.o
  AR librte_pmd_virtio.a
  INSTALL-LIB librte_pmd_virtio.a
make[5]: warning:  Clock skew detected.  Your build may be incomplete.
== Build drivers/event
== Build drivers/event/sw
== Build drivers/event/skeleton
== Build drivers/event/octeontx
== Build drivers/event/dsw
--
  CC ifpga_fme.o
  CC ifpga_fme_dperf.o
  CC ifpga_api.o
  PMDINFO dpaa2_cmdif.o.pmd.c
  CC dpaa2_cmdif.o.pmd.o
  CC ifpga_fme_error.o
  PMDINFO skeleton_rawdev.o.pmd.c
  CC skeleton_rawdev.o.pmd.o
  LD dpaa2_cmdif.o
  AR librte_pmd_dpaa2_cmdif.a
  INSTALL-LIB librte_pmd_dpaa2_cmdif.a
  PMDINFO dpaa2_qdma.o.pmd.c
  CC dpaa2_qdma.o.pmd.o
  CC ifpga_port.o
  LD skeleton_rawdev.o
  CC ifpga_port_error.o
  CC opae_hw_api.o
  AR librte_pmd_skeleton_rawdev.a
  CC opae_ifpga_hw_api.o
  CC opae_debug.o
  INSTALL-LIB librte_pmd_skeleton_rawdev.a
--
  CC opae_intel_max10.o
  CC opae_i2c.o
  CC opae_at24_eeprom.o
  CC opae_eth_group.o
  CC ifpga_rawdev.o
/tmp/UBT1804_K4.15.0_ICC19.0.0/x86_64-native-linuxapp-icc/fc7ae441052f49ad94251bf385f2ff6f/dpdk/drivers/raw/ifpga_rawdev/base/opae_intel_max10.c(6): catastrophic error: cannot open source file "libfdt.h"
  #include <libfdt.h>
                     ^

compilation aborted for /tmp/UBT1804_K4.15.0_ICC19.0.0/x86_64-native-linuxapp-icc/fc7ae441052f49ad94251bf385f2ff6f/dpdk/drivers/raw/ifpga_rawdev/base/opae_intel_max10.c (code 4)
/tmp/UBT1804_K4.15.0_ICC19.0.0/x86_64-native-linuxapp-icc/fc7ae441052f49ad94251bf385f2ff6f/dpdk/mk/internal/rte.compile-pre.mk:114: recipe for target 'opae_intel_max10.o' failed
make[6]: *** [opae_intel_max10.o] Error 4
make[6]: *** Waiting for unfinished jobs....
  AR librte_pmd_dpaa2_qdma.a
  INSTALL-LIB librte_pmd_dpaa2_qdma.a
  PMDINFO ifpga_rawdev.o.pmd.c
  CC ifpga_rawdev.o.pmd.o
  LD ifpga_rawdev.o
/tmp/UBT1804_K4.15.0_ICC19.0.0/x86_64-native-linuxapp-icc/fc7ae441052f49ad94251bf385f2ff6f/dpdk/mk/rte.subdir.mk:35: recipe for target 'ifpga_rawdev' failed
make[5]: *** [ifpga_rawdev] Error 2
/tmp/UBT1804_K4.15.0_ICC19.0.0/x86_64-native-linuxapp-icc/fc7ae441052f49ad94251bf385f2ff6f/dpdk/mk/rte.subdir.mk:35: recipe for target 'raw' failed
make[4]: *** [raw] Error 2
/tmp/UBT1804_K4.15.0_ICC19.0.0/x86_64-native-linuxapp-icc/fc7ae441052f49ad94251bf385f2ff6f/dpdk/mk/rte.sdkbuild.mk:46: recipe for target 'drivers' failed
make[3]: *** [drivers] Error 2
/tmp/UBT1804_K4.15.0_ICC19.0.0/x86_64-native-linuxapp-icc/fc7ae441052f49ad94251bf385f2ff6f/dpdk/mk/rte.sdkroot.mk:98: recipe for target 'all' failed
make[2]: *** [all] Error 2
/tmp/UBT1804_K4.15.0_ICC19.0.0/x86_64-native-linuxapp-icc/fc7ae441052f49ad94251bf385f2ff6f/dpdk/mk/rte.sdkinstall.mk:60: recipe for target 'pre_install' failed
make[1]: *** [pre_install] Error 2
/tmp/UBT1804_K4.15.0_ICC19.0.0/x86_64-native-linuxapp-icc/fc7ae441052f49ad94251bf385f2ff6f/dpdk/mk/rte.sdkroot.mk:77: recipe for target 'install' failed
make: *** [install] Error 2

*Failed Build #7:
OS: UBT144-32
Target: i686-native-linuxapp-gcc
  CC rte_hypervisor.o
  CC rte_spinlock.o
  CC rte_cycles.o
  AR librte_eal.a
  INSTALL-LIB librte_eal.a
make[7]: warning:  Clock skew detected.  Your build may be incomplete.
== Build lib/librte_pci
== Build lib/librte_ring
== Build lib/librte_timer
== Build lib/librte_cmdline
== Build lib/librte_meter
--
  CC rte_mbuf.o
  CC rte_mbuf_ptype.o
  CC rte_mbuf_pool_ops.o
  AR librte_mbuf.a
  INSTALL-LIB librte_mbuf.a
make[5]: warning:  Clock skew detected.  Your build may be incomplete.
== Build lib/librte_net
== Build lib/librte_bbdev
== Build lib/librte_compressdev
== Build lib/librte_reorder
== Build lib/librte_cryptodev
--
  CC rte_efd.o
  CC rte_comp.o
  CC rte_lpm.o
  AR librte_net.a
  INSTALL-LIB librte_net.a
make[5]: warning:  Clock skew detected.  Your build may be incomplete.
== Build lib/librte_ethdev
== Build lib/librte_sched
  AR librte_cryptodev.a
  INSTALL-LIB librte_cryptodev.a
  CC rte_member_vbf.o
--
  INSTALL-LIB librte_lpm.a
  AR librte_sched.a
  INSTALL-LIB librte_sched.a
  AR librte_ethdev.a
  INSTALL-LIB librte_ethdev.a
make[5]: warning:  Clock skew detected.  Your build may be incomplete.
== Build lib/librte_security
== Build lib/librte_eventdev
== Build lib/librte_rawdev
== Build lib/librte_vhost
== Build lib/librte_ip_frag
--
  CC rte_event_eth_tx_adapter.o
  SYMLINK-FILE include/rte_port.h
  AR librte_ipsec.a
  SYMLINK-FILE include/rte_port_ethdev.h
  INSTALL-LIB librte_ipsec.a
make[5]: warning:  Clock skew detected.  Your build may be incomplete.
  SYMLINK-FILE include/rte_port_ring.h
  SYMLINK-FILE include/rte_port_frag.h
  SYMLINK-FILE include/rte_port_ras.h
  SYMLINK-FILE include/rte_port_sched.h
  AR librte_bpf.a
--
INSTALL-MODULE igb_uio.ko
  AR librte_bus_ifpga.a
  CC vdev_params.o
  INSTALL-LIB librte_bus_ifpga.a
  CC pci_params.o
make[6]: warning:  Clock skew detected.  Your build may be incomplete.
  CC qbman/qbman_debug.o
  CC vmbus_channel.o
  CC vmbus_bufring.o
  CC vmbus_common_uio.o
  CC base/fman/of.o
--
== Build drivers/net/bnxt
  SYMLINK-FILE include/rte_pmd_ixgbe.h
  CC ixgbe_common.o
  CC failsafe_ops.o
/tmp/UBT144-32_K3.13.0_GCC4.8.4/i686-native-linuxapp-gcc/fc7ae441052f49ad94251bf385f2ff6f/dpdk/drivers/net/ipn3ke/ipn3ke_ethdev.c: In function ‘ipn3ke_indirect_read’:
/tmp/UBT144-32_K3.13.0_GCC4.8.4/i686-native-linuxapp-gcc/fc7ae441052f49ad94251bf385f2ff6f/dpdk/drivers/net/ipn3ke/ipn3ke_ethdev.c:68:19: warning: cast to pointer from integer of different size [-Wint-to-pointer-cast]
  indirect_addrs = (volatile void *)(base_addr | 0x10);
                   ^
/tmp/UBT144-32_K3.13.0_GCC4.8.4/i686-native-linuxapp-gcc/fc7ae441052f49ad94251bf385f2ff6f/dpdk/drivers/net/ipn3ke/ipn3ke_ethdev.c:76:19: warning: cast to pointer from integer of different size [-Wint-to-pointer-cast]
  indirect_addrs = (volatile void *)(base_addr | 0x18);
                   ^
/tmp/UBT144-32_K3.13.0_GCC4.8.4/i686-native-linuxapp-gcc/fc7ae441052f49ad94251bf385f2ff6f/dpdk/drivers/net/ipn3ke/ipn3ke_ethdev.c: In function ‘ipn3ke_indirect_write’:
/tmp/UBT144-32_K3.13.0_GCC4.8.4/i686-native-linuxapp-gcc/fc7ae441052f49ad94251bf385f2ff6f/dpdk/drivers/net/ipn3ke/ipn3ke_ethdev.c:118:19: warning: cast to pointer from integer of different size [-Wint-to-pointer-cast]
  indirect_addrs = (volatile void *)(base_addr | 0x10);
                   ^
  CC i40e_common.o
  CC lio_ethdev.o
  PMDINFO ipn3ke_ethdev.o.pmd.c
  CC ipn3ke_ethdev.o.pmd.o
  LD ipn3ke_ethdev.o
  CC ipn3ke_representor.o
  CC hn_ethdev.o
/tmp/UBT144-32_K3.13.0_GCC4.8.4/i686-native-linuxapp-gcc/fc7ae441052f49ad94251bf385f2ff6f/dpdk/drivers/net/ipn3ke/ipn3ke_representor.c: In function ‘ipn3ke_update_link’:
/tmp/UBT144-32_K3.13.0_GCC4.8.4/i686-native-linuxapp-gcc/fc7ae441052f49ad94251bf385f2ff6f/dpdk/drivers/net/ipn3ke/ipn3ke_representor.c:388:2: warning: format ‘%lx’ expects argument of type ‘long unsigned int’, but argument 4 has type ‘uint64_t’ [-Wformat=]
  IPN3KE_AFU_PMD_DEBUG("line_link_bitmap is %lx\n", line_link_bitmap);
  ^
  CC iavf_ethdev.o
  PMDINFO lio_ethdev.o.pmd.c
  CC lio_ethdev.o.pmd.o
--
  CC lio_23xx_vf.o
  CC failsafe_flow.o
  AR librte_pmd_ipn3ke.a
  INSTALL-LIB librte_pmd_ipn3ke.a
  PMDINFO bnxt_ethdev.o.pmd.c
make[6]: warning:  Clock skew detected.  Your build may be incomplete.
  CC bnxt_ethdev.o.pmd.o
== Build drivers/net/null
  LD bnxt_ethdev.o
  CC bnxt_filter.o
  CC hn_nvs.o
--
  INSTALL-LIB librte_pmd_i40e.a
  AR librte_pmd_qede.a
  INSTALL-LIB librte_pmd_qede.a
  AR librte_pmd_softnic.a
  INSTALL-LIB librte_pmd_softnic.a
make[5]: warning:  Clock skew detected.  Your build may be incomplete.
== Build drivers/event
== Build drivers/event/skeleton
== Build drivers/event/sw
== Build drivers/event/dsw
== Build drivers/event/dpaa
--
  PMDINFO dpaa2_cmdif.o.pmd.c
  CC dpaa2_cmdif.o.pmd.o
  LD dpaa2_cmdif.o
  AR librte_pmd_dpaa2_cmdif.a
  INSTALL-LIB librte_pmd_dpaa2_cmdif.a
  CC ifpga_fme_error.o
  CC ifpga_port.o
  CC ifpga_port_error.o
  CC opae_hw_api.o
  CC opae_ifpga_hw_api.o
  PMDINFO skeleton_rawdev.o.pmd.c
  CC skeleton_rawdev.o.pmd.o
  CC opae_debug.o
--
  CC opae_at24_eeprom.o
  CC opae_eth_group.o
  CC ifpga_rawdev.o
  PMDINFO dpaa2_qdma.o.pmd.c
  CC dpaa2_qdma.o.pmd.o
/tmp/UBT144-32_K3.13.0_GCC4.8.4/i686-native-linuxapp-gcc/fc7ae441052f49ad94251bf385f2ff6f/dpdk/drivers/raw/ifpga_rawdev/base/opae_intel_max10.c:6:20: fatal error: libfdt.h: No such file or directory
 #include <libfdt.h>
                    ^
compilation terminated.
  LD dpaa2_qdma.o
/tmp/UBT144-32_K3.13.0_GCC4.8.4/i686-native-linuxapp-gcc/fc7ae441052f49ad94251bf385f2ff6f/dpdk/drivers/raw/ifpga_rawdev/ifpga_rawdev.c: In function ‘ifgpa_rawdev_get_attr’:
/tmp/UBT144-32_K3.13.0_GCC4.8.4/i686-native-linuxapp-gcc/fc7ae441052f49ad94251bf385f2ff6f/dpdk/drivers/raw/ifpga_rawdev/ifpga_rawdev.c:484:17: warning: cast from pointer to integer of different size [-Wpointer-to-int-cast]
   *attr_value = (uint64_t)opae_eth_grp_reg_info.addr;
                 ^
/tmp/UBT144-32_K3.13.0_GCC4.8.4/i686-native-linuxapp-gcc/fc7ae441052f49ad94251bf385f2ff6f/dpdk/drivers/raw/ifpga_rawdev/ifpga_rawdev.c:522:17: warning: cast from pointer to integer of different size [-Wpointer-to-int-cast]
   *attr_value = (uint64_t)opae_eth_grp_reg_info.addr;
                 ^
make[6]: *** [opae_intel_max10.o] Error 1
make[6]: *** Waiting for unfinished jobs....
  AR librte_pmd_dpaa2_qdma.a

*Failed Build #8:
OS: UBT1810
Target: x86_64-native-linuxapp-gcc
  CC rte_hypervisor.o
  CC rte_spinlock.o
  CC rte_cycles.o
  AR librte_eal.a
  INSTALL-LIB librte_eal.a
make[7]: warning:  Clock skew detected.  Your build may be incomplete.
== Build lib/librte_pci
== Build lib/librte_ring
== Build lib/librte_timer
== Build lib/librte_cmdline
== Build lib/librte_meter
--
  CC rte_mbuf_pool_ops.o
  AR librte_efd.a
  INSTALL-LIB librte_efd.a
  AR librte_mbuf.a
  INSTALL-LIB librte_mbuf.a
make[5]: warning:  Clock skew detected.  Your build may be incomplete.
== Build lib/librte_net
== Build lib/librte_bbdev
== Build lib/librte_cryptodev
== Build lib/librte_compressdev
== Build lib/librte_reorder
--
  CC rte_arp.o
  AR librte_reorder.a
  INSTALL-LIB librte_reorder.a
  AR librte_net.a
  INSTALL-LIB librte_net.a
make[5]: warning:  Clock skew detected.  Your build may be incomplete.
== Build lib/librte_ethdev
== Build lib/librte_sched
  SYMLINK-FILE include/rte_ethdev.h
  SYMLINK-FILE include/rte_ethdev_driver.h
  SYMLINK-FILE include/rte_ethdev_core.h
--
  INSTALL-LIB librte_bbdev.a
  AR librte_sched.a
  INSTALL-LIB librte_sched.a
  AR librte_ethdev.a
  INSTALL-LIB librte_ethdev.a
make[5]: warning:  Clock skew detected.  Your build may be incomplete.
== Build lib/librte_security
== Build lib/librte_eventdev
== Build lib/librte_rawdev
== Build lib/librte_vhost
== Build lib/librte_ip_frag
--
  CC vhost_user.o
  AR librte_ipsec.a
  SYMLINK-FILE include/rte_port_frag.h
  CC virtio_net.o
  INSTALL-LIB librte_ipsec.a
make[5]: warning:  Clock skew detected.  Your build may be incomplete.
  SYMLINK-FILE include/rte_port_ras.h
  CC vdpa.o
  CC vhost_crypto.o
  SYMLINK-FILE include/rte_port_sched.h
  SYMLINK-FILE include/rte_port_fd.h
--
  CC mc/dpmng.o
  CC mc/dpbp.o
  AR librte_bus_ifpga.a
  INSTALL-LIB librte_bus_ifpga.a
  CC base/fman/of.o
make[6]: warning:  Clock skew detected.  Your build may be incomplete.
  CC mc/dpio.o
  CC mc/mc_sys.o
  CC base/fman/netcfg_layer.o
  CC vmbus_common.o
  CC mc/dpcon.o
--
== Build drivers/net/liquidio
== Build drivers/net/netvsc
  AR librte_pmd_ipn3ke.a
  INSTALL-LIB librte_pmd_ipn3ke.a
  CC e1000_vf.o
make[6]: warning:  Clock skew detected.  Your build may be incomplete.
  CC i40e_ethdev_vf.o
  CC enic_rxtx_vec_avx2.o
  SYMLINK-FILE include/rte_pmd_ixgbe.h
  CC ixgbe_common.o
  CC igb_ethdev.o
--
  CC hunt_nic.o
  CC medford_nic.o
  CC medford2_nic.o
  AR librte_pmd_sfc_efx.a
  INSTALL-LIB librte_pmd_sfc_efx.a
make[5]: warning:  Clock skew detected.  Your build may be incomplete.
== Build drivers/event
== Build drivers/event/skeleton
== Build drivers/event/sw
== Build drivers/event/dpaa
== Build drivers/event/dsw
--
  PMDINFO dpaa2_cmdif.o.pmd.c
  CC dpaa2_cmdif.o.pmd.o
  LD dpaa2_cmdif.o
  AR librte_pmd_dpaa2_cmdif.a
  INSTALL-LIB librte_pmd_dpaa2_cmdif.a
  CC ifpga_fme_error.o
  CC ifpga_port.o
  PMDINFO skeleton_rawdev.o.pmd.c
  CC skeleton_rawdev.o.pmd.o
  CC ifpga_port_error.o
  LD skeleton_rawdev.o
  CC opae_hw_api.o
  CC opae_ifpga_hw_api.o
  AR librte_pmd_skeleton_rawdev.a
  INSTALL-LIB librte_pmd_skeleton_rawdev.a
--
  CC opae_eth_group.o
  CC ifpga_rawdev.o
  PMDINFO dpaa2_qdma.o.pmd.c
  CC dpaa2_qdma.o.pmd.o
  LD dpaa2_qdma.o
/tmp/UBT1810_K4.18.0_GCC8.2.0/x86_64-native-linuxapp-gcc/fc7ae441052f49ad94251bf385f2ff6f/dpdk/drivers/raw/ifpga_rawdev/base/opae_intel_max10.c:6:10: fatal error: libfdt.h: No such file or directory
 #include <libfdt.h>
          ^~~~~~~~~~
compilation terminated.
make[6]: *** [/tmp/UBT1810_K4.18.0_GCC8.2.0/x86_64-native-linuxapp-gcc/fc7ae441052f49ad94251bf385f2ff6f/dpdk/mk/internal/rte.compile-pre.mk:114: opae_intel_max10.o] Error 1
make[6]: *** Waiting for unfinished jobs....

*Failed Build #9:
OS: RHEL75
Target: x86_64-native-linuxapp-gcc
  CC ifpga_fme_iperf.o
  CC ifpga_fme_dperf.o
  PMDINFO dpaa2_cmdif.o.pmd.c
  CC dpaa2_cmdif.o.pmd.o
  LD dpaa2_cmdif.o
  CC ifpga_fme_error.o
  PMDINFO skeleton_rawdev.o.pmd.c
  CC skeleton_rawdev.o.pmd.o
  CC ifpga_port.o
  CC ifpga_port_error.o
  AR librte_pmd_dpaa2_cmdif.a
  CC opae_hw_api.o
  INSTALL-LIB librte_pmd_dpaa2_cmdif.a
  LD skeleton_rawdev.o
  CC opae_ifpga_hw_api.o
--
  INSTALL-LIB librte_pmd_skeleton_rawdev.a
  CC opae_i2c.o
  CC opae_at24_eeprom.o
  CC opae_eth_group.o
  CC ifpga_rawdev.o
/tmp/RHEL75_K3.10.0_GCC4.8.5/x86_64-native-linuxapp-gcc/fc7ae441052f49ad94251bf385f2ff6f/dpdk/drivers/raw/ifpga_rawdev/base/opae_intel_max10.c:6:20: fatal error: libfdt.h: No such file or directory
 #include <libfdt.h>
                    ^
compilation terminated.
  PMDINFO ifpga_rawdev.o.pmd.c
  CC ifpga_rawdev.o.pmd.o

*Failed Build #10:
OS: FC28
Target: x86_64-native-linuxapp-gcc
  PMDINFO dpaa2_cmdif.o.pmd.c
  CC dpaa2_cmdif.o.pmd.o
  LD dpaa2_cmdif.o
  AR librte_pmd_dpaa2_cmdif.a
  INSTALL-LIB librte_pmd_dpaa2_cmdif.a
  CC ifpga_fme_error.o
  PMDINFO skeleton_rawdev.o.pmd.c
  CC skeleton_rawdev.o.pmd.o
  LD skeleton_rawdev.o
  CC ifpga_port.o
  CC ifpga_port_error.o
  AR librte_pmd_skeleton_rawdev.a
  INSTALL-LIB librte_pmd_skeleton_rawdev.a
  CC opae_hw_api.o
  CC opae_ifpga_hw_api.o
  PMDINFO dpaa2_qdma.o.pmd.c
--
  CC opae_intel_max10.o
  CC opae_i2c.o
  CC opae_at24_eeprom.o
  CC opae_eth_group.o
  AR librte_pmd_dpaa2_qdma.a
/tmp/FC28_K4.16.3_GCC8.0.1/x86_64-native-linuxapp-gcc/fc7ae441052f49ad94251bf385f2ff6f/dpdk/drivers/raw/ifpga_rawdev/base/opae_intel_max10.c:6:10: fatal error: libfdt.h: No such file or directory
 #include <libfdt.h>
          ^~~~~~~~~~
compilation terminated.
make[6]: *** [/tmp/FC28_K4.16.3_GCC8.0.1/x86_64-native-linuxapp-gcc/fc7ae441052f49ad94251bf385f2ff6f/dpdk/mk/internal/rte.compile-pre.mk:116: opae_intel_max10.o] Error 1
make[6]: *** Waiting for unfinished jobs....

*Failed Build #11:
OS: FC28
Target: x86_64-native-linuxapp-clang
  CC dpaa2_qdma.o
  CC ifpga_fme.o
  CC ifpga_fme_iperf.o
  CC skeleton_rawdev.o
  CC ifpga_fme_dperf.o
  CC ifpga_fme_error.o
  PMDINFO dpaa2_cmdif.o.pmd.c
  CC dpaa2_cmdif.o.pmd.o
  LD dpaa2_cmdif.o
  AR librte_pmd_dpaa2_cmdif.a
  INSTALL-LIB librte_pmd_dpaa2_cmdif.a
  CC ifpga_port.o
  CC ifpga_port_error.o
  CC opae_hw_api.o
  CC opae_ifpga_hw_api.o
  CC skeleton_rawdev_test.o
  CC opae_debug.o
  PMDINFO skeleton_rawdev.o.pmd.c
--
  CC ifpga_rawdev.o
  AR librte_pmd_dpaa2_qdma.a
  INSTALL-LIB librte_pmd_dpaa2_qdma.a
  AR librte_pmd_skeleton_rawdev.a
  INSTALL-LIB librte_pmd_skeleton_rawdev.a
/tmp/FC28_K4.16.3_Clang6.0.1/x86_64-native-linuxapp-clang/fc7ae441052f49ad94251bf385f2ff6f/dpdk/drivers/raw/ifpga_rawdev/base/opae_intel_max10.c:6:10: fatal error: 'libfdt.h' file not found
#include <libfdt.h>
         ^~~~~~~~~~
1 error generated.
make[6]: *** [/tmp/FC28_K4.16.3_Clang6.0.1/x86_64-native-linuxapp-clang/fc7ae441052f49ad94251bf385f2ff6f/dpdk/mk/internal/rte.compile-pre.mk:114: opae_intel_max10.o] Error 1
make[6]: *** Waiting for unfinished jobs....
  PMDINFO ifpga_rawdev.o.pmd.c
  CC ifpga_rawdev.o.pmd.o
  LD ifpga_rawdev.o

*Failed Build #12:
OS: FreeBSD11.2
Target: x86_64-native-bsdapp-gcc
  CC rte_hypervisor.o
  CC rte_spinlock.o
  CC rte_cycles.o
  AR librte_eal.a
  INSTALL-LIB librte_eal.a
gmake[7]: warning:  Clock skew detected.  Your build may be incomplete.
== Build lib/librte_cmdline
== Build lib/librte_ring
== Build lib/librte_acl
== Build lib/librte_meter
== Build lib/librte_jobstats
--
  CC rte_mbuf.o
  CC rte_mbuf_ptype.o
  CC rte_mbuf_pool_ops.o
  AR librte_mbuf.a
  INSTALL-LIB librte_mbuf.a
gmake[5]: warning:  Clock skew detected.  Your build may be incomplete.
== Build lib/librte_bbdev
== Build lib/librte_net
== Build lib/librte_reorder
== Build lib/librte_compressdev
== Build lib/librte_cryptodev
--
== Build lib/librte_lpm
== Build lib/librte_efd
== Build lib/librte_member
  AR librte_net.a
  INSTALL-LIB librte_net.a
gmake[5]: warning:  Clock skew detected.  Your build may be incomplete.
== Build lib/librte_ethdev
== Build lib/librte_sched
  AR librte_cryptodev.a
  INSTALL-LIB librte_cryptodev.a
  AR librte_bbdev.a
--
  INSTALL-LIB librte_member.a
  AR librte_sched.a
  INSTALL-LIB librte_sched.a
  AR librte_ethdev.a
  INSTALL-LIB librte_ethdev.a
gmake[5]: warning:  Clock skew detected.  Your build may be incomplete.
== Build lib/librte_rawdev
== Build lib/librte_ip_frag
== Build lib/librte_bitratestats
== Build lib/librte_eventdev
== Build lib/librte_latencystats
--
  CC rte_port_fd.o
  CC rte_port_source_sink.o
  CC rte_port_sym_crypto.o
  AR librte_ipsec.a
  INSTALL-LIB librte_ipsec.a
gmake[5]: warning:  Clock skew detected.  Your build may be incomplete.
  AR librte_bpf.a
  INSTALL-LIB librte_bpf.a
  AR librte_eventdev.a
  INSTALL-LIB librte_eventdev.a
  AR librte_port.a
--
awk -f /usr/src/sys/tools/makeobjops.awk /usr/src/sys/kern/device_if.m -h
awk -f /usr/src/sys/tools/makeobjops.awk /usr/src/sys/kern/bus_if.m -h
awk -f /usr/src/sys/tools/makeobjops.awk /usr/src/sys/kern/bus_if.m -h
awk -f /usr/src/sys/tools/makeobjops.awk /usr/src/sys/dev/pci/pci_if.m -h
Warning: Object directory not changed from original /tmp/FreeBSD11.2_K11.2_GCC6.4.0/x86_64-native-bsdapp-gcc/fc7ae441052f49ad94251bf385f2ff6f/dpdk/x86_64-native-bsdapp-gcc/build/kernel/freebsd/contigmem
cc -Winline -Wall -Werror -include /tmp/FreeBSD11.2_K11.2_GCC6.4.0/x86_64-native-bsdapp-gcc/fc7ae441052f49ad94251bf385f2ff6f/dpdk/x86_64-native-bsdapp-gcc/include/rte_config.h  -Werror -D_KERNEL -DKLD_MODULE -nostdinc  -I/tmp/FreeBSD11.2_K11.2_GCC6.4.0/x86_64-native-bsdapp-gcc/fc7ae441052f49ad94251bf385f2ff6f/dpdk/kernel/freebsd/contigmem -I/tmp/FreeBSD11.2_K11.2_GCC6.4.0/x86_64-native-bsdapp-gcc/fc7ae441052f49ad94251bf385f2ff6f/dpdk/x86_64-native-bsdapp-gcc/include -I. -I/usr/src/sys -fno-common  -fno-omit-frame-pointer -mno-omit-leaf-frame-pointer   -MD  -MF.depend.contigmem.o -MTcontigmem.o -mcmodel=kernel -mno-red-zone -mno-mmx -mno-sse -msoft-float  -fno-asynchronous-unwind-tables -ffreestanding -fwrapv -fstack-protector -Wall -Wredundant-decls -Wnested-externs -Wstrict-prototypes -Wmissing-prototypes -Wpointer-arith -Winline -Wcast-qual -Wundef -Wno-pointer-sign -D__printf__=__freebsd_kprintf__ -Wmissing-include-dirs -fdiagnostics-show-option -Wno-unknown-pragmas -Wno-error-tautological-compare -Wno-error-empty-body -Wno-error-parentheses-equality -Wno-error-unused-function -Wno-error-pointer-sign -Wno-error-shift-negative-value -Wno-error-address-of-packed-member  -mno-aes -mno-avx  -std=iso9899:1999 -c contigmem.c -o contigmem.o
Warning: Object directory not changed from original /tmp/FreeBSD11.2_K11.2_GCC6.4.0/x86_64-native-bsdapp-gcc/fc7ae441052f49ad94251bf385f2ff6f/dpdk/x86_64-native-bsdapp-gcc/build/kernel/freebsd/nic_uio
cc -Winline -Wall -Werror -include /tmp/FreeBSD11.2_K11.2_GCC6.4.0/x86_64-native-bsdapp-gcc/fc7ae441052f49ad94251bf385f2ff6f/dpdk/x86_64-native-bsdapp-gcc/include/rte_config.h  -Werror -D_KERNEL -DKLD_MODULE -nostdinc  -I/tmp/FreeBSD11.2_K11.2_GCC6.4.0/x86_64-native-bsdapp-gcc/fc7ae441052f49ad94251bf385f2ff6f/dpdk/kernel/freebsd/nic_uio -I/tmp/FreeBSD11.2_K11.2_GCC6.4.0/x86_64-native-bsdapp-gcc/fc7ae441052f49ad94251bf385f2ff6f/dpdk/x86_64-native-bsdapp-gcc/include -I. -I/usr/src/sys -fno-common  -fno-omit-frame-pointer -mno-omit-leaf-frame-pointer   -MD  -MF.depend.nic_uio.o -MTnic_uio.o -mcmodel=kernel -mno-red-zone -mno-mmx -mno-sse -msoft-float  -fno-asynchronous-unwind-tables -ffreestanding -fwrapv -fstack-protector -Wall -Wredundant-decls -Wnested-externs -Wstrict-prototypes -Wmissing-prototypes -Wpointer-arith -Winline -Wcast-qual -Wundef -Wno-pointer-sign -D__printf__=__freebsd_kprintf__ -Wmissing-include-dirs -fdiagnostics-show-option -Wno-unknown-pragmas -Wno-error-tautological-compare -Wno-error-empty-body -Wno-error-parentheses-equality -Wno-error-unused-function -Wno-error-pointer-sign -Wno-error-shift-negative-value -Wno-error-address-of-packed-member  -mno-aes -mno-avx  -std=iso9899:1999 -c nic_uio.c -o nic_uio.o
== Build drivers/common
ld -L/tmp/FreeBSD11.2_K11.2_GCC6.4.0/x86_64-native-bsdapp-gcc/fc7ae441052f49ad94251bf385f2ff6f/dpdk/x86_64-native-bsdapp-gcc/lib -d -warn-common -r -d -o contigmem.ko contigmem.o
:> export_syms
awk -f /usr/src/sys/conf/kmod_syms.awk contigmem.ko  export_syms | xargs -J% objcopy % contigmem.ko
ld -L/tmp/FreeBSD11.2_K11.2_GCC6.4.0/x86_64-native-bsdapp-gcc/fc7ae441052f49ad94251bf385f2ff6f/dpdk/x86_64-native-bsdapp-gcc/lib -d -warn-common -r -d -o nic_uio.ko nic_uio.o
--
  INSTALL-LIB librte_bus_pci.a
  AR librte_bus_vdev.a
  INSTALL-LIB librte_bus_vdev.a
  AR librte_bus_ifpga.a
  INSTALL-LIB librte_bus_ifpga.a
gmake[6]: warning:  Clock skew detected.  Your build may be incomplete.
== Build drivers/mempool
== Build drivers/mempool/bucket
== Build drivers/mempool/stack
== Build drivers/mempool/ring
== Build drivers/mempool/octeontx
--
== Build drivers/net/bnxt
  CC e1000_mac.o
  CC fm10k_rxtx_vec.o
  AR librte_pmd_ipn3ke.a
  INSTALL-LIB librte_pmd_ipn3ke.a
gmake[6]: warning:  Clock skew detected.  Your build may be incomplete.
  CC i40e_rxtx_vec_sse.o
  CC l2t.o
  CC e1000_manage.o
  CC ice_switch.o
  CC t4vf_hw.o
--
  CC hunt_nic.o
  CC medford_nic.o
  CC medford2_nic.o
  AR librte_pmd_sfc_efx.a
  INSTALL-LIB librte_pmd_sfc_efx.a
gmake[5]: warning:  Clock skew detected.  Your build may be incomplete.
== Build drivers/event
== Build drivers/event/skeleton
== Build drivers/event/octeontx
== Build drivers/event/dsw
== Build drivers/event/sw
--
  CC ifpga_fme.o
  CC skeleton_rawdev.o
  CC ifpga_fme_iperf.o
  CC ifpga_port.o
  CC ifpga_fme_dperf.o
  CC ifpga_fme_error.o
  CC skeleton_rawdev_test.o
  CC ifpga_port_error.o
  CC opae_hw_api.o
  CC opae_ifpga_hw_api.o
  CC ifpga_fme_pr.o
  CC opae_debug.o
  PMDINFO skeleton_rawdev.o.pmd.c
--
  CC opae_at24_eeprom.o
  CC opae_eth_group.o
  CC opae_i2c.o
  CC ifpga_rawdev.o
  INSTALL-LIB librte_pmd_skeleton_rawdev.a
/tmp/FreeBSD11.2_K11.2_GCC6.4.0/x86_64-native-bsdapp-gcc/fc7ae441052f49ad94251bf385f2ff6f/dpdk/drivers/raw/ifpga_rawdev/base/opae_intel_max10.c:6:20: fatal error: libfdt.h: No such file or directory
 #include <libfdt.h>
                    ^
compilation terminated.
gmake[6]: *** [/tmp/FreeBSD11.2_K11.2_GCC6.4.0/x86_64-native-bsdapp-gcc/fc7ae441052f49ad94251bf385f2ff6f/dpdk/mk/internal/rte.compile-pre.mk:114: opae_intel_max10.o] Error 1
gmake[6]: *** Waiting for unfinished jobs....

*Failed Build #13:
OS: FreeBSD12.0
Target: x86_64-native-bsdapp-clang
  CC rte_hypervisor.o
  CC rte_spinlock.o
  CC rte_cycles.o
  AR librte_eal.a
  INSTALL-LIB librte_eal.a
gmake[7]: warning:  Clock skew detected.  Your build may be incomplete.
== Build lib/librte_ring
== Build lib/librte_timer
== Build lib/librte_cmdline
== Build lib/librte_pci
== Build lib/librte_meter
--
  CC rte_mbuf.o
  CC rte_mbuf_ptype.o
  CC rte_mbuf_pool_ops.o
  AR librte_mbuf.a
  INSTALL-LIB librte_mbuf.a
gmake[5]: warning:  Clock skew detected.  Your build may be incomplete.
== Build lib/librte_net
== Build lib/librte_bbdev
== Build lib/librte_cryptodev
== Build lib/librte_compressdev
== Build lib/librte_reorder
--
  CC rte_member.o
  CC rte_arp.o
  CC rte_lpm6.o
  AR librte_net.a
  INSTALL-LIB librte_net.a
gmake[5]: warning:  Clock skew detected.  Your build may be incomplete.
  CC rte_member_ht.o
  CC rte_member_vbf.o
== Build lib/librte_ethdev
  AR librte_cryptodev.a
  INSTALL-LIB librte_cryptodev.a
--
  CC rte_approx.o
  AR librte_sched.a
  INSTALL-LIB librte_sched.a
  AR librte_ethdev.a
  INSTALL-LIB librte_ethdev.a
gmake[5]: warning:  Clock skew detected.  Your build may be incomplete.
== Build lib/librte_security
== Build lib/librte_eventdev
== Build lib/librte_ip_frag
== Build lib/librte_gro
== Build lib/librte_bitratestats
--
  SYMLINK-FILE include/rte_port_ring.h
  SYMLINK-FILE include/rte_port_frag.h
  AR librte_ipsec.a
  INSTALL-LIB librte_ipsec.a
  SYMLINK-FILE include/rte_port_ras.h
gmake[5]: warning:  Clock skew detected.  Your build may be incomplete.
  CC bpf_pkt.o
  SYMLINK-FILE include/rte_port_sched.h
  SYMLINK-FILE include/rte_port_fd.h
  SYMLINK-FILE include/rte_port_source_sink.h
  CC bpf_validate.o
--
awk -f /usr/src/sys/tools/makeobjops.awk /usr/src/sys/kern/device_if.m -h
awk -f /usr/src/sys/tools/makeobjops.awk /usr/src/sys/kern/bus_if.m -h
awk -f /usr/src/sys/tools/makeobjops.awk /usr/src/sys/dev/pci/pci_if.m -h
== Build drivers/common
Warning: Object directory not changed from original /tmp/FreeBSD12.0_K19.02_Clang6.0.1/x86_64-native-bsdapp-clang/fc7ae441052f49ad94251bf385f2ff6f/dpdk/x86_64-native-bsdapp-clang/build/kernel/freebsd/nic_uio
cc  -Winline -Wall -Werror -include /tmp/FreeBSD12.0_K19.02_Clang6.0.1/x86_64-native-bsdapp-clang/fc7ae441052f49ad94251bf385f2ff6f/dpdk/x86_64-native-bsdapp-clang/include/rte_config.h  -Werror -D_KERNEL -DKLD_MODULE -nostdinc  -I/tmp/FreeBSD12.0_K19.02_Clang6.0.1/x86_64-native-bsdapp-clang/fc7ae441052f49ad94251bf385f2ff6f/dpdk/kernel/freebsd/nic_uio -I/tmp/FreeBSD12.0_K19.02_Clang6.0.1/x86_64-native-bsdapp-clang/fc7ae441052f49ad94251bf385f2ff6f/dpdk/x86_64-native-bsdapp-clang/include -I. -I/usr/src/sys -I/usr/src/sys/contrib/ck/include -fno-common  -fno-omit-frame-pointer -mno-omit-leaf-frame-pointer   -MD  -MF.depend.nic_uio.o -MTnic_uio.o -mcmodel=kernel -mno-red-zone -mno-mmx -mno-sse -msoft-float  -fno-asynchronous-unwind-tables -ffreestanding -fwrapv -fstack-protector -Wall -Wredundant-decls -Wnested-externs -Wstrict-prototypes -Wmissing-prototypes -Wpointer-arith -Wcast-qual -Wundef -Wno-pointer-sign -D__printf__=__freebsd_kprintf__ -Wmissing-include-dirs -fdiagnostics-show-option -Wno-unknown-pragmas -Wno-error-tautological-compare -Wno-error-empty-body -Wno-error-parentheses-equality -Wno-error-unused-function -Wno-error-pointer-sign -Wno-error-shift-negative-value -Wno-address-of-packed-member  -mno-aes -mno-avx  -std=iso9899:1999 -c nic_uio.c -o nic_uio.o
machine -> /usr/src/sys/amd64/include
x86 -> /usr/src/sys/x86/include
awk -f /usr/src/sys/tools/makeobjops.awk /usr/src/sys/kern/device_if.m -h
awk -f /usr/src/sys/tools/makeobjops.awk /usr/src/sys/kern/bus_if.m -h
Warning: Object directory not changed from original /tmp/FreeBSD12.0_K19.02_Clang6.0.1/x86_64-native-bsdapp-clang/fc7ae441052f49ad94251bf385f2ff6f/dpdk/x86_64-native-bsdapp-clang/build/kernel/freebsd/contigmem
cc  -Winline -Wall -Werror -include /tmp/FreeBSD12.0_K19.02_Clang6.0.1/x86_64-native-bsdapp-clang/fc7ae441052f49ad94251bf385f2ff6f/dpdk/x86_64-native-bsdapp-clang/include/rte_config.h  -Werror -D_KERNEL -DKLD_MODULE -nostdinc  -I/tmp/FreeBSD12.0_K19.02_Clang6.0.1/x86_64-native-bsdapp-clang/fc7ae441052f49ad94251bf385f2ff6f/dpdk/kernel/freebsd/contigmem -I/tmp/FreeBSD12.0_K19.02_Clang6.0.1/x86_64-native-bsdapp-clang/fc7ae441052f49ad94251bf385f2ff6f/dpdk/x86_64-native-bsdapp-clang/include -I. -I/usr/src/sys -I/usr/src/sys/contrib/ck/include -fno-common  -fno-omit-frame-pointer -mno-omit-leaf-frame-pointer   -MD  -MF.depend.contigmem.o -MTcontigmem.o -mcmodel=kernel -mno-red-zone -mno-mmx -mno-sse -msoft-float  -fno-asynchronous-unwind-tables -ffreestanding -fwrapv -fstack-protector -Wall -Wredundant-decls -Wnested-externs -Wstrict-prototypes -Wmissing-prototypes -Wpointer-arith -Wcast-qual -Wundef -Wno-pointer-sign -D__printf__=__freebsd_kprintf__ -Wmissing-include-dirs -fdiagnostics-show-option -Wno-unknown-pragmas -Wno-error-tautological-compare -Wno-error-empty-body -Wno-error-parentheses-equality -Wno-error-unused-function -Wno-error-pointer-sign -Wno-error-shift-negative-value -Wno-address-of-packed-member  -mno-aes -mno-avx  -std=iso9899:1999 -c contigmem.c -o contigmem.o
== Build drivers/common/octeontx
== Build drivers/common/cpt
  CC cpt_pmd_ops_helper.o
  CC octeontx_mbox.o
ld -m elf_x86_64_fbsd -L/tmp/FreeBSD12.0_K19.02_Clang6.0.1/x86_64-native-bsdapp-clang/fc7ae441052f49ad94251bf385f2ff6f/dpdk/x86_64-native-bsdapp-clang/lib -d -warn-common --build-id=sha1 -r -d -o contigmem.ko contigmem.o
--
  CC bsd/pci.o
  CC pci_common.o
  CC pci_common_uio.o
  AR librte_bus_ifpga.a
  INSTALL-LIB librte_bus_ifpga.a
gmake[6]: warning:  Clock skew detected.  Your build may be incomplete.
  AR librte_bus_pci.a
  INSTALL-LIB librte_bus_pci.a
  AR librte_bus_vdev.a
  INSTALL-LIB librte_bus_vdev.a
== Build drivers/mempool
--
  AR librte_pmd_ipn3ke.a
  INSTALL-LIB librte_pmd_ipn3ke.a
  PMDINFO i40e_ethdev.o.pmd.c
  CC i40e_ethdev.o.pmd.o
  CC ixgbe_x550.o
gmake[6]: warning:  Clock skew detected.  Your build may be incomplete.
  LD i40e_ethdev.o
  CC lio_mbox.o
  CC i40e_ethdev_vf.o
  CC i40e_pf.o
  CC i40e_fdir.o
--
  CC hunt_nic.o
  CC medford_nic.o
  CC medford2_nic.o
  AR librte_pmd_sfc_efx.a
  INSTALL-LIB librte_pmd_sfc_efx.a
gmake[5]: warning:  Clock skew detected.  Your build may be incomplete.
== Build drivers/event
== Build drivers/event/sw
== Build drivers/event/skeleton
== Build drivers/event/octeontx
== Build drivers/event/dsw
--
  CC ifpga_feature_dev.o
  CC ifpga_fme.o
  CC ifpga_enumerate.o
  CC ifpga_fme_iperf.o
  CC ifpga_fme_dperf.o
  CC ifpga_fme_error.o
  CC ifpga_port.o
  CC ifpga_port_error.o
  PMDINFO skeleton_rawdev.o.pmd.c
  CC skeleton_rawdev.o.pmd.o
  LD skeleton_rawdev.o
  CC opae_hw_api.o
  CC opae_debug.o
--
  CC opae_spi_transaction.o
  CC opae_intel_max10.o
  CC opae_at24_eeprom.o
  CC opae_i2c.o
  CC opae_eth_group.o
/tmp/FreeBSD12.0_K19.02_Clang6.0.1/x86_64-native-bsdapp-clang/fc7ae441052f49ad94251bf385f2ff6f/dpdk/drivers/raw/ifpga_rawdev/base/opae_intel_max10.c:6:10: fatal error: 'libfdt.h' file not found
#include <libfdt.h>
         ^~~~~~~~~~
1 error generated.
gmake[6]: *** [/tmp/FreeBSD12.0_K19.02_Clang6.0.1/x86_64-native-bsdapp-clang/fc7ae441052f49ad94251bf385f2ff6f/dpdk/mk/internal/rte.compile-pre.mk:116: opae_intel_max10.o] Error 1
gmake[6]: *** Waiting for unfinished jobs....
  CC ifpga_rawdev.o
  PMDINFO ifpga_rawdev.o.pmd.c
  CC ifpga_rawdev.o.pmd.o

*Failed Build #14:
OS: FreeBSD11.2
Target: x86_64-native-bsdapp-clang
  CC rte_hypervisor.o
  CC rte_spinlock.o
  CC rte_cycles.o
  AR librte_eal.a
  INSTALL-LIB librte_eal.a
gmake[7]: warning:  Clock skew detected.  Your build may be incomplete.
== Build lib/librte_ring
== Build lib/librte_pci
== Build lib/librte_timer
== Build lib/librte_cmdline
== Build lib/librte_metrics
--
  CC rte_mbuf.o
  CC rte_mbuf_ptype.o
  CC rte_mbuf_pool_ops.o
  AR librte_mbuf.a
  INSTALL-LIB librte_mbuf.a
gmake[5]: warning:  Clock skew detected.  Your build may be incomplete.
== Build lib/librte_net
== Build lib/librte_bbdev
== Build lib/librte_cryptodev
== Build lib/librte_compressdev
== Build lib/librte_reorder
--
  INSTALL-LIB librte_compressdev.a
  AR librte_bbdev.a
  INSTALL-LIB librte_bbdev.a
  AR librte_net.a
  INSTALL-LIB librte_net.a
gmake[5]: warning:  Clock skew detected.  Your build may be incomplete.
== Build lib/librte_ethdev
== Build lib/librte_sched
  AR librte_lpm.a
  INSTALL-LIB librte_lpm.a
  SYMLINK-FILE include/rte_sched.h
--
  CC ethdev_profile.o
  AR librte_sched.a
  INSTALL-LIB librte_sched.a
  AR librte_ethdev.a
  INSTALL-LIB librte_ethdev.a
gmake[5]: warning:  Clock skew detected.  Your build may be incomplete.
== Build lib/librte_security
== Build lib/librte_rawdev
== Build lib/librte_eventdev
== Build lib/librte_ip_frag
== Build lib/librte_gro
--
  CC bpf_pkt.o
  AR librte_ipsec.a
  CC rte_port_frag.o
  INSTALL-LIB librte_ipsec.a
  CC rte_port_ring.o
gmake[5]: warning:  Clock skew detected.  Your build may be incomplete.
  CC bpf_validate.o
  CC rte_port_ras.o
  CC bpf_jit_x86.o
  CC rte_port_sched.o
  CC rte_port_fd.o
--
awk -f /usr/src/sys/tools/makeobjops.awk /usr/src/sys/kern/device_if.m -h
awk -f /usr/src/sys/tools/makeobjops.awk /usr/src/sys/kern/bus_if.m -h
awk -f /usr/src/sys/tools/makeobjops.awk /usr/src/sys/dev/pci/pci_if.m -h
awk -f /usr/src/sys/tools/makeobjops.awk /usr/src/sys/kern/bus_if.m -h
Warning: Object directory not changed from original /tmp/FreeBSD11.2_K11.2_Clang6.0.0/x86_64-native-bsdapp-clang/fc7ae441052f49ad94251bf385f2ff6f/dpdk/x86_64-native-bsdapp-clang/build/kernel/freebsd/nic_uio
cc -Winline -Wall -Werror -include /tmp/FreeBSD11.2_K11.2_Clang6.0.0/x86_64-native-bsdapp-clang/fc7ae441052f49ad94251bf385f2ff6f/dpdk/x86_64-native-bsdapp-clang/include/rte_config.h  -Werror -D_KERNEL -DKLD_MODULE -nostdinc  -I/tmp/FreeBSD11.2_K11.2_Clang6.0.0/x86_64-native-bsdapp-clang/fc7ae441052f49ad94251bf385f2ff6f/dpdk/kernel/freebsd/nic_uio -I/tmp/FreeBSD11.2_K11.2_Clang6.0.0/x86_64-native-bsdapp-clang/fc7ae441052f49ad94251bf385f2ff6f/dpdk/x86_64-native-bsdapp-clang/include -I. -I/usr/src/sys -fno-common  -fno-omit-frame-pointer -mno-omit-leaf-frame-pointer   -MD  -MF.depend.nic_uio.o -MTnic_uio.o -mcmodel=kernel -mno-red-zone -mno-mmx -mno-sse -msoft-float  -fno-asynchronous-unwind-tables -ffreestanding -fwrapv -fstack-protector -Wall -Wredundant-decls -Wnested-externs -Wstrict-prototypes -Wmissing-prototypes -Wpointer-arith -Winline -Wcast-qual -Wundef -Wno-pointer-sign -D__printf__=__freebsd_kprintf__ -Wmissing-include-dirs -fdiagnostics-show-option -Wno-unknown-pragmas -Wno-error-tautological-compare -Wno-error-empty-body -Wno-error-parentheses-equality -Wno-error-unused-function -Wno-error-pointer-sign -Wno-error-shift-negative-value -Wno-error-address-of-packed-member  -mno-aes -mno-avx  -std=iso9899:1999 -c nic_uio.c -o nic_uio.o
Warning: Object directory not changed from original /tmp/FreeBSD11.2_K11.2_Clang6.0.0/x86_64-native-bsdapp-clang/fc7ae441052f49ad94251bf385f2ff6f/dpdk/x86_64-native-bsdapp-clang/build/kernel/freebsd/contigmem
cc -Winline -Wall -Werror -include /tmp/FreeBSD11.2_K11.2_Clang6.0.0/x86_64-native-bsdapp-clang/fc7ae441052f49ad94251bf385f2ff6f/dpdk/x86_64-native-bsdapp-clang/include/rte_config.h  -Werror -D_KERNEL -DKLD_MODULE -nostdinc  -I/tmp/FreeBSD11.2_K11.2_Clang6.0.0/x86_64-native-bsdapp-clang/fc7ae441052f49ad94251bf385f2ff6f/dpdk/kernel/freebsd/contigmem -I/tmp/FreeBSD11.2_K11.2_Clang6.0.0/x86_64-native-bsdapp-clang/fc7ae441052f49ad94251bf385f2ff6f/dpdk/x86_64-native-bsdapp-clang/include -I. -I/usr/src/sys -fno-common  -fno-omit-frame-pointer -mno-omit-leaf-frame-pointer   -MD  -MF.depend.contigmem.o -MTcontigmem.o -mcmodel=kernel -mno-red-zone -mno-mmx -mno-sse -msoft-float  -fno-asynchronous-unwind-tables -ffreestanding -fwrapv -fstack-protector -Wall -Wredundant-decls -Wnested-externs -Wstrict-prototypes -Wmissing-prototypes -Wpointer-arith -Winline -Wcast-qual -Wundef -Wno-pointer-sign -D__printf__=__freebsd_kprintf__ -Wmissing-include-dirs -fdiagnostics-show-option -Wno-unknown-pragmas -Wno-error-tautological-compare -Wno-error-empty-body -Wno-error-parentheses-equality -Wno-error-unused-function -Wno-error-pointer-sign -Wno-error-shift-negative-value -Wno-error-address-of-packed-member  -mno-aes -mno-avx  -std=iso9899:1999 -c contigmem.c -o contigmem.o
== Build drivers/common/cpt
== Build drivers/common/octeontx
ld -L/tmp/FreeBSD11.2_K11.2_Clang6.0.0/x86_64-native-bsdapp-clang/fc7ae441052f49ad94251bf385f2ff6f/dpdk/x86_64-native-bsdapp-clang/lib -d -warn-common -r -d -o contigmem.ko contigmem.o
:> export_syms
awk -f /usr/src/sys/conf/kmod_syms.awk contigmem.ko  export_syms | xargs -J% objcopy % contigmem.ko
--
  CC vdev_params.o
  AR librte_bus_pci.a
  INSTALL-LIB librte_bus_pci.a
  AR librte_bus_ifpga.a
  INSTALL-LIB librte_bus_ifpga.a
gmake[6]: warning:  Clock skew detected.  Your build may be incomplete.
  AR librte_bus_vdev.a
  INSTALL-LIB librte_bus_vdev.a
== Build drivers/mempool
== Build drivers/mempool/stack
== Build drivers/mempool/octeontx
--
  PMDINFO igb_ethdev.o.pmd.c
  CC igb_ethdev.o.pmd.o
  AR librte_pmd_ipn3ke.a
  INSTALL-LIB librte_pmd_ipn3ke.a
  INSTALL-LIB librte_pmd_cxgbe.a
gmake[6]: warning:  Clock skew detected.  Your build may be incomplete.
  LD igb_ethdev.o
  CC lio_rxtx.o
  CC i40e_rxtx.o
  AR librte_pmd_iavf.a
  CC igb_rxtx.o
--
  CC hunt_nic.o
  CC medford_nic.o
  CC medford2_nic.o
  AR librte_pmd_sfc_efx.a
  INSTALL-LIB librte_pmd_sfc_efx.a
gmake[5]: warning:  Clock skew detected.  Your build may be incomplete.
== Build drivers/event
== Build drivers/event/skeleton
== Build drivers/event/sw
== Build drivers/event/dsw
== Build drivers/event/opdl
--
  CC skeleton_rawdev_test.o
  CC ifpga_feature_dev.o
  CC ifpga_enumerate.o
  CC ifpga_fme.o
  CC ifpga_fme_dperf.o
  CC ifpga_fme_error.o
  CC ifpga_fme_iperf.o
  CC ifpga_port.o
  CC ifpga_port_error.o
  PMDINFO skeleton_rawdev.o.pmd.c
  CC skeleton_rawdev.o.pmd.o
  LD skeleton_rawdev.o
  CC opae_hw_api.o
  CC opae_ifpga_hw_api.o
--
  INSTALL-LIB librte_pmd_skeleton_rawdev.a
  CC opae_i2c.o
  CC opae_at24_eeprom.o
  CC opae_eth_group.o
  CC ifpga_rawdev.o
/tmp/FreeBSD11.2_K11.2_Clang6.0.0/x86_64-native-bsdapp-clang/fc7ae441052f49ad94251bf385f2ff6f/dpdk/drivers/raw/ifpga_rawdev/base/opae_intel_max10.c:6:10: fatal error: 'libfdt.h' file not found
  PMDINFO ifpga_rawdev.o.pmd.c
  CC ifpga_rawdev.o.pmd.o
  LD ifpga_rawdev.o
#include <libfdt.h>
         ^~~~~~~~~~
1 error generated.
gmake[6]: *** [/tmp/FreeBSD11.2_K11.2_Clang6.0.0/x86_64-native-bsdapp-clang/fc7ae441052f49ad94251bf385f2ff6f/dpdk/mk/internal/rte.compile-pre.mk:114: opae_intel_max10.o] Error 1
gmake[5]: *** [/tmp/FreeBSD11.2_K11.2_Clang6.0.0/x86_64-native-bsdapp-clang/fc7ae441052f49ad94251bf385f2ff6f/dpdk/mk/rte.subdir.mk:35: ifpga_rawdev] Error 2
gmake[4]: *** [/tmp/FreeBSD11.2_K11.2_Clang6.0.0/x86_64-native-bsdapp-clang/fc7ae441052f49ad94251bf385f2ff6f/dpdk/mk/rte.subdir.mk:37: raw] Error 2
gmake[3]: *** [/tmp/FreeBSD11.2_K11.2_Clang6.0.0/x86_64-native-bsdapp-clang/fc7ae441052f49ad94251bf385f2ff6f/dpdk/mk/rte.sdkbuild.mk:46: drivers] Error 2
gmake[2]: *** [/tmp/FreeBSD11.2_K11.2_Clang6.0.0/x86_64-native-bsdapp-clang/fc7ae441052f49ad94251bf385f2ff6f/dpdk/mk/rte.sdkroot.mk:99: all] Error 2

*Failed Build #15:
OS: FreeBSD12.0
Target: x86_64-native-bsdapp-gcc
  CC rte_hypervisor.o
  CC rte_spinlock.o
  CC rte_cycles.o
  AR librte_eal.a
  INSTALL-LIB librte_eal.a
gmake[7]: warning:  Clock skew detected.  Your build may be incomplete.
== Build lib/librte_timer
== Build lib/librte_ring
== Build lib/librte_pci
== Build lib/librte_cmdline
== Build lib/librte_meter
--
  CC rte_mbuf.o
  CC rte_mbuf_ptype.o
  CC rte_mbuf_pool_ops.o
  AR librte_mbuf.a
  INSTALL-LIB librte_mbuf.a
gmake[5]: warning:  Clock skew detected.  Your build may be incomplete.
== Build lib/librte_net
== Build lib/librte_bbdev
== Build lib/librte_compressdev
== Build lib/librte_cryptodev
== Build lib/librte_reorder
--
  AR librte_cryptodev.a
  INSTALL-LIB librte_cryptodev.a
  CC rte_member_vbf.o
  AR librte_net.a
  INSTALL-LIB librte_net.a
gmake[5]: warning:  Clock skew detected.  Your build may be incomplete.
== Build lib/librte_ethdev
== Build lib/librte_sched
  AR librte_efd.a
  INSTALL-LIB librte_efd.a
  AR librte_bbdev.a
--
  CC rte_red.o
  AR librte_sched.a
  INSTALL-LIB librte_sched.a
  AR librte_ethdev.a
  INSTALL-LIB librte_ethdev.a
gmake[5]: warning:  Clock skew detected.  Your build may be incomplete.
== Build lib/librte_eventdev
== Build lib/librte_security
== Build lib/librte_ip_frag
== Build lib/librte_gro
== Build lib/librte_bitratestats
--
  CC rte_port_sched.o
  AR librte_ipsec.a
  CC rte_port_fd.o
  INSTALL-LIB librte_ipsec.a
  CC rte_port_source_sink.o
gmake[5]: warning:  Clock skew detected.  Your build may be incomplete.
  CC rte_port_sym_crypto.o
  AR librte_eventdev.a
  INSTALL-LIB librte_eventdev.a
  AR librte_bpf.a
  INSTALL-LIB librte_bpf.a
--
machine -> /usr/src/sys/amd64/include
x86 -> /usr/src/sys/x86/include
awk -f /usr/src/sys/tools/makeobjops.awk /usr/src/sys/kern/device_if.m -h
awk -f /usr/src/sys/tools/makeobjops.awk /usr/src/sys/kern/bus_if.m -h
Warning: Object directory not changed from original /tmp/FreeBSD12.0_K19.02_GCC7.3.0/x86_64-native-bsdapp-gcc/fc7ae441052f49ad94251bf385f2ff6f/dpdk/x86_64-native-bsdapp-gcc/build/kernel/freebsd/contigmem
cc  -Winline -Wall -Werror -include /tmp/FreeBSD12.0_K19.02_GCC7.3.0/x86_64-native-bsdapp-gcc/fc7ae441052f49ad94251bf385f2ff6f/dpdk/x86_64-native-bsdapp-gcc/include/rte_config.h  -Werror -D_KERNEL -DKLD_MODULE -nostdinc  -I/tmp/FreeBSD12.0_K19.02_GCC7.3.0/x86_64-native-bsdapp-gcc/fc7ae441052f49ad94251bf385f2ff6f/dpdk/kernel/freebsd/contigmem -I/tmp/FreeBSD12.0_K19.02_GCC7.3.0/x86_64-native-bsdapp-gcc/fc7ae441052f49ad94251bf385f2ff6f/dpdk/x86_64-native-bsdapp-gcc/include -I. -I/usr/src/sys -I/usr/src/sys/contrib/ck/include -fno-common  -fno-omit-frame-pointer -mno-omit-leaf-frame-pointer   -MD  -MF.depend.contigmem.o -MTcontigmem.o -mcmodel=kernel -mno-red-zone -mno-mmx -mno-sse -msoft-float  -fno-asynchronous-unwind-tables -ffreestanding -fwrapv -fstack-protector -Wall -Wredundant-decls -Wnested-externs -Wstrict-prototypes -Wmissing-prototypes -Wpointer-arith -Wcast-qual -Wundef -Wno-pointer-sign -D__printf__=__freebsd_kprintf__ -Wmissing-include-dirs -fdiagnostics-show-option -Wno-unknown-pragmas -Wno-error-tautological-compare -Wno-error-empty-body -Wno-error-parentheses-equality -Wno-error-unused-function -Wno-error-pointer-sign -Wno-error-shift-negative-value -Wno-address-of-packed-member  -mno-aes -mno-avx  -std=iso9899:1999 -c contigmem.c -o contigmem.o
machine -> /usr/src/sys/amd64/include
x86 -> /usr/src/sys/x86/include
awk -f /usr/src/sys/tools/makeobjops.awk /usr/src/sys/kern/device_if.m -h
awk -f /usr/src/sys/tools/makeobjops.awk /usr/src/sys/kern/bus_if.m -h
awk -f /usr/src/sys/tools/makeobjops.awk /usr/src/sys/dev/pci/pci_if.m -h
Warning: Object directory not changed from original /tmp/FreeBSD12.0_K19.02_GCC7.3.0/x86_64-native-bsdapp-gcc/fc7ae441052f49ad94251bf385f2ff6f/dpdk/x86_64-native-bsdapp-gcc/build/kernel/freebsd/nic_uio
cc  -Winline -Wall -Werror -include /tmp/FreeBSD12.0_K19.02_GCC7.3.0/x86_64-native-bsdapp-gcc/fc7ae441052f49ad94251bf385f2ff6f/dpdk/x86_64-native-bsdapp-gcc/include/rte_config.h  -Werror -D_KERNEL -DKLD_MODULE -nostdinc  -I/tmp/FreeBSD12.0_K19.02_GCC7.3.0/x86_64-native-bsdapp-gcc/fc7ae441052f49ad94251bf385f2ff6f/dpdk/kernel/freebsd/nic_uio -I/tmp/FreeBSD12.0_K19.02_GCC7.3.0/x86_64-native-bsdapp-gcc/fc7ae441052f49ad94251bf385f2ff6f/dpdk/x86_64-native-bsdapp-gcc/include -I. -I/usr/src/sys -I/usr/src/sys/contrib/ck/include -fno-common  -fno-omit-frame-pointer -mno-omit-leaf-frame-pointer   -MD  -MF.depend.nic_uio.o -MTnic_uio.o -mcmodel=kernel -mno-red-zone -mno-mmx -mno-sse -msoft-float  -fno-asynchronous-unwind-tables -ffreestanding -fwrapv -fstack-protector -Wall -Wredundant-decls -Wnested-externs -Wstrict-prototypes -Wmissing-prototypes -Wpointer-arith -Wcast-qual -Wundef -Wno-pointer-sign -D__printf__=__freebsd_kprintf__ -Wmissing-include-dirs -fdiagnostics-show-option -Wno-unknown-pragmas -Wno-error-tautological-compare -Wno-error-empty-body -Wno-error-parentheses-equality -Wno-error-unused-function -Wno-error-pointer-sign -Wno-error-shift-negative-value -Wno-address-of-packed-member  -mno-aes -mno-avx  -std=iso9899:1999 -c nic_uio.c -o nic_uio.o
ld -m elf_x86_64_fbsd -L/tmp/FreeBSD12.0_K19.02_GCC7.3.0/x86_64-native-bsdapp-gcc/fc7ae441052f49ad94251bf385f2ff6f/dpdk/x86_64-native-bsdapp-gcc/lib -d -warn-common --build-id=sha1 -r -d -o contigmem.ko contigmem.o
:> export_syms
awk -f /usr/src/sys/conf/kmod_syms.awk contigmem.ko  export_syms | xargs -J% objcopy % contigmem.ko
objcopy --strip-debug contigmem.ko
INSTALL-MODULE contigmem.ko
--
  INSTALL-LIB librte_bus_pci.a
  AR librte_bus_vdev.a
  INSTALL-LIB librte_bus_vdev.a
  AR librte_bus_ifpga.a
  INSTALL-LIB librte_bus_ifpga.a
gmake[6]: warning:  Clock skew detected.  Your build may be incomplete.
== Build drivers/mempool
== Build drivers/mempool/bucket
== Build drivers/mempool/ring
== Build drivers/mempool/stack
== Build drivers/mempool/octeontx
--
  INSTALL-LIB librte_pmd_fm10k.a
  CC i40e_ethdev_vf.o
  AR librte_pmd_ipn3ke.a
  CC ice_flow.o
  INSTALL-LIB librte_pmd_ipn3ke.a
gmake[6]: warning:  Clock skew detected.  Your build may be incomplete.
  CC ixgbe_82598.o
  PMDINFO lio_ethdev.o.pmd.c
  PMDINFO i40e_ethdev_vf.o.pmd.c
  CC lio_ethdev.o.pmd.o
  CC i40e_ethdev_vf.o.pmd.o
--
  CC hunt_nic.o
  CC medford_nic.o
  CC medford2_nic.o
  AR librte_pmd_sfc_efx.a
  INSTALL-LIB librte_pmd_sfc_efx.a
gmake[5]: warning:  Clock skew detected.  Your build may be incomplete.
== Build drivers/event
== Build drivers/event/dsw
== Build drivers/event/octeontx
== Build drivers/event/sw
== Build drivers/event/skeleton
--
  CC ifpga_enumerate.o
  CC ifpga_feature_dev.o
  CC ifpga_fme.o
  CC ifpga_fme_iperf.o
  CC ifpga_fme_dperf.o
  CC ifpga_fme_error.o
  CC ifpga_port.o
  PMDINFO skeleton_rawdev.o.pmd.c
  CC skeleton_rawdev.o.pmd.o
  CC ifpga_port_error.o
  LD skeleton_rawdev.o
  CC opae_hw_api.o
  CC opae_ifpga_hw_api.o
  AR librte_pmd_skeleton_rawdev.a
  CC opae_debug.o
--
  INSTALL-LIB librte_pmd_skeleton_rawdev.a
  CC opae_intel_max10.o
  CC opae_i2c.o
  CC opae_at24_eeprom.o
  CC opae_eth_group.o
/tmp/FreeBSD12.0_K19.02_GCC7.3.0/x86_64-native-bsdapp-gcc/fc7ae441052f49ad94251bf385f2ff6f/dpdk/drivers/raw/ifpga_rawdev/base/opae_intel_max10.c:6:10: fatal error: libfdt.h: No such file or directory
 #include <libfdt.h>
          ^~~~~~~~~~
compilation terminated.
  CC ifpga_rawdev.o
gmake[6]: *** [/tmp/FreeBSD12.0_K19.02_GCC7.3.0/x86_64-native-bsdapp-gcc/fc7ae441052f49ad94251bf385f2ff6f/dpdk/mk/internal/rte.compile-pre.mk:116: opae_intel_max10.o] Error 1

*Failed Build #16:
OS: SUSE15
Target: x86_64-native-linuxapp-gcc
  CC rte_hypervisor.o
  CC rte_spinlock.o
  CC rte_cycles.o
  AR librte_eal.a
  INSTALL-LIB librte_eal.a
make[7]: warning:  Clock skew detected.  Your build may be incomplete.
== Build lib/librte_pci
== Build lib/librte_ring
== Build lib/librte_timer
== Build lib/librte_cmdline
== Build lib/librte_meter
--
== Build lib/librte_efd
== Build lib/librte_lpm
== Build lib/librte_member
  AR librte_mbuf.a
  INSTALL-LIB librte_mbuf.a
make[5]: warning:  Clock skew detected.  Your build may be incomplete.
== Build lib/librte_bbdev
== Build lib/librte_compressdev
== Build lib/librte_net
== Build lib/librte_cryptodev
== Build lib/librte_reorder
--
  CC rte_cryptodev_pmd.o
  CC rte_lpm6.o
  CC rte_comp.o
  AR librte_net.a
  INSTALL-LIB librte_net.a
make[5]: warning:  Clock skew detected.  Your build may be incomplete.
== Build lib/librte_sched
== Build lib/librte_ethdev
  AR librte_lpm.a
  INSTALL-LIB librte_lpm.a
  AR librte_cryptodev.a
--
  INSTALL-LIB librte_compressdev.a
  AR librte_sched.a
  INSTALL-LIB librte_sched.a
  AR librte_ethdev.a
  INSTALL-LIB librte_ethdev.a
make[5]: warning:  Clock skew detected.  Your build may be incomplete.
== Build lib/librte_security
== Build lib/librte_rawdev
== Build lib/librte_eventdev
== Build lib/librte_vhost
== Build lib/librte_ip_frag
--
  CC vdpa.o
  CC rte_event_crypto_adapter.o
  CC rte_event_eth_tx_adapter.o
  AR librte_ipsec.a
  INSTALL-LIB librte_ipsec.a
make[5]: warning:  Clock skew detected.  Your build may be incomplete.
  CC vhost_crypto.o
  CC rte_port_ring.o
  CC rte_port_frag.o
  AR librte_bpf.a
  INSTALL-LIB librte_bpf.a
--
  CC vmbus_bufring.o
  CC vmbus_common_uio.o
  CC base/qbman/process.o
  AR librte_bus_ifpga.a
  INSTALL-LIB librte_bus_ifpga.a
make[6]: warning:  Clock skew detected.  Your build may be incomplete.
  CC base/qbman/bman.o
  CC base/qbman/bman_driver.o
  CC [M]  /tmp/SUSE15_K4.12.14_GCC7.3.1/x86_64-native-linuxapp-gcc/fc7ae441052f49ad94251bf385f2ff6f/dpdk/x86_64-native-linuxapp-gcc/build/kernel/linux/kni/kni_net.o
  CC linux/pci_vfio.o
  CC pci_params.o
--
  CC ice_sched.o
  CC i40e_diag.o
  CC failsafe_ether.o
  AR librte_pmd_ipn3ke.a
  INSTALL-LIB librte_pmd_ipn3ke.a
make[6]: warning:  Clock skew detected.  Your build may be incomplete.
  CC failsafe_flow.o
  CC ixgbe_82599.o
  CC i40e_hmc.o
  PMDINFO iavf_ethdev.o.pmd.c
  CC iavf_ethdev.o.pmd.o
--
  LD virtio_user_ethdev.o
  AR librte_pmd_virtio.a
  AR librte_pmd_softnic.a
  INSTALL-LIB librte_pmd_softnic.a
  INSTALL-LIB librte_pmd_virtio.a
make[5]: warning:  Clock skew detected.  Your build may be incomplete.
== Build drivers/event
== Build drivers/event/skeleton
== Build drivers/event/sw
== Build drivers/event/dsw
== Build drivers/event/octeontx
--
  CC dpaa2_qdma.o
  AR librte_pmd_skeleton_rawdev.a
  PMDINFO dpaa2_cmdif.o.pmd.c
  CC dpaa2_cmdif.o.pmd.o
  LD dpaa2_cmdif.o
  CC ifpga_fme_error.o
  INSTALL-LIB librte_pmd_skeleton_rawdev.a
  CC ifpga_port.o
  AR librte_pmd_dpaa2_cmdif.a
  INSTALL-LIB librte_pmd_dpaa2_cmdif.a
  CC ifpga_port_error.o
  CC opae_hw_api.o
  CC opae_ifpga_hw_api.o
  CC opae_debug.o
  CC ifpga_fme_pr.o
  CC opae_spi.o
--
  CC opae_eth_group.o
  CC ifpga_rawdev.o
  PMDINFO dpaa2_qdma.o.pmd.c
  CC dpaa2_qdma.o.pmd.o
  LD dpaa2_qdma.o
/tmp/SUSE15_K4.12.14_GCC7.3.1/x86_64-native-linuxapp-gcc/fc7ae441052f49ad94251bf385f2ff6f/dpdk/drivers/raw/ifpga_rawdev/base/opae_intel_max10.c:6:10: fatal error: libfdt.h: No such file or directory
 #include <libfdt.h>
          ^~~~~~~~~~
compilation terminated.
make[6]: *** [/tmp/SUSE15_K4.12.14_GCC7.3.1/x86_64-native-linuxapp-gcc/fc7ae441052f49ad94251bf385f2ff6f/dpdk/mk/internal/rte.compile-pre.mk:114: opae_intel_max10.o] Error 1
make[6]: *** Waiting for unfinished jobs....

*Failed Build #17:
OS: RHEL76
Target: x86_64-native-linuxapp-gcc
  PMDINFO dpaa2_cmdif.o.pmd.c
  CC dpaa2_cmdif.o.pmd.o
  CC ifpga_fme_dperf.o
  PMDINFO skeleton_rawdev.o.pmd.c
  CC skeleton_rawdev.o.pmd.o
  CC ifpga_fme_error.o
  LD dpaa2_cmdif.o
  LD skeleton_rawdev.o
  CC ifpga_port.o
  AR librte_pmd_skeleton_rawdev.a
  CC ifpga_port_error.o
  PMDINFO dpaa2_qdma.o.pmd.c
  CC opae_hw_api.o
  AR librte_pmd_dpaa2_cmdif.a
  CC dpaa2_qdma.o.pmd.o
  LD dpaa2_qdma.o
--
  CC opae_spi_transaction.o
  CC opae_intel_max10.o
  CC opae_i2c.o
  CC opae_at24_eeprom.o
  CC opae_eth_group.o
/tmp/RHEL76_K3.10.0_GCC4.8.5/x86_64-native-linuxapp-gcc/fc7ae441052f49ad94251bf385f2ff6f/dpdk/drivers/raw/ifpga_rawdev/base/opae_intel_max10.c:6:20: fatal error: libfdt.h: No such file or directory
 #include <libfdt.h>
                    ^
compilation terminated.
  CC ifpga_rawdev.o
make[6]: *** [opae_intel_max10.o] Error 1

*Failed Build #18:
OS: FC29
Target: x86_64-native-linuxapp-gcc
  PMDINFO dpaa2_cmdif.o.pmd.c
  CC dpaa2_cmdif.o.pmd.o
  LD dpaa2_cmdif.o
  AR librte_pmd_dpaa2_cmdif.a
  INSTALL-LIB librte_pmd_dpaa2_cmdif.a
  CC ifpga_fme_error.o
  CC ifpga_port.o
  PMDINFO skeleton_rawdev.o.pmd.c
  CC skeleton_rawdev.o.pmd.o
  LD skeleton_rawdev.o
  CC ifpga_port_error.o
  CC opae_hw_api.o
  CC opae_ifpga_hw_api.o
  CC opae_debug.o
  PMDINFO dpaa2_qdma.o.pmd.c
  CC dpaa2_qdma.o.pmd.o
--
  CC opae_intel_max10.o
  CC opae_i2c.o
  CC opae_at24_eeprom.o
  CC opae_eth_group.o
  CC ifpga_rawdev.o
/tmp/FC29_K4.20_GCC8.0.1/x86_64-native-linuxapp-gcc/fc7ae441052f49ad94251bf385f2ff6f/dpdk/drivers/raw/ifpga_rawdev/base/opae_intel_max10.c:6:10: fatal error: libfdt.h: No such file or directory
 #include <libfdt.h>
          ^~~~~~~~~~
compilation terminated.
make[6]: *** [/tmp/FC29_K4.20_GCC8.0.1/x86_64-native-linuxapp-gcc/fc7ae441052f49ad94251bf385f2ff6f/dpdk/mk/internal/rte.compile-pre.mk:114: opae_intel_max10.o] Error 1
make[6]: *** Waiting for unfinished jobs....

*Failed Build #19:
OS: FC29
Target: x86_64-native-linuxapp-clang
  PMDINFO dpaa2_cmdif.o.pmd.c
  CC dpaa2_cmdif.o.pmd.o
  LD dpaa2_cmdif.o
  AR librte_pmd_dpaa2_cmdif.a
  INSTALL-LIB librte_pmd_dpaa2_cmdif.a
  CC ifpga_fme_error.o
  CC ifpga_port.o
  CC ifpga_port_error.o
  CC opae_hw_api.o
  CC opae_ifpga_hw_api.o
  CC opae_debug.o
  PMDINFO skeleton_rawdev.o.pmd.c
  CC skeleton_rawdev.o.pmd.o
--
  CC opae_at24_eeprom.o
  CC opae_eth_group.o
  CC ifpga_rawdev.o
  AR librte_pmd_dpaa2_qdma.a
  INSTALL-LIB librte_pmd_dpaa2_qdma.a
/tmp/FC29_K4.20_Clang6.0.1/x86_64-native-linuxapp-clang/fc7ae441052f49ad94251bf385f2ff6f/dpdk/drivers/raw/ifpga_rawdev/base/opae_intel_max10.c:6:10: fatal error: 'libfdt.h' file not found
#include <libfdt.h>
         ^~~~~~~~~~
1 error generated.
make[6]: *** [/tmp/FC29_K4.20_Clang6.0.1/x86_64-native-linuxapp-clang/fc7ae441052f49ad94251bf385f2ff6f/dpdk/mk/internal/rte.compile-pre.mk:114: opae_intel_max10.o] Error 1
make[6]: *** Waiting for unfinished jobs....
  PMDINFO ifpga_rawdev.o.pmd.c
  CC ifpga_rawdev.o.pmd.o
  LD ifpga_rawdev.o

*Failed Build #20:
OS: FC29
Target: x86_64-native-linuxapp-icc
  CC ifpga_enumerate.o
  CC ifpga_feature_dev.o
  CC ifpga_fme.o
  CC ifpga_fme_iperf.o
  CC ifpga_fme_dperf.o
  CC ifpga_fme_error.o
  PMDINFO skeleton_rawdev.o.pmd.c
  PMDINFO dpaa2_cmdif.o.pmd.c
  CC dpaa2_cmdif.o.pmd.o
  CC skeleton_rawdev.o.pmd.o
  PMDINFO dpaa2_qdma.o.pmd.c
--
  LD skeleton_rawdev.o
  LD dpaa2_cmdif.o
  CC ifpga_port.o
  AR librte_pmd_skeleton_rawdev.a
  INSTALL-LIB librte_pmd_skeleton_rawdev.a
  CC ifpga_port_error.o
  CC opae_hw_api.o
  AR librte_pmd_dpaa2_cmdif.a
  INSTALL-LIB librte_pmd_dpaa2_cmdif.a
  CC opae_debug.o
  CC opae_ifpga_hw_api.o
--
  CC opae_i2c.o
  CC opae_at24_eeprom.o
  CC opae_eth_group.o
  CC ifpga_rawdev.o
  AR librte_pmd_dpaa2_qdma.a
/tmp/FC29_K4.20_ICC19.0.0/x86_64-native-linuxapp-icc/fc7ae441052f49ad94251bf385f2ff6f/dpdk/drivers/raw/ifpga_rawdev/base/opae_intel_max10.c(6): catastrophic error: cannot open source file "libfdt.h"
  #include <libfdt.h>
                     ^

compilation aborted for /tmp/FC29_K4.20_ICC19.0.0/x86_64-native-linuxapp-icc/fc7ae441052f49ad94251bf385f2ff6f/dpdk/drivers/raw/ifpga_rawdev/base/opae_intel_max10.c (code 4)
make[6]: *** [/tmp/FC29_K4.20_ICC19.0.0/x86_64-native-linuxapp-icc/fc7ae441052f49ad94251bf385f2ff6f/dpdk/mk/internal/rte.compile-pre.mk:114: opae_intel_max10.o] Error 4

*Failed Build #21:
OS: CENTOS74
Target: x86_64-native-linuxapp-gcc
  CC ifpga_feature_dev.o
  CC ifpga_fme.o
  CC ifpga_fme_iperf.o
  CC ifpga_fme_dperf.o
  PMDINFO dpaa2_cmdif.o.pmd.c
  CC ifpga_fme_error.o
  CC dpaa2_cmdif.o.pmd.o
  CC ifpga_port.o
  CC ifpga_port_error.o
  CC opae_hw_api.o
  LD dpaa2_cmdif.o
  PMDINFO skeleton_rawdev.o.pmd.c
  CC skeleton_rawdev.o.pmd.o
  LD skeleton_rawdev.o
--
  CC opae_intel_max10.o
  INSTALL-LIB librte_pmd_skeleton_rawdev.a
  CC opae_i2c.o
  CC opae_at24_eeprom.o
  CC opae_eth_group.o
/tmp/CENTOS74_K3.10.0_GCC4.8.5/x86_64-native-linuxapp-gcc/fc7ae441052f49ad94251bf385f2ff6f/dpdk/drivers/raw/ifpga_rawdev/base/opae_intel_max10.c:6:20: fatal error: libfdt.h: No such file or directory
 #include <libfdt.h>
                    ^
compilation terminated.
  CC ifpga_rawdev.o
make[6]: *** [opae_intel_max10.o] Error 1

*Failed Build #22:
OS: CENTOS75
Target: x86_64-native-linuxapp-gcc
  CC ifpga_fme_dperf.o
  PMDINFO skeleton_rawdev.o.pmd.c
  PMDINFO dpaa2_cmdif.o.pmd.c
  CC dpaa2_cmdif.o.pmd.o
  CC skeleton_rawdev.o.pmd.o
  CC ifpga_fme_error.o
  LD dpaa2_cmdif.o
  CC ifpga_port.o
  LD skeleton_rawdev.o
  CC ifpga_port_error.o
  CC opae_hw_api.o
  CC opae_ifpga_hw_api.o
  AR librte_pmd_dpaa2_cmdif.a
  AR librte_pmd_skeleton_rawdev.a
  CC opae_debug.o
--
  CC opae_intel_max10.o
  CC opae_i2c.o
  CC opae_at24_eeprom.o
  CC opae_eth_group.o
  CC ifpga_rawdev.o
/tmp/CENTOS75_K3.10.0_GCC4.8.5/x86_64-native-linuxapp-gcc/fc7ae441052f49ad94251bf385f2ff6f/dpdk/drivers/raw/ifpga_rawdev/base/opae_intel_max10.c:6:20: fatal error: libfdt.h: No such file or directory
 #include <libfdt.h>
                    ^
compilation terminated.
  PMDINFO ifpga_rawdev.o.pmd.c
  CC ifpga_rawdev.o.pmd.o

*Failed Build #23:
OS: RHEL74
Target: x86_64-native-linuxapp-gcc
  CC ifpga_fme_iperf.o
  CC ifpga_fme_dperf.o
  PMDINFO dpaa2_cmdif.o.pmd.c
  CC dpaa2_cmdif.o.pmd.o
  LD dpaa2_cmdif.o
  CC ifpga_fme_error.o
  PMDINFO skeleton_rawdev.o.pmd.c
  CC skeleton_rawdev.o.pmd.o
  AR librte_pmd_dpaa2_cmdif.a
  CC ifpga_port.o
  CC ifpga_port_error.o
  CC opae_hw_api.o
  CC opae_ifpga_hw_api.o
  LD skeleton_rawdev.o
  INSTALL-LIB librte_pmd_dpaa2_cmdif.a
  CC opae_debug.o
--
  CC opae_intel_max10.o
  CC opae_i2c.o
  CC opae_at24_eeprom.o
  CC opae_eth_group.o
  CC ifpga_rawdev.o
/tmp/RHEL74_K3.10.0_GCC4.8.5/x86_64-native-linuxapp-gcc/fc7ae441052f49ad94251bf385f2ff6f/dpdk/drivers/raw/ifpga_rawdev/base/opae_intel_max10.c:6:20: fatal error: libfdt.h: No such file or directory
 #include <libfdt.h>
                    ^
compilation terminated.
make[6]: *** [opae_intel_max10.o] Error 1
make[6]: *** Waiting for unfinished jobs....

*Failed Build #24:
OS: FC28
Target: x86_64-native-linuxapp-icc
== Build drivers/bus/ifpga
== Build drivers/bus/pci
== Build drivers/bus/vdev
  Building modules, stage 2.
== Build drivers/bus/vmbus
/tmp/FC28_K4.16.3_ICC19.0.0/x86_64-native-linuxapp-icc/fc7ae441052f49ad94251bf385f2ff6f/dpdk/x86_64-native-linuxapp-icc/build/kernel/linux/kni/kni_misc.o: warning: objtool: kni_ioctl_release()+0x60: sibling call from callable instruction with modified stack frame
/tmp/FC28_K4.16.3_ICC19.0.0/x86_64-native-linuxapp-icc/fc7ae441052f49ad94251bf385f2ff6f/dpdk/x86_64-native-linuxapp-icc/build/kernel/linux/kni/kni_misc.o: warning: objtool: kni_ioctl()+0x2d: sibling call from callable instruction with modified stack frame
/tmp/FC28_K4.16.3_ICC19.0.0/x86_64-native-linuxapp-icc/fc7ae441052f49ad94251bf385f2ff6f/dpdk/x86_64-native-linuxapp-icc/build/kernel/linux/kni/kni_misc.o: warning: objtool: kni_ioctl.cold.6()+0xc: sibling call from callable instruction with modified stack frame
/tmp/FC28_K4.16.3_ICC19.0.0/x86_64-native-linuxapp-icc/fc7ae441052f49ad94251bf385f2ff6f/dpdk/x86_64-native-linuxapp-icc/build/kernel/linux/kni/kni_net.o: warning: objtool: kni_fifo_trans_pa2va()+0x167: sibling call from callable instruction with modified stack frame
/tmp/FC28_K4.16.3_ICC19.0.0/x86_64-native-linuxapp-icc/fc7ae441052f49ad94251bf385f2ff6f/dpdk/x86_64-native-linuxapp-icc/build/kernel/linux/kni/kni_net.o: warning: objtool: kni_net_rx_lo_fifo_skb()+0x326: sibling call from callable instruction with modified stack frame
/tmp/FC28_K4.16.3_ICC19.0.0/x86_64-native-linuxapp-icc/fc7ae441052f49ad94251bf385f2ff6f/dpdk/x86_64-native-linuxapp-icc/build/kernel/linux/kni/kni_net.o: warning: objtool: kni_net_process_request()+0x2d: sibling call from callable instruction with modified stack frame
/tmp/FC28_K4.16.3_ICC19.0.0/x86_64-native-linuxapp-icc/fc7ae441052f49ad94251bf385f2ff6f/dpdk/x86_64-native-linuxapp-icc/build/kernel/linux/kni/kni_net.o: warning: objtool: kni_net_set_mac()+0x1a6: sibling call from callable instruction with modified stack frame
/tmp/FC28_K4.16.3_ICC19.0.0/x86_64-native-linuxapp-icc/fc7ae441052f49ad94251bf385f2ff6f/dpdk/x86_64-native-linuxapp-icc/build/kernel/linux/kni/kni_net.o: warning: objtool: kni_net_rx_lo_fifo()+0x31c: sibling call from callable instruction with modified stack frame
/tmp/FC28_K4.16.3_ICC19.0.0/x86_64-native-linuxapp-icc/fc7ae441052f49ad94251bf385f2ff6f/dpdk/x86_64-native-linuxapp-icc/build/kernel/linux/kni/kni_net.o: warning: objtool: kni_net_rx_normal()+0x2f9: sibling call from callable instruction with modified stack frame
/tmp/FC28_K4.16.3_ICC19.0.0/x86_64-native-linuxapp-icc/fc7ae441052f49ad94251bf385f2ff6f/dpdk/x86_64-native-linuxapp-icc/build/kernel/linux/kni/kni_net.o: warning: objtool: kni_fifo_trans_pa2va.cold.6()+0x1d: sibling call from callable instruction with modified stack frame
/tmp/FC28_K4.16.3_ICC19.0.0/x86_64-native-linuxapp-icc/fc7ae441052f49ad94251bf385f2ff6f/dpdk/x86_64-native-linuxapp-icc/build/kernel/linux/kni/kni_net.o: warning: objtool: kni_net_rx_lo_fifo_skb.cold.7()+0x25: sibling call from callable instruction with modified stack frame
/tmp/FC28_K4.16.3_ICC19.0.0/x86_64-native-linuxapp-icc/fc7ae441052f49ad94251bf385f2ff6f/dpdk/x86_64-native-linuxapp-icc/build/kernel/linux/kni/kni_net.o: warning: objtool: kni_net_rx_normal.cold.11()+0x25: sibling call from callable instruction with modified stack frame
  LD [M]  /tmp/FC28_K4.16.3_ICC19.0.0/x86_64-native-linuxapp-icc/fc7ae441052f49ad94251bf385f2ff6f/dpdk/x86_64-native-linuxapp-icc/build/kernel/linux/kni/rte_kni.o
  Building modules, stage 2.
  MODPOST 1 modules
  CC      /tmp/FC28_K4.16.3_ICC19.0.0/x86_64-native-linuxapp-icc/fc7ae441052f49ad94251bf385f2ff6f/dpdk/x86_64-native-linuxapp-icc/build/kernel/linux/igb_uio/igb_uio.mod.o
  LD [M]  /tmp/FC28_K4.16.3_ICC19.0.0/x86_64-native-linuxapp-icc/fc7ae441052f49ad94251bf385f2ff6f/dpdk/x86_64-native-linuxapp-icc/build/kernel/linux/igb_uio/igb_uio.ko
--
  CC dpaa2_cmdif.o.pmd.o
  PMDINFO skeleton_rawdev.o.pmd.c
  CC skeleton_rawdev.o.pmd.o
  LD dpaa2_cmdif.o
  LD skeleton_rawdev.o
  CC ifpga_fme_error.o
  AR librte_pmd_dpaa2_cmdif.a
  INSTALL-LIB librte_pmd_dpaa2_cmdif.a
  CC ifpga_port.o
  CC ifpga_port_error.o
  CC opae_hw_api.o
  AR librte_pmd_skeleton_rawdev.a
  INSTALL-LIB librte_pmd_skeleton_rawdev.a
  CC opae_ifpga_hw_api.o
  CC opae_debug.o
--
  CC opae_i2c.o
  CC opae_at24_eeprom.o
  CC opae_eth_group.o
  CC ifpga_rawdev.o
  LD dpaa2_qdma.o
/tmp/FC28_K4.16.3_ICC19.0.0/x86_64-native-linuxapp-icc/fc7ae441052f49ad94251bf385f2ff6f/dpdk/drivers/raw/ifpga_rawdev/base/opae_intel_max10.c(6): catastrophic error: cannot open source file "libfdt.h"
  #include <libfdt.h>
                     ^

compilation aborted for /tmp/FC28_K4.16.3_ICC19.0.0/x86_64-native-linuxapp-icc/fc7ae441052f49ad94251bf385f2ff6f/dpdk/drivers/raw/ifpga_rawdev/base/opae_intel_max10.c (code 4)
make[6]: *** [/tmp/FC28_K4.16.3_ICC19.0.0/x86_64-native-linuxapp-icc/fc7ae441052f49ad94251bf385f2ff6f/dpdk/mk/internal/rte.compile-pre.mk:114: opae_intel_max10.o] Error 4

*Failed Build #25:
OS: SUSE12
Target: x86_64-native-linuxapp-gcc
  PMDINFO dpaa2_cmdif.o.pmd.c
  CC dpaa2_cmdif.o.pmd.o
  LD dpaa2_cmdif.o
  AR librte_pmd_dpaa2_cmdif.a
  INSTALL-LIB librte_pmd_dpaa2_cmdif.a
  CC ifpga_fme_error.o
  CC ifpga_port.o
  CC ifpga_port_error.o
  CC opae_hw_api.o
  CC opae_ifpga_hw_api.o
  CC opae_debug.o
  CC ifpga_fme_pr.o
  PMDINFO skeleton_rawdev.o.pmd.c
--
  CC opae_i2c.o
  LD dpaa2_qdma.o
  CC opae_at24_eeprom.o
  CC opae_eth_group.o
  CC ifpga_rawdev.o
/tmp/SUSE12_K3.7.10_GCC4.7.2/x86_64-native-linuxapp-gcc/fc7ae441052f49ad94251bf385f2ff6f/dpdk/drivers/raw/ifpga_rawdev/base/opae_intel_max10.c:6:10: fatal error: libfdt.h: No such file or directory
 #include <libfdt.h>
          ^~~~~~~~~~
compilation terminated.
/tmp/SUSE12_K3.7.10_GCC4.7.2/x86_64-native-linuxapp-gcc/fc7ae441052f49ad94251bf385f2ff6f/dpdk/mk/internal/rte.compile-pre.mk:114: recipe for target 'opae_intel_max10.o' failed
make[6]: *** [opae_intel_max10.o] Error 1
make[6]: *** Waiting for unfinished jobs....
  AR librte_pmd_dpaa2_qdma.a
  INSTALL-LIB librte_pmd_dpaa2_qdma.a
  PMDINFO ifpga_rawdev.o.pmd.c
  CC ifpga_rawdev.o.pmd.o
  LD ifpga_rawdev.o
/tmp/SUSE12_K3.7.10_GCC4.7.2/x86_64-native-linuxapp-gcc/fc7ae441052f49ad94251bf385f2ff6f/dpdk/mk/rte.subdir.mk:35: recipe for target 'ifpga_rawdev' failed
make[5]: *** [ifpga_rawdev] Error 2
/tmp/SUSE12_K3.7.10_GCC4.7.2/x86_64-native-linuxapp-gcc/fc7ae441052f49ad94251bf385f2ff6f/dpdk/mk/rte.subdir.mk:35: recipe for target 'raw' failed
make[4]: *** [raw] Error 2
/tmp/SUSE12_K3.7.10_GCC4.7.2/x86_64-native-linuxapp-gcc/fc7ae441052f49ad94251bf385f2ff6f/dpdk/mk/rte.sdkbuild.mk:46: recipe for target 'drivers' failed
make[3]: *** [drivers] Error 2
/tmp/SUSE12_K3.7.10_GCC4.7.2/x86_64-native-linuxapp-gcc/fc7ae441052f49ad94251bf385f2ff6f/dpdk/mk/rte.sdkroot.mk:98: recipe for target 'all' failed
make[2]: *** [all] Error 2
/tmp/SUSE12_K3.7.10_GCC4.7.2/x86_64-native-linuxapp-gcc/fc7ae441052f49ad94251bf385f2ff6f/dpdk/mk/rte.sdkinstall.mk:60: recipe for target 'pre_install' failed
make[1]: *** [pre_install] Error 2
/tmp/SUSE12_K3.7.10_GCC4.7.2/x86_64-native-linuxapp-gcc/fc7ae441052f49ad94251bf385f2ff6f/dpdk/mk/rte.sdkroot.mk:77: recipe for target 'install' failed
make: *** [install] Error 2

*Failed Build #26:
OS: CENTOS76
Target: x86_64-native-linuxapp-gcc
  PMDINFO dpaa2_cmdif.o.pmd.c
  CC dpaa2_cmdif.o.pmd.o
  LD dpaa2_cmdif.o
  PMDINFO skeleton_rawdev.o.pmd.c
  CC skeleton_rawdev.o.pmd.o
  CC ifpga_fme_error.o
  LD skeleton_rawdev.o
  CC ifpga_port.o
  PMDINFO dpaa2_qdma.o.pmd.c
  CC dpaa2_qdma.o.pmd.o
  LD dpaa2_qdma.o
  AR librte_pmd_skeleton_rawdev.a
  CC ifpga_port_error.o
  AR librte_pmd_dpaa2_cmdif.a
  INSTALL-LIB librte_pmd_dpaa2_cmdif.a
  CC opae_hw_api.o
  CC opae_ifpga_hw_api.o
  INSTALL-LIB librte_pmd_skeleton_rawdev.a
--
  CC opae_spi.o
  CC opae_spi_transaction.o
  CC opae_intel_max10.o
  CC opae_i2c.o
  CC opae_at24_eeprom.o
/tmp/CENTOS76_K3.10.0_GCC4.8.5/x86_64-native-linuxapp-gcc/fc7ae441052f49ad94251bf385f2ff6f/dpdk/drivers/raw/ifpga_rawdev/base/opae_intel_max10.c:6:20: fatal error: libfdt.h: No such file or directory
 #include <libfdt.h>
                    ^
compilation terminated.
  CC opae_eth_group.o
  CC ifpga_rawdev.o

DPDK STV team


More information about the test-report mailing list