[dpdk-test-report] |FAILURE| pw52007[v6, 3/8] test/stack: add stack test

sys_stv at intel.com sys_stv at intel.com
Tue Apr 2 01:58:22 CEST 2019


Test-Label: Intel-compilation
Test-Status: FAILURE
http://dpdk.org/patch/52007

_Compilation issues_

Submitter: Gage Eads <gage.eads at intel.com>
Date: 2019-04-01 21:14:24
Reply_mail: 20190401211429.20282-4-gage.eads at intel.com
DPDK git baseline: Repo:dpdk-master, CommitID: 08a710642d1d8bed831ecf2085e041213381fc68

Build Summary: 26 Builds Done, 2 Successful, 24 Failures

Test environment and configuration as below:

OS: SUSE15
	Kernel Version: 4.12.14-lp150.12.22-default
	CPU info: Intel(R) Xeon(R) CPU E5-2699 v3 @ 2.30GHz
	GCC Version: gcc (SUSE Linux) 7.3.1 20180323 [gcc-7-branch revision 258812]
	Clang Version: 5.0.1 (tags/RELEASE_501/final 312548)
	x86_64-native-linuxapp-gcc

OS: CENTOS76
	Kernel Version: 3.10.0-957.5.1.el7.x86_64
	CPU info: Intel(R) Xeon(R) CPU E5-2699 v4 @ 2.20GHz
	GCC Version: gcc (GCC) 4.8.5 20150623 (Red Hat 4.8.5-36)
	Clang Version: 3.4.2 (tags/RELEASE_34/dot2-final)
	x86_64-native-linuxapp-gcc

OS: UBT144-32
	Kernel Version: 3.13.0-161-generic
	CPU info: Intel(R) Xeon(R) CPU E5-2699 v3 @ 2.30GHz
	GCC Version: gcc (Ubuntu 4.8.4-2ubuntu1~14.04.4) 4.8.4
	Clang Version: NA
	i686-native-linuxapp-gcc

OS: UBT164-32
	Kernel Version: 4.4.0-131-generic
	CPU info: Intel(R) Xeon(R) CPU E5-2699 v3 @ 2.30GHz
	GCC Version: gcc (Ubuntu 5.4.0-6ubuntu1~16.04.10) 5.4.0 20160609
	Clang Version: NA
	i686-native-linuxapp-gcc

OS: SUSE12
	Kernel Version: 4.4.73-5-default
	CPU info: Intel(R) Xeon(R) CPU E5-2699 v4 @ 2.20GHz
	GCC Version: gcc (SUSE Linux) 7.1.1 20170607 [gcc-7-branch revision 248970]
	Clang Version: 3.8.0 (tags/RELEASE_380/final 262553)
	x86_64-native-linuxapp-gcc

OS: FreeBSD12.0
	Kernel Version: 12.0-RC3
	CPU info: Intel(R) Xeon(R) CPU E5-2699 v3 @ 2.30GHz (2294.75-MHz K8-class CPU)
	GCC Version: gcc (FreeBSD Ports Collection) 7.3.0
	Clang Version: 6.0.1 (tags/RELEASE_601/final 335540) (based on LLVM 6.0.1)
	x86_64-native-bsdapp-clang
	x86_64-native-bsdapp-gcc

OS: UBT144-64
	Kernel Version: 4.2.0-27-generic
	CPU info: Intel(R) Xeon(R) CPU E5-2699 v3 @ 2.30GHz
	GCC Version: gcc (Ubuntu 4.8.4-2ubuntu1~14.04.4) 4.8.4
	Clang Version: 3.4-1ubuntu3 (tags/RELEASE_34/final) (based on LLVM 3.4)
	x86_64-native-linuxapp-gcc

OS: CENTOS75
	Kernel Version: 3.10.0-957.5.1.el7.x86_64
	CPU info: Intel(R) Xeon(R) CPU E5-2699 v4 @ 2.20GHz
	GCC Version: gcc (GCC) 4.8.5 20150623 (Red Hat 4.8.5-36)
	Clang Version: 3.4.2 (tags/RELEASE_34/dot2-final)
	x86_64-native-linuxapp-gcc

OS: UBT1804
	Kernel Version: 4.15.0-20-generic
	CPU info: Intel(R) Xeon(R) CPU E5-2699 v3 @ 2.30GHz
	GCC Version: gcc (Ubuntu 7.3.0-27ubuntu1~18.04) 7.3.0
	Clang Version: 6.0.0-1ubuntu2 (tags/RELEASE_600/final)
	x86_64-native-linuxapp-clang
	x86_64-native-linuxapp-gcc
	x86_64-native-linuxapp-icc

OS: UBT1810
	Kernel Version: 4.18.0-10-generic
	CPU info: Intel(R) Xeon(R) CPU E5-2699 v3 @ 2.30GHz
	GCC Version: gcc (Ubuntu 8.2.0-7ubuntu1) 8.2.0
	Clang Version: 7.0.0-3 (tags/RELEASE_700/final)
	x86_64-native-linuxapp-gcc

OS: RHEL74
	Kernel Version: 3.10.0-693.el7.x86_64
	CPU info: Intel(R) Xeon(R) CPU E5-2699 v4 @ 2.20GHz
	GCC Version: gcc (GCC) 4.8.5 20150623 (Red Hat 4.8.5-16)
	Clang Version: NA
	x86_64-native-linuxapp-gcc

OS: CENTOS74
	Kernel Version: 3.10.0-862.14.4.el7.x86_64
	CPU info: Intel(R) Xeon(R) CPU E5-2699 v4 @ 2.20GHz
	GCC Version: gcc (GCC) 4.8.5 20150623 (Red Hat 4.8.5-28)
	Clang Version: 3.4.2 (tags/RELEASE_34/dot2-final)
	x86_64-native-linuxapp-gcc

OS: FreeBSD11.2
	Kernel Version: 11.2-RELEASE
	CPU info: Intel(R) Xeon(R) CPU E5-2699 v3 @ 2.30GHz (2294.74-MHz K8-class CPU)
	GCC Version: gcc (FreeBSD Ports Collection) 6.4.0
	Clang Version: 6.0.0 (tags/RELEASE_600/final 326565) (based on LLVM 6.0.0)
	x86_64-native-bsdapp-clang
	x86_64-native-bsdapp-gcc

OS: UBT164-64
	Kernel Version: 4.4.0-47-generic
	CPU info: Intel(R) Xeon(R) CPU E5-2699 v3 @ 2.30GHz
	GCC Version: gcc (Ubuntu 5.4.0-6ubuntu1~16.04.10) 5.4.0 20160609
	Clang Version: 3.8.0-2ubuntu4 (tags/RELEASE_380/final)
	x86_64-native-linuxapp-gcc

OS: RHEL75
	Kernel Version: 3.10.0-862.el7.x86_64
	CPU info: Intel(R) Xeon(R) CPU E5-2699 v4 @ 2.20GHz
	GCC Version: gcc (GCC) 4.8.5 20150623 (Red Hat 4.8.5-28)
	Clang Version: NA
	x86_64-native-linuxapp-gcc

OS: RHEL76
	Kernel Version: 3.10.0-957.el7.x86_64
	CPU info: Intel(R) Xeon(R) CPU E5-2699 v4 @ 2.20GHz
	GCC Version: gcc (GCC) 4.8.5 20150623 (Red Hat 4.8.5-36)
	Clang Version: NA
	x86_64-native-linuxapp-gcc

OS: FC29
	Kernel Version: 4.18.16-300.fc29.x86_64
	CPU info: Intel(R) Xeon(R) CPU E5-2699 v4 @ 2.20GHz
	GCC Version: gcc (GCC) 8.2.1 20181215 (Red Hat 8.2.1-6)
	Clang Version: NA
	x86_64-native-linuxapp-gcc
	x86_64-native-linuxapp-clang
	x86_64-native-linuxapp-icc

OS: FC28
	Kernel Version: 4.16.3-301.fc28.x86_64
	CPU info: Intel(R) Xeon(R) CPU E5-2699 v4 @ 2.20GHz
	GCC Version: gcc (GCC) 8.1.1 20180712 (Red Hat 8.1.1-5)
	Clang Version: 6.0.1 (tags/RELEASE_601/final)
	x86_64-native-linuxapp-gcc
	x86_64-native-linuxapp-clang
	x86_64-native-linuxapp-icc

*Failed Build #1:
OS: UBT164-64
Target: x86_64-native-linuxapp-gcc
  CC rte_hypervisor.o
  CC rte_spinlock.o
  CC rte_cycles.o
  AR librte_eal.a
  INSTALL-LIB librte_eal.a
make[7]: warning:  Clock skew detected.  Your build may be incomplete.
== Build lib/librte_metrics
== Build lib/librte_cmdline
== Build lib/librte_timer
== Build lib/librte_stack
== Build lib/librte_acl
--
  INSTALL-LIB librte_metrics.a
In file included from /tmp/UBT164-64_K4.4.0_GCC5.4.0/x86_64-native-linuxapp-gcc/3d927d246f6b44ddb51da6c7375d545f/dpdk/lib/librte_stack/rte_stack_lf.h:11:0,
                 from /tmp/UBT164-64_K4.4.0_GCC5.4.0/x86_64-native-linuxapp-gcc/3d927d246f6b44ddb51da6c7375d545f/dpdk/lib/librte_stack/rte_stack.h:95,
                 from /tmp/UBT164-64_K4.4.0_GCC5.4.0/x86_64-native-linuxapp-gcc/3d927d246f6b44ddb51da6c7375d545f/dpdk/lib/librte_stack/rte_stack_std.c:5:
/tmp/UBT164-64_K4.4.0_GCC5.4.0/x86_64-native-linuxapp-gcc/3d927d246f6b44ddb51da6c7375d545f/dpdk/lib/librte_stack/rte_stack_lf_generic.h: In function ‘__rte_stack_lf_push_elems’:
/tmp/UBT164-64_K4.4.0_GCC5.4.0/x86_64-native-linuxapp-gcc/3d927d246f6b44ddb51da6c7375d545f/dpdk/lib/librte_stack/rte_stack_lf_generic.h:68:13: warning: implicit declaration of function ‘rte_atomic128_cmp_exchange’ [-Wimplicit-function-declaration]
   success = rte_atomic128_cmp_exchange(
             ^
/tmp/UBT164-64_K4.4.0_GCC5.4.0/x86_64-native-linuxapp-gcc/3d927d246f6b44ddb51da6c7375d545f/dpdk/lib/librte_stack/rte_stack_lf_generic.h:68:3: warning: nested extern declaration of ‘rte_atomic128_cmp_exchange’ [-Wnested-externs]
   success = rte_atomic128_cmp_exchange(
   ^
/tmp/UBT164-64_K4.4.0_GCC5.4.0/x86_64-native-linuxapp-gcc/3d927d246f6b44ddb51da6c7375d545f/dpdk/lib/librte_stack/rte_stack_lf_generic.h:69:6: error: ‘rte_int128_t’ undeclared (first use in this function)
     (rte_int128_t *)&list->head,
      ^
/tmp/UBT164-64_K4.4.0_GCC5.4.0/x86_64-native-linuxapp-gcc/3d927d246f6b44ddb51da6c7375d545f/dpdk/lib/librte_stack/rte_stack_lf_generic.h:69:6: note: each undeclared identifier is reported only once for each function it appears in
/tmp/UBT164-64_K4.4.0_GCC5.4.0/x86_64-native-linuxapp-gcc/3d927d246f6b44ddb51da6c7375d545f/dpdk/lib/librte_stack/rte_stack_lf_generic.h:69:20: error: expected expression before ‘)’ token
     (rte_int128_t *)&list->head,
                    ^
/tmp/UBT164-64_K4.4.0_GCC5.4.0/x86_64-native-linuxapp-gcc/3d927d246f6b44ddb51da6c7375d545f/dpdk/lib/librte_stack/rte_stack_lf_generic.h:50:28: warning: variable ‘new_head’ set but not used [-Wunused-but-set-variable]
   struct rte_stack_lf_head new_head;
                            ^
/tmp/UBT164-64_K4.4.0_GCC5.4.0/x86_64-native-linuxapp-gcc/3d927d246f6b44ddb51da6c7375d545f/dpdk/lib/librte_stack/rte_stack_lf_generic.h: In function ‘__rte_stack_lf_pop_elems’:
/tmp/UBT164-64_K4.4.0_GCC5.4.0/x86_64-native-linuxapp-gcc/3d927d246f6b44ddb51da6c7375d545f/dpdk/lib/librte_stack/rte_stack_lf_generic.h:153:6: error: ‘rte_int128_t’ undeclared (first use in this function)
     (rte_int128_t *)&list->head,
      ^
/tmp/UBT164-64_K4.4.0_GCC5.4.0/x86_64-native-linuxapp-gcc/3d927d246f6b44ddb51da6c7375d545f/dpdk/lib/librte_stack/rte_stack_lf_generic.h:153:20: error: expected expression before ‘)’ token
     (rte_int128_t *)&list->head,
                    ^
/tmp/UBT164-64_K4.4.0_GCC5.4.0/x86_64-native-linuxapp-gcc/3d927d246f6b44ddb51da6c7375d545f/dpdk/lib/librte_stack/rte_stack_lf_generic.h:114:28: warning: variable ‘new_head’ set but not used [-Wunused-but-set-variable]
   struct rte_stack_lf_head new_head;
                            ^
/tmp/UBT164-64_K4.4.0_GCC5.4.0/x86_64-native-linuxapp-gcc/3d927d246f6b44ddb51da6c7375d545f/dpdk/mk/internal/rte.compile-pre.mk:114: recipe for target 'rte_stack_std.o' failed
make[5]: *** [rte_stack_std.o] Error 1
make[5]: *** Waiting for unfinished jobs....
  SYMLINK-FILE include/cmdline_rdline.h
  SYMLINK-FILE include/cmdline_vt100.h
  SYMLINK-FILE include/cmdline_socket.h
In file included from /tmp/UBT164-64_K4.4.0_GCC5.4.0/x86_64-native-linuxapp-gcc/3d927d246f6b44ddb51da6c7375d545f/dpdk/lib/librte_stack/rte_stack_lf.h:11:0,
                 from /tmp/UBT164-64_K4.4.0_GCC5.4.0/x86_64-native-linuxapp-gcc/3d927d246f6b44ddb51da6c7375d545f/dpdk/lib/librte_stack/rte_stack.h:95,
                 from /tmp/UBT164-64_K4.4.0_GCC5.4.0/x86_64-native-linuxapp-gcc/3d927d246f6b44ddb51da6c7375d545f/dpdk/lib/librte_stack/rte_stack.c:16:
/tmp/UBT164-64_K4.4.0_GCC5.4.0/x86_64-native-linuxapp-gcc/3d927d246f6b44ddb51da6c7375d545f/dpdk/lib/librte_stack/rte_stack_lf_generic.h: In function ‘__rte_stack_lf_push_elems’:
/tmp/UBT164-64_K4.4.0_GCC5.4.0/x86_64-native-linuxapp-gcc/3d927d246f6b44ddb51da6c7375d545f/dpdk/lib/librte_stack/rte_stack_lf_generic.h:68:13: warning: implicit declaration of function ‘rte_atomic128_cmp_exchange’ [-Wimplicit-function-declaration]
   success = rte_atomic128_cmp_exchange(
             ^
/tmp/UBT164-64_K4.4.0_GCC5.4.0/x86_64-native-linuxapp-gcc/3d927d246f6b44ddb51da6c7375d545f/dpdk/lib/librte_stack/rte_stack_lf_generic.h:68:3: warning: nested extern declaration of ‘rte_atomic128_cmp_exchange’ [-Wnested-externs]
   success = rte_atomic128_cmp_exchange(
   ^
/tmp/UBT164-64_K4.4.0_GCC5.4.0/x86_64-native-linuxapp-gcc/3d927d246f6b44ddb51da6c7375d545f/dpdk/lib/librte_stack/rte_stack_lf_generic.h:69:6: error: ‘rte_int128_t’ undeclared (first use in this function)
     (rte_int128_t *)&list->head,
      ^
/tmp/UBT164-64_K4.4.0_GCC5.4.0/x86_64-native-linuxapp-gcc/3d927d246f6b44ddb51da6c7375d545f/dpdk/lib/librte_stack/rte_stack_lf_generic.h:69:6: note: each undeclared identifier is reported only once for each function it appears in
/tmp/UBT164-64_K4.4.0_GCC5.4.0/x86_64-native-linuxapp-gcc/3d927d246f6b44ddb51da6c7375d545f/dpdk/lib/librte_stack/rte_stack_lf_generic.h:69:20: error: expected expression before ‘)’ token
     (rte_int128_t *)&list->head,
                    ^
/tmp/UBT164-64_K4.4.0_GCC5.4.0/x86_64-native-linuxapp-gcc/3d927d246f6b44ddb51da6c7375d545f/dpdk/lib/librte_stack/rte_stack_lf_generic.h:50:28: warning: variable ‘new_head’ set but not used [-Wunused-but-set-variable]
   struct rte_stack_lf_head new_head;
                            ^
/tmp/UBT164-64_K4.4.0_GCC5.4.0/x86_64-native-linuxapp-gcc/3d927d246f6b44ddb51da6c7375d545f/dpdk/lib/librte_stack/rte_stack_lf_generic.h: In function ‘__rte_stack_lf_pop_elems’:
/tmp/UBT164-64_K4.4.0_GCC5.4.0/x86_64-native-linuxapp-gcc/3d927d246f6b44ddb51da6c7375d545f/dpdk/lib/librte_stack/rte_stack_lf_generic.h:153:6: error: ‘rte_int128_t’ undeclared (first use in this function)
     (rte_int128_t *)&list->head,
      ^
/tmp/UBT164-64_K4.4.0_GCC5.4.0/x86_64-native-linuxapp-gcc/3d927d246f6b44ddb51da6c7375d545f/dpdk/lib/librte_stack/rte_stack_lf_generic.h:153:20: error: expected expression before ‘)’ token
     (rte_int128_t *)&list->head,
                    ^
/tmp/UBT164-64_K4.4.0_GCC5.4.0/x86_64-native-linuxapp-gcc/3d927d246f6b44ddb51da6c7375d545f/dpdk/lib/librte_stack/rte_stack_lf_generic.h:114:28: warning: variable ‘new_head’ set but not used [-Wunused-but-set-variable]
   struct rte_stack_lf_head new_head;
                            ^
/tmp/UBT164-64_K4.4.0_GCC5.4.0/x86_64-native-linuxapp-gcc/3d927d246f6b44ddb51da6c7375d545f/dpdk/mk/internal/rte.compile-pre.mk:114: recipe for target 'rte_stack.o' failed
make[5]: *** [rte_stack.o] Error 1
/tmp/UBT164-64_K4.4.0_GCC5.4.0/x86_64-native-linuxapp-gcc/3d927d246f6b44ddb51da6c7375d545f/dpdk/mk/rte.subdir.mk:35: recipe for target 'librte_stack' failed
make[4]: *** [librte_stack] Error 2
make[4]: *** Waiting for unfinished jobs....
  SYMLINK-FILE include/cmdline_cirbuf.h
  SYMLINK-FILE include/cmdline_parse_portlist.h
  AR librte_timer.a
--
  CC acl_run_avx2.o
  AR librte_cmdline.a
  INSTALL-LIB librte_cmdline.a
  AR librte_acl.a
  INSTALL-LIB librte_acl.a
/tmp/UBT164-64_K4.4.0_GCC5.4.0/x86_64-native-linuxapp-gcc/3d927d246f6b44ddb51da6c7375d545f/dpdk/mk/rte.sdkbuild.mk:46: recipe for target 'lib' failed
make[3]: *** [lib] Error 2
/tmp/UBT164-64_K4.4.0_GCC5.4.0/x86_64-native-linuxapp-gcc/3d927d246f6b44ddb51da6c7375d545f/dpdk/mk/rte.sdkroot.mk:98: recipe for target 'all' failed
make[2]: *** [all] Error 2
/tmp/UBT164-64_K4.4.0_GCC5.4.0/x86_64-native-linuxapp-gcc/3d927d246f6b44ddb51da6c7375d545f/dpdk/mk/rte.sdkinstall.mk:60: recipe for target 'pre_install' failed
make[1]: *** [pre_install] Error 2
/tmp/UBT164-64_K4.4.0_GCC5.4.0/x86_64-native-linuxapp-gcc/3d927d246f6b44ddb51da6c7375d545f/dpdk/mk/rte.sdkroot.mk:77: recipe for target 'install' failed
make: *** [install] Error 2

*Failed Build #2:
OS: UBT144-64
Target: x86_64-native-linuxapp-gcc
  CC rte_hypervisor.o
  CC rte_spinlock.o
  CC rte_cycles.o
  AR librte_eal.a
  INSTALL-LIB librte_eal.a
make[7]: warning:  Clock skew detected.  Your build may be incomplete.
== Build lib/librte_ring
== Build lib/librte_pci
== Build lib/librte_acl
== Build lib/librte_timer
== Build lib/librte_cmdline
--
  SYMLINK-FILE include/cmdline_rdline.h
In file included from /tmp/UBT144-64_K4.2.0_GCC4.8.4/x86_64-native-linuxapp-gcc/3d927d246f6b44ddb51da6c7375d545f/dpdk/lib/librte_stack/rte_stack_lf.h:11:0,
                 from /tmp/UBT144-64_K4.2.0_GCC4.8.4/x86_64-native-linuxapp-gcc/3d927d246f6b44ddb51da6c7375d545f/dpdk/lib/librte_stack/rte_stack.h:95,
                 from /tmp/UBT144-64_K4.2.0_GCC4.8.4/x86_64-native-linuxapp-gcc/3d927d246f6b44ddb51da6c7375d545f/dpdk/lib/librte_stack/rte_stack.c:16:
/tmp/UBT144-64_K4.2.0_GCC4.8.4/x86_64-native-linuxapp-gcc/3d927d246f6b44ddb51da6c7375d545f/dpdk/lib/librte_stack/rte_stack_lf_generic.h: In function ‘__rte_stack_lf_push_elems’:
/tmp/UBT144-64_K4.2.0_GCC4.8.4/x86_64-native-linuxapp-gcc/3d927d246f6b44ddb51da6c7375d545f/dpdk/lib/librte_stack/rte_stack_lf_generic.h:68:3: warning: implicit declaration of function ‘rte_atomic128_cmp_exchange’ [-Wimplicit-function-declaration]
   success = rte_atomic128_cmp_exchange(
   ^
/tmp/UBT144-64_K4.2.0_GCC4.8.4/x86_64-native-linuxapp-gcc/3d927d246f6b44ddb51da6c7375d545f/dpdk/lib/librte_stack/rte_stack_lf_generic.h:68:3: warning: nested extern declaration of ‘rte_atomic128_cmp_exchange’ [-Wnested-externs]
/tmp/UBT144-64_K4.2.0_GCC4.8.4/x86_64-native-linuxapp-gcc/3d927d246f6b44ddb51da6c7375d545f/dpdk/lib/librte_stack/rte_stack_lf_generic.h:69:6: error: ‘rte_int128_t’ undeclared (first use in this function)
     (rte_int128_t *)&list->head,
      ^
/tmp/UBT144-64_K4.2.0_GCC4.8.4/x86_64-native-linuxapp-gcc/3d927d246f6b44ddb51da6c7375d545f/dpdk/lib/librte_stack/rte_stack_lf_generic.h:69:6: note: each undeclared identifier is reported only once for each function it appears in
/tmp/UBT144-64_K4.2.0_GCC4.8.4/x86_64-native-linuxapp-gcc/3d927d246f6b44ddb51da6c7375d545f/dpdk/lib/librte_stack/rte_stack_lf_generic.h:69:20: error: expected expression before ‘)’ token
     (rte_int128_t *)&list->head,
                    ^
/tmp/UBT144-64_K4.2.0_GCC4.8.4/x86_64-native-linuxapp-gcc/3d927d246f6b44ddb51da6c7375d545f/dpdk/lib/librte_stack/rte_stack_lf_generic.h:50:28: warning: variable ‘new_head’ set but not used [-Wunused-but-set-variable]
   struct rte_stack_lf_head new_head;
                            ^
/tmp/UBT144-64_K4.2.0_GCC4.8.4/x86_64-native-linuxapp-gcc/3d927d246f6b44ddb51da6c7375d545f/dpdk/lib/librte_stack/rte_stack_lf_generic.h: In function ‘__rte_stack_lf_pop_elems’:
/tmp/UBT144-64_K4.2.0_GCC4.8.4/x86_64-native-linuxapp-gcc/3d927d246f6b44ddb51da6c7375d545f/dpdk/lib/librte_stack/rte_stack_lf_generic.h:153:6: error: ‘rte_int128_t’ undeclared (first use in this function)
     (rte_int128_t *)&list->head,
      ^
/tmp/UBT144-64_K4.2.0_GCC4.8.4/x86_64-native-linuxapp-gcc/3d927d246f6b44ddb51da6c7375d545f/dpdk/lib/librte_stack/rte_stack_lf_generic.h:153:20: error: expected expression before ‘)’ token
     (rte_int128_t *)&list->head,
                    ^
/tmp/UBT144-64_K4.2.0_GCC4.8.4/x86_64-native-linuxapp-gcc/3d927d246f6b44ddb51da6c7375d545f/dpdk/lib/librte_stack/rte_stack_lf_generic.h:114:28: warning: variable ‘new_head’ set but not used [-Wunused-but-set-variable]
   struct rte_stack_lf_head new_head;
                            ^
  CC acl_bld.o
make[5]: *** [rte_stack.o] Error 1
make[5]: *** Waiting for unfinished jobs....
--
  AR librte_meter.a
In file included from /tmp/UBT144-64_K4.2.0_GCC4.8.4/x86_64-native-linuxapp-gcc/3d927d246f6b44ddb51da6c7375d545f/dpdk/lib/librte_stack/rte_stack_lf.h:11:0,
                 from /tmp/UBT144-64_K4.2.0_GCC4.8.4/x86_64-native-linuxapp-gcc/3d927d246f6b44ddb51da6c7375d545f/dpdk/lib/librte_stack/rte_stack.h:95,
                 from /tmp/UBT144-64_K4.2.0_GCC4.8.4/x86_64-native-linuxapp-gcc/3d927d246f6b44ddb51da6c7375d545f/dpdk/lib/librte_stack/rte_stack_std.c:5:
/tmp/UBT144-64_K4.2.0_GCC4.8.4/x86_64-native-linuxapp-gcc/3d927d246f6b44ddb51da6c7375d545f/dpdk/lib/librte_stack/rte_stack_lf_generic.h: In function ‘__rte_stack_lf_push_elems’:
/tmp/UBT144-64_K4.2.0_GCC4.8.4/x86_64-native-linuxapp-gcc/3d927d246f6b44ddb51da6c7375d545f/dpdk/lib/librte_stack/rte_stack_lf_generic.h:68:3: warning: implicit declaration of function ‘rte_atomic128_cmp_exchange’ [-Wimplicit-function-declaration]
   success = rte_atomic128_cmp_exchange(
   ^
/tmp/UBT144-64_K4.2.0_GCC4.8.4/x86_64-native-linuxapp-gcc/3d927d246f6b44ddb51da6c7375d545f/dpdk/lib/librte_stack/rte_stack_lf_generic.h:68:3: warning: nested extern declaration of ‘rte_atomic128_cmp_exchange’ [-Wnested-externs]
/tmp/UBT144-64_K4.2.0_GCC4.8.4/x86_64-native-linuxapp-gcc/3d927d246f6b44ddb51da6c7375d545f/dpdk/lib/librte_stack/rte_stack_lf_generic.h:69:6: error: ‘rte_int128_t’ undeclared (first use in this function)
     (rte_int128_t *)&list->head,
      ^
/tmp/UBT144-64_K4.2.0_GCC4.8.4/x86_64-native-linuxapp-gcc/3d927d246f6b44ddb51da6c7375d545f/dpdk/lib/librte_stack/rte_stack_lf_generic.h:69:6: note: each undeclared identifier is reported only once for each function it appears in
/tmp/UBT144-64_K4.2.0_GCC4.8.4/x86_64-native-linuxapp-gcc/3d927d246f6b44ddb51da6c7375d545f/dpdk/lib/librte_stack/rte_stack_lf_generic.h:69:20: error: expected expression before ‘)’ token
     (rte_int128_t *)&list->head,
                    ^
/tmp/UBT144-64_K4.2.0_GCC4.8.4/x86_64-native-linuxapp-gcc/3d927d246f6b44ddb51da6c7375d545f/dpdk/lib/librte_stack/rte_stack_lf_generic.h:50:28: warning: variable ‘new_head’ set but not used [-Wunused-but-set-variable]
   struct rte_stack_lf_head new_head;
                            ^
/tmp/UBT144-64_K4.2.0_GCC4.8.4/x86_64-native-linuxapp-gcc/3d927d246f6b44ddb51da6c7375d545f/dpdk/lib/librte_stack/rte_stack_lf_generic.h: In function ‘__rte_stack_lf_pop_elems’:
/tmp/UBT144-64_K4.2.0_GCC4.8.4/x86_64-native-linuxapp-gcc/3d927d246f6b44ddb51da6c7375d545f/dpdk/lib/librte_stack/rte_stack_lf_generic.h:153:6: error: ‘rte_int128_t’ undeclared (first use in this function)
     (rte_int128_t *)&list->head,
      ^
/tmp/UBT144-64_K4.2.0_GCC4.8.4/x86_64-native-linuxapp-gcc/3d927d246f6b44ddb51da6c7375d545f/dpdk/lib/librte_stack/rte_stack_lf_generic.h:153:20: error: expected expression before ‘)’ token
     (rte_int128_t *)&list->head,
                    ^
/tmp/UBT144-64_K4.2.0_GCC4.8.4/x86_64-native-linuxapp-gcc/3d927d246f6b44ddb51da6c7375d545f/dpdk/lib/librte_stack/rte_stack_lf_generic.h:114:28: warning: variable ‘new_head’ set but not used [-Wunused-but-set-variable]
   struct rte_stack_lf_head new_head;
                            ^
make[5]: *** [rte_stack_std.o] Error 1
make[4]: *** [librte_stack] Error 2
make[4]: *** Waiting for unfinished jobs....
--
  CC guest_channel.o
  CC rte_power_empty_poll.o
  CC power_pstate_cpufreq.o
  AR librte_power.a
  INSTALL-LIB librte_power.a
make[5]: warning:  Clock skew detected.  Your build may be incomplete.
make[3]: *** [lib] Error 2
make[2]: *** [all] Error 2
make[1]: *** [pre_install] Error 2
make: *** [install] Error 2

*Failed Build #3:
OS: UBT1804
Target: x86_64-native-linuxapp-clang
  CC rte_hypervisor.o
  CC rte_spinlock.o
  CC rte_cycles.o
  AR librte_eal.a
  INSTALL-LIB librte_eal.a
make[7]: warning:  Clock skew detected.  Your build may be incomplete.
== Build lib/librte_meter
== Build lib/librte_timer
== Build lib/librte_pci
== Build lib/librte_cmdline
== Build lib/librte_ring
--
  SYMLINK-FILE include/cmdline_cirbuf.h
== Build lib/librte_power
In file included from /tmp/UBT1804_K4.15.0_Clang6.0.0/x86_64-native-linuxapp-clang/3d927d246f6b44ddb51da6c7375d545f/dpdk/lib/librte_stack/rte_stack.c:16:
In file included from /tmp/UBT1804_K4.15.0_Clang6.0.0/x86_64-native-linuxapp-clang/3d927d246f6b44ddb51da6c7375d545f/dpdk/lib/librte_stack/rte_stack.h:95:
In file included from /tmp/UBT1804_K4.15.0_Clang6.0.0/x86_64-native-linuxapp-clang/3d927d246f6b44ddb51da6c7375d545f/dpdk/lib/librte_stack/rte_stack_lf.h:11:
/tmp/UBT1804_K4.15.0_Clang6.0.0/x86_64-native-linuxapp-clang/3d927d246f6b44ddb51da6c7375d545f/dpdk/lib/librte_stack/rte_stack_lf_generic.h:68:13: warning: implicit declaration of function 'rte_atomic128_cmp_exchange' is invalid in C99 [-Wimplicit-function-declaration]
                success = rte_atomic128_cmp_exchange(
                          ^
/tmp/UBT1804_K4.15.0_Clang6.0.0/x86_64-native-linuxapp-clang/3d927d246f6b44ddb51da6c7375d545f/dpdk/lib/librte_stack/rte_stack_lf_generic.h:68:13: warning: this function declaration is not a prototype [-Wstrict-prototypes]
/tmp/UBT1804_K4.15.0_Clang6.0.0/x86_64-native-linuxapp-clang/3d927d246f6b44ddb51da6c7375d545f/dpdk/lib/librte_stack/rte_stack_lf_generic.h:69:20: error: expected expression
                                (rte_int128_t *)&list->head,
                                               ^
/tmp/UBT1804_K4.15.0_Clang6.0.0/x86_64-native-linuxapp-clang/3d927d246f6b44ddb51da6c7375d545f/dpdk/lib/librte_stack/rte_stack_lf_generic.h:69:6: error: use of undeclared identifier 'rte_int128_t'
                                (rte_int128_t *)&list->head,
                                 ^
/tmp/UBT1804_K4.15.0_Clang6.0.0/x86_64-native-linuxapp-clang/3d927d246f6b44ddb51da6c7375d545f/dpdk/lib/librte_stack/rte_stack_lf_generic.h:70:20: error: expected expression
                                (rte_int128_t *)&old_head,
                                               ^
/tmp/UBT1804_K4.15.0_Clang6.0.0/x86_64-native-linuxapp-clang/3d927d246f6b44ddb51da6c7375d545f/dpdk/lib/librte_stack/rte_stack_lf_generic.h:70:6: error: use of undeclared identifier 'rte_int128_t'
                                (rte_int128_t *)&old_head,
                                 ^
/tmp/UBT1804_K4.15.0_Clang6.0.0/x86_64-native-linuxapp-clang/3d927d246f6b44ddb51da6c7375d545f/dpdk/lib/librte_stack/rte_stack_lf_generic.h:71:20: error: expected expression
                                (rte_int128_t *)&new_head,
                                               ^
/tmp/UBT1804_K4.15.0_Clang6.0.0/x86_64-native-linuxapp-clang/3d927d246f6b44ddb51da6c7375d545f/dpdk/lib/librte_stack/rte_stack_lf_generic.h:71:6: error: use of undeclared identifier 'rte_int128_t'
                                (rte_int128_t *)&new_head,
                                 ^
/tmp/UBT1804_K4.15.0_Clang6.0.0/x86_64-native-linuxapp-clang/3d927d246f6b44ddb51da6c7375d545f/dpdk/lib/librte_stack/rte_stack_lf_generic.h:152:13: warning: implicit declaration of function 'rte_atomic128_cmp_exchange' is invalid in C99 [-Wimplicit-function-declaration]
                success = rte_atomic128_cmp_exchange(
                          ^
/tmp/UBT1804_K4.15.0_Clang6.0.0/x86_64-native-linuxapp-clang/3d927d246f6b44ddb51da6c7375d545f/dpdk/lib/librte_stack/rte_stack_lf_generic.h:153:20: error: expected expression
                                (rte_int128_t *)&list->head,
                                               ^
/tmp/UBT1804_K4.15.0_Clang6.0.0/x86_64-native-linuxapp-clang/3d927d246f6b44ddb51da6c7375d545f/dpdk/lib/librte_stack/rte_stack_lf_generic.h:153:6: error: use of undeclared identifier 'rte_int128_t'
                                (rte_int128_t *)&list->head,
                                 ^
  SYMLINK-FILE include/cmdline_parse_portlist.h
  CC cmdline.o
/tmp/UBT1804_K4.15.0_Clang6.0.0/x86_64-native-linuxapp-clang/3d927d246f6b44ddb51da6c7375d545f/dpdk/lib/librte_stack/rte_stack_lf_generic.h:154:20: error: expected expression
                                (rte_int128_t *)&old_head,
                                               ^
/tmp/UBT1804_K4.15.0_Clang6.0.0/x86_64-native-linuxapp-clang/3d927d246f6b44ddb51da6c7375d545f/dpdk/lib/librte_stack/rte_stack_lf_generic.h:154:6: error: use of undeclared identifier 'rte_int128_t'
                                (rte_int128_t *)&old_head,
                                 ^
/tmp/UBT1804_K4.15.0_Clang6.0.0/x86_64-native-linuxapp-clang/3d927d246f6b44ddb51da6c7375d545f/dpdk/lib/librte_stack/rte_stack_lf_generic.h:155:20: error: expected expression
                                (rte_int128_t *)&new_head,
                                               ^
/tmp/UBT1804_K4.15.0_Clang6.0.0/x86_64-native-linuxapp-clang/3d927d246f6b44ddb51da6c7375d545f/dpdk/lib/librte_stack/rte_stack_lf_generic.h:155:6: error: use of undeclared identifier 'rte_int128_t'
                                (rte_int128_t *)&new_head,
                                 ^
3 warnings and 12 errors generated.
/tmp/UBT1804_K4.15.0_Clang6.0.0/x86_64-native-linuxapp-clang/3d927d246f6b44ddb51da6c7375d545f/dpdk/mk/internal/rte.compile-pre.mk:114: recipe for target 'rte_stack.o' failed
make[5]: *** [rte_stack.o] Error 1
make[5]: *** Waiting for unfinished jobs....
  CC acl_bld.o
  CC rte_stack_std.o
  AR librte_jobstats.a
--
  INSTALL-LIB librte_ring.a
  CC acl_run_scalar.o
In file included from /tmp/UBT1804_K4.15.0_Clang6.0.0/x86_64-native-linuxapp-clang/3d927d246f6b44ddb51da6c7375d545f/dpdk/lib/librte_stack/rte_stack_std.c:5:
In file included from /tmp/UBT1804_K4.15.0_Clang6.0.0/x86_64-native-linuxapp-clang/3d927d246f6b44ddb51da6c7375d545f/dpdk/lib/librte_stack/rte_stack.h:95:
In file included from /tmp/UBT1804_K4.15.0_Clang6.0.0/x86_64-native-linuxapp-clang/3d927d246f6b44ddb51da6c7375d545f/dpdk/lib/librte_stack/rte_stack_lf.h:11:
/tmp/UBT1804_K4.15.0_Clang6.0.0/x86_64-native-linuxapp-clang/3d927d246f6b44ddb51da6c7375d545f/dpdk/lib/librte_stack/rte_stack_lf_generic.h:68:13: warning: implicit declaration of function 'rte_atomic128_cmp_exchange' is invalid in C99 [-Wimplicit-function-declaration]
                success = rte_atomic128_cmp_exchange(
                          ^
/tmp/UBT1804_K4.15.0_Clang6.0.0/x86_64-native-linuxapp-clang/3d927d246f6b44ddb51da6c7375d545f/dpdk/lib/librte_stack/rte_stack_lf_generic.h:68:13: warning: this function declaration is not a prototype [-Wstrict-prototypes]
/tmp/UBT1804_K4.15.0_Clang6.0.0/x86_64-native-linuxapp-clang/3d927d246f6b44ddb51da6c7375d545f/dpdk/lib/librte_stack/rte_stack_lf_generic.h:69:20: error: expected expression
                                (rte_int128_t *)&list->head,
                                               ^
/tmp/UBT1804_K4.15.0_Clang6.0.0/x86_64-native-linuxapp-clang/3d927d246f6b44ddb51da6c7375d545f/dpdk/lib/librte_stack/rte_stack_lf_generic.h:69:6: error: use of undeclared identifier 'rte_int128_t'
                                (rte_int128_t *)&list->head,
                                 ^
/tmp/UBT1804_K4.15.0_Clang6.0.0/x86_64-native-linuxapp-clang/3d927d246f6b44ddb51da6c7375d545f/dpdk/lib/librte_stack/rte_stack_lf_generic.h:70:20: error: expected expression
                                (rte_int128_t *)&old_head,
                                               ^
/tmp/UBT1804_K4.15.0_Clang6.0.0/x86_64-native-linuxapp-clang/3d927d246f6b44ddb51da6c7375d545f/dpdk/lib/librte_stack/rte_stack_lf_generic.h:70:6: error: use of undeclared identifier 'rte_int128_t'
                                (rte_int128_t *)&old_head,
                                 ^
/tmp/UBT1804_K4.15.0_Clang6.0.0/x86_64-native-linuxapp-clang/3d927d246f6b44ddb51da6c7375d545f/dpdk/lib/librte_stack/rte_stack_lf_generic.h:71:20: error: expected expression
                                (rte_int128_t *)&new_head,
                                               ^
/tmp/UBT1804_K4.15.0_Clang6.0.0/x86_64-native-linuxapp-clang/3d927d246f6b44ddb51da6c7375d545f/dpdk/lib/librte_stack/rte_stack_lf_generic.h:71:6: error: use of undeclared identifier 'rte_int128_t'
                                (rte_int128_t *)&new_head,
                                 ^
/tmp/UBT1804_K4.15.0_Clang6.0.0/x86_64-native-linuxapp-clang/3d927d246f6b44ddb51da6c7375d545f/dpdk/lib/librte_stack/rte_stack_lf_generic.h:152:13: warning: implicit declaration of function 'rte_atomic128_cmp_exchange' is invalid in C99 [-Wimplicit-function-declaration]
                success = rte_atomic128_cmp_exchange(
                          ^
/tmp/UBT1804_K4.15.0_Clang6.0.0/x86_64-native-linuxapp-clang/3d927d246f6b44ddb51da6c7375d545f/dpdk/lib/librte_stack/rte_stack_lf_generic.h:153:20: error: expected expression
                                (rte_int128_t *)&list->head,
                                               ^
/tmp/UBT1804_K4.15.0_Clang6.0.0/x86_64-native-linuxapp-clang/3d927d246f6b44ddb51da6c7375d545f/dpdk/lib/librte_stack/rte_stack_lf_generic.h:153:6: error: use of undeclared identifier 'rte_int128_t'
                                (rte_int128_t *)&list->head,
                                 ^
/tmp/UBT1804_K4.15.0_Clang6.0.0/x86_64-native-linuxapp-clang/3d927d246f6b44ddb51da6c7375d545f/dpdk/lib/librte_stack/rte_stack_lf_generic.h:154:20: error: expected expression
                                (rte_int128_t *)&old_head,
                                               ^
/tmp/UBT1804_K4.15.0_Clang6.0.0/x86_64-native-linuxapp-clang/3d927d246f6b44ddb51da6c7375d545f/dpdk/lib/librte_stack/rte_stack_lf_generic.h:154:6: error: use of undeclared identifier 'rte_int128_t'
                                (rte_int128_t *)&old_head,
                                 ^
/tmp/UBT1804_K4.15.0_Clang6.0.0/x86_64-native-linuxapp-clang/3d927d246f6b44ddb51da6c7375d545f/dpdk/lib/librte_stack/rte_stack_lf_generic.h:155:20: error: expected expression
                                (rte_int128_t *)&new_head,
                                               ^
/tmp/UBT1804_K4.15.0_Clang6.0.0/x86_64-native-linuxapp-clang/3d927d246f6b44ddb51da6c7375d545f/dpdk/lib/librte_stack/rte_stack_lf_generic.h:155:6: error: use of undeclared identifier 'rte_int128_t'
                                (rte_int128_t *)&new_head,
                                 ^
3 warnings and 12 errors generated.
/tmp/UBT1804_K4.15.0_Clang6.0.0/x86_64-native-linuxapp-clang/3d927d246f6b44ddb51da6c7375d545f/dpdk/mk/internal/rte.compile-pre.mk:114: recipe for target 'rte_stack_std.o' failed
make[5]: *** [rte_stack_std.o] Error 1
/tmp/UBT1804_K4.15.0_Clang6.0.0/x86_64-native-linuxapp-clang/3d927d246f6b44ddb51da6c7375d545f/dpdk/mk/rte.subdir.mk:35: recipe for target 'librte_stack' failed
make[4]: *** [librte_stack] Error 2
make[4]: *** Waiting for unfinished jobs....
== Build lib/librte_mempool
  CC cmdline_parse_etheraddr.o
  CC acl_run_sse.o
--
  INSTALL-LIB librte_acl.a
  AR librte_mempool.a
  INSTALL-LIB librte_mempool.a
  AR librte_power.a
  INSTALL-LIB librte_power.a
make[5]: warning:  Clock skew detected.  Your build may be incomplete.
/tmp/UBT1804_K4.15.0_Clang6.0.0/x86_64-native-linuxapp-clang/3d927d246f6b44ddb51da6c7375d545f/dpdk/mk/rte.sdkbuild.mk:46: recipe for target 'lib' failed
make[3]: *** [lib] Error 2
/tmp/UBT1804_K4.15.0_Clang6.0.0/x86_64-native-linuxapp-clang/3d927d246f6b44ddb51da6c7375d545f/dpdk/mk/rte.sdkroot.mk:98: recipe for target 'all' failed
make[2]: *** [all] Error 2
/tmp/UBT1804_K4.15.0_Clang6.0.0/x86_64-native-linuxapp-clang/3d927d246f6b44ddb51da6c7375d545f/dpdk/mk/rte.sdkinstall.mk:60: recipe for target 'pre_install' failed
make[1]: *** [pre_install] Error 2
/tmp/UBT1804_K4.15.0_Clang6.0.0/x86_64-native-linuxapp-clang/3d927d246f6b44ddb51da6c7375d545f/dpdk/mk/rte.sdkroot.mk:77: recipe for target 'install' failed
make: *** [install] Error 2

*Failed Build #4:
OS: UBT1804
Target: x86_64-native-linuxapp-gcc
  CC rte_hypervisor.o
  CC rte_spinlock.o
  CC rte_cycles.o
  AR librte_eal.a
  INSTALL-LIB librte_eal.a
make[7]: warning:  Clock skew detected.  Your build may be incomplete.
== Build lib/librte_pci
== Build lib/librte_meter
== Build lib/librte_timer
== Build lib/librte_ring
== Build lib/librte_jobstats
--
  AR librte_timer.a
In file included from /tmp/UBT1804_K4.15.0_GCC7.3.0/x86_64-native-linuxapp-gcc/3d927d246f6b44ddb51da6c7375d545f/dpdk/lib/librte_stack/rte_stack_lf.h:11:0,
                 from /tmp/UBT1804_K4.15.0_GCC7.3.0/x86_64-native-linuxapp-gcc/3d927d246f6b44ddb51da6c7375d545f/dpdk/lib/librte_stack/rte_stack.h:95,
                 from /tmp/UBT1804_K4.15.0_GCC7.3.0/x86_64-native-linuxapp-gcc/3d927d246f6b44ddb51da6c7375d545f/dpdk/lib/librte_stack/rte_stack.c:16:
/tmp/UBT1804_K4.15.0_GCC7.3.0/x86_64-native-linuxapp-gcc/3d927d246f6b44ddb51da6c7375d545f/dpdk/lib/librte_stack/rte_stack_lf_generic.h: In function ‘__rte_stack_lf_push_elems’:
/tmp/UBT1804_K4.15.0_GCC7.3.0/x86_64-native-linuxapp-gcc/3d927d246f6b44ddb51da6c7375d545f/dpdk/lib/librte_stack/rte_stack_lf_generic.h:68:13: warning: implicit declaration of function ‘rte_atomic128_cmp_exchange’; did you mean ‘rte_atomic32_exchange’? [-Wimplicit-function-declaration]
   success = rte_atomic128_cmp_exchange(
             ^~~~~~~~~~~~~~~~~~~~~~~~~~
             rte_atomic32_exchange
/tmp/UBT1804_K4.15.0_GCC7.3.0/x86_64-native-linuxapp-gcc/3d927d246f6b44ddb51da6c7375d545f/dpdk/lib/librte_stack/rte_stack_lf_generic.h:68:13: warning: nested extern declaration of ‘rte_atomic128_cmp_exchange’ [-Wnested-externs]
/tmp/UBT1804_K4.15.0_GCC7.3.0/x86_64-native-linuxapp-gcc/3d927d246f6b44ddb51da6c7375d545f/dpdk/lib/librte_stack/rte_stack_lf_generic.h:69:6: error: ‘rte_int128_t’ undeclared (first use in this function); did you mean ‘__int128_t’?
     (rte_int128_t *)&list->head,
      ^~~~~~~~~~~~
      __int128_t
/tmp/UBT1804_K4.15.0_GCC7.3.0/x86_64-native-linuxapp-gcc/3d927d246f6b44ddb51da6c7375d545f/dpdk/lib/librte_stack/rte_stack_lf_generic.h:69:6: note: each undeclared identifier is reported only once for each function it appears in
/tmp/UBT1804_K4.15.0_GCC7.3.0/x86_64-native-linuxapp-gcc/3d927d246f6b44ddb51da6c7375d545f/dpdk/lib/librte_stack/rte_stack_lf_generic.h:69:20: error: expected expression before ‘)’ token
     (rte_int128_t *)&list->head,
                    ^
/tmp/UBT1804_K4.15.0_GCC7.3.0/x86_64-native-linuxapp-gcc/3d927d246f6b44ddb51da6c7375d545f/dpdk/lib/librte_stack/rte_stack_lf_generic.h:50:28: warning: variable ‘new_head’ set but not used [-Wunused-but-set-variable]
   struct rte_stack_lf_head new_head;
                            ^~~~~~~~
/tmp/UBT1804_K4.15.0_GCC7.3.0/x86_64-native-linuxapp-gcc/3d927d246f6b44ddb51da6c7375d545f/dpdk/lib/librte_stack/rte_stack_lf_generic.h: In function ‘__rte_stack_lf_pop_elems’:
/tmp/UBT1804_K4.15.0_GCC7.3.0/x86_64-native-linuxapp-gcc/3d927d246f6b44ddb51da6c7375d545f/dpdk/lib/librte_stack/rte_stack_lf_generic.h:153:6: error: ‘rte_int128_t’ undeclared (first use in this function); did you mean ‘__int128_t’?
     (rte_int128_t *)&list->head,
      ^~~~~~~~~~~~
      __int128_t
/tmp/UBT1804_K4.15.0_GCC7.3.0/x86_64-native-linuxapp-gcc/3d927d246f6b44ddb51da6c7375d545f/dpdk/lib/librte_stack/rte_stack_lf_generic.h:153:20: error: expected expression before ‘)’ token
     (rte_int128_t *)&list->head,
                    ^
/tmp/UBT1804_K4.15.0_GCC7.3.0/x86_64-native-linuxapp-gcc/3d927d246f6b44ddb51da6c7375d545f/dpdk/lib/librte_stack/rte_stack_lf_generic.h:114:28: warning: variable ‘new_head’ set but not used [-Wunused-but-set-variable]
   struct rte_stack_lf_head new_head;
                            ^~~~~~~~
  AR librte_meter.a
/tmp/UBT1804_K4.15.0_GCC7.3.0/x86_64-native-linuxapp-gcc/3d927d246f6b44ddb51da6c7375d545f/dpdk/mk/internal/rte.compile-pre.mk:114: recipe for target 'rte_stack.o' failed
make[5]: *** [rte_stack.o] Error 1
/tmp/UBT1804_K4.15.0_GCC7.3.0/x86_64-native-linuxapp-gcc/3d927d246f6b44ddb51da6c7375d545f/dpdk/mk/rte.subdir.mk:35: recipe for target 'librte_stack' failed
make[4]: *** [librte_stack] Error 2
make[4]: *** Waiting for unfinished jobs....
  INSTALL-LIB librte_timer.a
  SYMLINK-FILE include/cmdline_cirbuf.h
  CC acl_gen.o
--
  CC cmdline_parse_portlist.o
  AR librte_cmdline.a
  INSTALL-LIB librte_cmdline.a
  AR librte_acl.a
  INSTALL-LIB librte_acl.a
/tmp/UBT1804_K4.15.0_GCC7.3.0/x86_64-native-linuxapp-gcc/3d927d246f6b44ddb51da6c7375d545f/dpdk/mk/rte.sdkbuild.mk:46: recipe for target 'lib' failed
make[3]: *** [lib] Error 2
/tmp/UBT1804_K4.15.0_GCC7.3.0/x86_64-native-linuxapp-gcc/3d927d246f6b44ddb51da6c7375d545f/dpdk/mk/rte.sdkroot.mk:98: recipe for target 'all' failed
make[2]: *** [all] Error 2
/tmp/UBT1804_K4.15.0_GCC7.3.0/x86_64-native-linuxapp-gcc/3d927d246f6b44ddb51da6c7375d545f/dpdk/mk/rte.sdkinstall.mk:60: recipe for target 'pre_install' failed
make[1]: *** [pre_install] Error 2
/tmp/UBT1804_K4.15.0_GCC7.3.0/x86_64-native-linuxapp-gcc/3d927d246f6b44ddb51da6c7375d545f/dpdk/mk/rte.sdkroot.mk:77: recipe for target 'install' failed
make: *** [install] Error 2

*Failed Build #5:
OS: UBT1810
Target: x86_64-native-linuxapp-gcc
  CC rte_hypervisor.o
  CC rte_spinlock.o
  CC rte_cycles.o
  AR librte_eal.a
  INSTALL-LIB librte_eal.a
make[7]: warning:  Clock skew detected.  Your build may be incomplete.
== Build lib/librte_pci
== Build lib/librte_ring
== Build lib/librte_timer
== Build lib/librte_cmdline
== Build lib/librte_meter
--
  INSTALL-LIB librte_meter.a
In file included from /tmp/UBT1810_K4.18.0_GCC8.2.0/x86_64-native-linuxapp-gcc/3d927d246f6b44ddb51da6c7375d545f/dpdk/lib/librte_stack/rte_stack_lf.h:11,
                 from /tmp/UBT1810_K4.18.0_GCC8.2.0/x86_64-native-linuxapp-gcc/3d927d246f6b44ddb51da6c7375d545f/dpdk/lib/librte_stack/rte_stack.h:95,
                 from /tmp/UBT1810_K4.18.0_GCC8.2.0/x86_64-native-linuxapp-gcc/3d927d246f6b44ddb51da6c7375d545f/dpdk/lib/librte_stack/rte_stack.c:16:
/tmp/UBT1810_K4.18.0_GCC8.2.0/x86_64-native-linuxapp-gcc/3d927d246f6b44ddb51da6c7375d545f/dpdk/lib/librte_stack/rte_stack_lf_generic.h: In function ‘__rte_stack_lf_push_elems’:
/tmp/UBT1810_K4.18.0_GCC8.2.0/x86_64-native-linuxapp-gcc/3d927d246f6b44ddb51da6c7375d545f/dpdk/lib/librte_stack/rte_stack_lf_generic.h:68:13: warning: implicit declaration of function ‘rte_atomic128_cmp_exchange’; did you mean ‘rte_atomic32_exchange’? [-Wimplicit-function-declaration]
   success = rte_atomic128_cmp_exchange(
             ^~~~~~~~~~~~~~~~~~~~~~~~~~
             rte_atomic32_exchange
/tmp/UBT1810_K4.18.0_GCC8.2.0/x86_64-native-linuxapp-gcc/3d927d246f6b44ddb51da6c7375d545f/dpdk/lib/librte_stack/rte_stack_lf_generic.h:68:13: warning: nested extern declaration of ‘rte_atomic128_cmp_exchange’ [-Wnested-externs]
/tmp/UBT1810_K4.18.0_GCC8.2.0/x86_64-native-linuxapp-gcc/3d927d246f6b44ddb51da6c7375d545f/dpdk/lib/librte_stack/rte_stack_lf_generic.h:69:6: error: ‘rte_int128_t’ undeclared (first use in this function); did you mean ‘rte_iova_t’?
     (rte_int128_t *)&list->head,
      ^~~~~~~~~~~~
      rte_iova_t
/tmp/UBT1810_K4.18.0_GCC8.2.0/x86_64-native-linuxapp-gcc/3d927d246f6b44ddb51da6c7375d545f/dpdk/lib/librte_stack/rte_stack_lf_generic.h:69:6: note: each undeclared identifier is reported only once for each function it appears in
/tmp/UBT1810_K4.18.0_GCC8.2.0/x86_64-native-linuxapp-gcc/3d927d246f6b44ddb51da6c7375d545f/dpdk/lib/librte_stack/rte_stack_lf_generic.h:69:20: error: expected expression before ‘)’ token
     (rte_int128_t *)&list->head,
                    ^
/tmp/UBT1810_K4.18.0_GCC8.2.0/x86_64-native-linuxapp-gcc/3d927d246f6b44ddb51da6c7375d545f/dpdk/lib/librte_stack/rte_stack_lf_generic.h:50:28: warning: variable ‘new_head’ set but not used [-Wunused-but-set-variable]
   struct rte_stack_lf_head new_head;
                            ^~~~~~~~
/tmp/UBT1810_K4.18.0_GCC8.2.0/x86_64-native-linuxapp-gcc/3d927d246f6b44ddb51da6c7375d545f/dpdk/lib/librte_stack/rte_stack_lf_generic.h: In function ‘__rte_stack_lf_pop_elems’:
/tmp/UBT1810_K4.18.0_GCC8.2.0/x86_64-native-linuxapp-gcc/3d927d246f6b44ddb51da6c7375d545f/dpdk/lib/librte_stack/rte_stack_lf_generic.h:153:6: error: ‘rte_int128_t’ undeclared (first use in this function); did you mean ‘rte_iova_t’?
     (rte_int128_t *)&list->head,
      ^~~~~~~~~~~~
      rte_iova_t
  SYMLINK-FILE include/cmdline_vt100.h
/tmp/UBT1810_K4.18.0_GCC8.2.0/x86_64-native-linuxapp-gcc/3d927d246f6b44ddb51da6c7375d545f/dpdk/lib/librte_stack/rte_stack_lf_generic.h:153:20: error: expected expression before ‘)’ token
     (rte_int128_t *)&list->head,
                    ^
/tmp/UBT1810_K4.18.0_GCC8.2.0/x86_64-native-linuxapp-gcc/3d927d246f6b44ddb51da6c7375d545f/dpdk/lib/librte_stack/rte_stack_lf_generic.h:114:28: warning: variable ‘new_head’ set but not used [-Wunused-but-set-variable]
   struct rte_stack_lf_head new_head;
                            ^~~~~~~~
  CC acl_gen.o
make[5]: *** [/tmp/UBT1810_K4.18.0_GCC8.2.0/x86_64-native-linuxapp-gcc/3d927d246f6b44ddb51da6c7375d545f/dpdk/mk/internal/rte.compile-pre.mk:116: rte_stack.o] Error 1
make[5]: *** Waiting for unfinished jobs....
--
  SYMLINK-FILE include/cmdline_socket.h
In file included from /tmp/UBT1810_K4.18.0_GCC8.2.0/x86_64-native-linuxapp-gcc/3d927d246f6b44ddb51da6c7375d545f/dpdk/lib/librte_stack/rte_stack_lf.h:11,
                 from /tmp/UBT1810_K4.18.0_GCC8.2.0/x86_64-native-linuxapp-gcc/3d927d246f6b44ddb51da6c7375d545f/dpdk/lib/librte_stack/rte_stack.h:95,
                 from /tmp/UBT1810_K4.18.0_GCC8.2.0/x86_64-native-linuxapp-gcc/3d927d246f6b44ddb51da6c7375d545f/dpdk/lib/librte_stack/rte_stack_std.c:5:
/tmp/UBT1810_K4.18.0_GCC8.2.0/x86_64-native-linuxapp-gcc/3d927d246f6b44ddb51da6c7375d545f/dpdk/lib/librte_stack/rte_stack_lf_generic.h: In function ‘__rte_stack_lf_push_elems’:
/tmp/UBT1810_K4.18.0_GCC8.2.0/x86_64-native-linuxapp-gcc/3d927d246f6b44ddb51da6c7375d545f/dpdk/lib/librte_stack/rte_stack_lf_generic.h:68:13: warning: implicit declaration of function ‘rte_atomic128_cmp_exchange’; did you mean ‘rte_atomic32_exchange’? [-Wimplicit-function-declaration]
   success = rte_atomic128_cmp_exchange(
             ^~~~~~~~~~~~~~~~~~~~~~~~~~
             rte_atomic32_exchange
/tmp/UBT1810_K4.18.0_GCC8.2.0/x86_64-native-linuxapp-gcc/3d927d246f6b44ddb51da6c7375d545f/dpdk/lib/librte_stack/rte_stack_lf_generic.h:68:13: warning: nested extern declaration of ‘rte_atomic128_cmp_exchange’ [-Wnested-externs]
/tmp/UBT1810_K4.18.0_GCC8.2.0/x86_64-native-linuxapp-gcc/3d927d246f6b44ddb51da6c7375d545f/dpdk/lib/librte_stack/rte_stack_lf_generic.h:69:6: error: ‘rte_int128_t’ undeclared (first use in this function); did you mean ‘rte_iova_t’?
     (rte_int128_t *)&list->head,
      ^~~~~~~~~~~~
      rte_iova_t
/tmp/UBT1810_K4.18.0_GCC8.2.0/x86_64-native-linuxapp-gcc/3d927d246f6b44ddb51da6c7375d545f/dpdk/lib/librte_stack/rte_stack_lf_generic.h:69:6: note: each undeclared identifier is reported only once for each function it appears in
/tmp/UBT1810_K4.18.0_GCC8.2.0/x86_64-native-linuxapp-gcc/3d927d246f6b44ddb51da6c7375d545f/dpdk/lib/librte_stack/rte_stack_lf_generic.h:69:20: error: expected expression before ‘)’ token
     (rte_int128_t *)&list->head,
                    ^
/tmp/UBT1810_K4.18.0_GCC8.2.0/x86_64-native-linuxapp-gcc/3d927d246f6b44ddb51da6c7375d545f/dpdk/lib/librte_stack/rte_stack_lf_generic.h:50:28: warning: variable ‘new_head’ set but not used [-Wunused-but-set-variable]
   struct rte_stack_lf_head new_head;
                            ^~~~~~~~
/tmp/UBT1810_K4.18.0_GCC8.2.0/x86_64-native-linuxapp-gcc/3d927d246f6b44ddb51da6c7375d545f/dpdk/lib/librte_stack/rte_stack_lf_generic.h: In function ‘__rte_stack_lf_pop_elems’:
/tmp/UBT1810_K4.18.0_GCC8.2.0/x86_64-native-linuxapp-gcc/3d927d246f6b44ddb51da6c7375d545f/dpdk/lib/librte_stack/rte_stack_lf_generic.h:153:6: error: ‘rte_int128_t’ undeclared (first use in this function); did you mean ‘rte_iova_t’?
     (rte_int128_t *)&list->head,
      ^~~~~~~~~~~~
      rte_iova_t
/tmp/UBT1810_K4.18.0_GCC8.2.0/x86_64-native-linuxapp-gcc/3d927d246f6b44ddb51da6c7375d545f/dpdk/lib/librte_stack/rte_stack_lf_generic.h:153:20: error: expected expression before ‘)’ token
     (rte_int128_t *)&list->head,
                    ^
/tmp/UBT1810_K4.18.0_GCC8.2.0/x86_64-native-linuxapp-gcc/3d927d246f6b44ddb51da6c7375d545f/dpdk/lib/librte_stack/rte_stack_lf_generic.h:114:28: warning: variable ‘new_head’ set but not used [-Wunused-but-set-variable]
   struct rte_stack_lf_head new_head;
                            ^~~~~~~~
  AR librte_jobstats.a
  INSTALL-LIB librte_jobstats.a
  SYMLINK-FILE include/cmdline_cirbuf.h
--
  INSTALL-LIB librte_mempool.a
  AR librte_cmdline.a
  INSTALL-LIB librte_cmdline.a
  AR librte_power.a
  INSTALL-LIB librte_power.a
make[5]: warning:  Clock skew detected.  Your build may be incomplete.
  AR librte_acl.a
  INSTALL-LIB librte_acl.a
  AR librte_hash.a
  INSTALL-LIB librte_hash.a
make[3]: *** [/tmp/UBT1810_K4.18.0_GCC8.2.0/x86_64-native-linuxapp-gcc/3d927d246f6b44ddb51da6c7375d545f/dpdk/mk/rte.sdkbuild.mk:48: lib] Error 2

*Failed Build #6:
OS: UBT1804
Target: x86_64-native-linuxapp-icc
  CC rte_hypervisor.o
  CC rte_spinlock.o
  CC rte_cycles.o
  AR librte_eal.a
  INSTALL-LIB librte_eal.a
make[7]: warning:  Clock skew detected.  Your build may be incomplete.
== Build lib/librte_timer
== Build lib/librte_acl
== Build lib/librte_pci
== Build lib/librte_metrics
== Build lib/librte_stack
--
  SYMLINK-FILE include/cmdline_parse_string.h
  CC acl_bld.o
In file included from /tmp/UBT1804_K4.15.0_ICC19.0.0/x86_64-native-linuxapp-icc/3d927d246f6b44ddb51da6c7375d545f/dpdk/lib/librte_stack/rte_stack_lf.h(11),
                 from /tmp/UBT1804_K4.15.0_ICC19.0.0/x86_64-native-linuxapp-icc/3d927d246f6b44ddb51da6c7375d545f/dpdk/lib/librte_stack/rte_stack.h(95),
                 from /tmp/UBT1804_K4.15.0_ICC19.0.0/x86_64-native-linuxapp-icc/3d927d246f6b44ddb51da6c7375d545f/dpdk/lib/librte_stack/rte_stack.c(16):
/tmp/UBT1804_K4.15.0_ICC19.0.0/x86_64-native-linuxapp-icc/3d927d246f6b44ddb51da6c7375d545f/dpdk/lib/librte_stack/rte_stack_lf_generic.h(68): warning #266: function "rte_atomic128_cmp_exchange" declared implicitly
  		success = rte_atomic128_cmp_exchange(
  		          ^

In file included from /tmp/UBT1804_K4.15.0_ICC19.0.0/x86_64-native-linuxapp-icc/3d927d246f6b44ddb51da6c7375d545f/dpdk/lib/librte_stack/rte_stack_lf.h(11),
                 from /tmp/UBT1804_K4.15.0_ICC19.0.0/x86_64-native-linuxapp-icc/3d927d246f6b44ddb51da6c7375d545f/dpdk/lib/librte_stack/rte_stack.h(95),
                 from /tmp/UBT1804_K4.15.0_ICC19.0.0/x86_64-native-linuxapp-icc/3d927d246f6b44ddb51da6c7375d545f/dpdk/lib/librte_stack/rte_stack.c(16):
/tmp/UBT1804_K4.15.0_ICC19.0.0/x86_64-native-linuxapp-icc/3d927d246f6b44ddb51da6c7375d545f/dpdk/lib/librte_stack/rte_stack_lf_generic.h(69): error: identifier "rte_int128_t" is undefined
  				(rte_int128_t *)&list->head,
  				 ^

In file included from /tmp/UBT1804_K4.15.0_ICC19.0.0/x86_64-native-linuxapp-icc/3d927d246f6b44ddb51da6c7375d545f/dpdk/lib/librte_stack/rte_stack_lf.h(11),
                 from /tmp/UBT1804_K4.15.0_ICC19.0.0/x86_64-native-linuxapp-icc/3d927d246f6b44ddb51da6c7375d545f/dpdk/lib/librte_stack/rte_stack.h(95),
                 from /tmp/UBT1804_K4.15.0_ICC19.0.0/x86_64-native-linuxapp-icc/3d927d246f6b44ddb51da6c7375d545f/dpdk/lib/librte_stack/rte_stack.c(16):
/tmp/UBT1804_K4.15.0_ICC19.0.0/x86_64-native-linuxapp-icc/3d927d246f6b44ddb51da6c7375d545f/dpdk/lib/librte_stack/rte_stack_lf_generic.h(69): error: expected an expression
  				(rte_int128_t *)&list->head,
  				               ^

In file included from /tmp/UBT1804_K4.15.0_ICC19.0.0/x86_64-native-linuxapp-icc/3d927d246f6b44ddb51da6c7375d545f/dpdk/lib/librte_stack/rte_stack_lf.h(11),
                 from /tmp/UBT1804_K4.15.0_ICC19.0.0/x86_64-native-linuxapp-icc/3d927d246f6b44ddb51da6c7375d545f/dpdk/lib/librte_stack/rte_stack.h(95),
                 from /tmp/UBT1804_K4.15.0_ICC19.0.0/x86_64-native-linuxapp-icc/3d927d246f6b44ddb51da6c7375d545f/dpdk/lib/librte_stack/rte_stack.c(16):
/tmp/UBT1804_K4.15.0_ICC19.0.0/x86_64-native-linuxapp-icc/3d927d246f6b44ddb51da6c7375d545f/dpdk/lib/librte_stack/rte_stack_lf_generic.h(69): error: expression must have integral type
  				(rte_int128_t *)&list->head,
  				                 ^

In file included from /tmp/UBT1804_K4.15.0_ICC19.0.0/x86_64-native-linuxapp-icc/3d927d246f6b44ddb51da6c7375d545f/dpdk/lib/librte_stack/rte_stack_lf.h(11),
                 from /tmp/UBT1804_K4.15.0_ICC19.0.0/x86_64-native-linuxapp-icc/3d927d246f6b44ddb51da6c7375d545f/dpdk/lib/librte_stack/rte_stack.h(95),
                 from /tmp/UBT1804_K4.15.0_ICC19.0.0/x86_64-native-linuxapp-icc/3d927d246f6b44ddb51da6c7375d545f/dpdk/lib/librte_stack/rte_stack.c(16):
/tmp/UBT1804_K4.15.0_ICC19.0.0/x86_64-native-linuxapp-icc/3d927d246f6b44ddb51da6c7375d545f/dpdk/lib/librte_stack/rte_stack_lf_generic.h(70): error: expected an expression
  				(rte_int128_t *)&old_head,
  				               ^

In file included from /tmp/UBT1804_K4.15.0_ICC19.0.0/x86_64-native-linuxapp-icc/3d927d246f6b44ddb51da6c7375d545f/dpdk/lib/librte_stack/rte_stack_lf.h(11),
                 from /tmp/UBT1804_K4.15.0_ICC19.0.0/x86_64-native-linuxapp-icc/3d927d246f6b44ddb51da6c7375d545f/dpdk/lib/librte_stack/rte_stack.h(95),
                 from /tmp/UBT1804_K4.15.0_ICC19.0.0/x86_64-native-linuxapp-icc/3d927d246f6b44ddb51da6c7375d545f/dpdk/lib/librte_stack/rte_stack.c(16):
/tmp/UBT1804_K4.15.0_ICC19.0.0/x86_64-native-linuxapp-icc/3d927d246f6b44ddb51da6c7375d545f/dpdk/lib/librte_stack/rte_stack_lf_generic.h(70): error: expression must have integral type
  				(rte_int128_t *)&old_head,
  				                 ^

In file included from /tmp/UBT1804_K4.15.0_ICC19.0.0/x86_64-native-linuxapp-icc/3d927d246f6b44ddb51da6c7375d545f/dpdk/lib/librte_stack/rte_stack_lf.h(11),
                 from /tmp/UBT1804_K4.15.0_ICC19.0.0/x86_64-native-linuxapp-icc/3d927d246f6b44ddb51da6c7375d545f/dpdk/lib/librte_stack/rte_stack.h(95),
                 from /tmp/UBT1804_K4.15.0_ICC19.0.0/x86_64-native-linuxapp-icc/3d927d246f6b44ddb51da6c7375d545f/dpdk/lib/librte_stack/rte_stack.c(16):
/tmp/UBT1804_K4.15.0_ICC19.0.0/x86_64-native-linuxapp-icc/3d927d246f6b44ddb51da6c7375d545f/dpdk/lib/librte_stack/rte_stack_lf_generic.h(71): error: expected an expression
  				(rte_int128_t *)&new_head,
  				               ^

In file included from /tmp/UBT1804_K4.15.0_ICC19.0.0/x86_64-native-linuxapp-icc/3d927d246f6b44ddb51da6c7375d545f/dpdk/lib/librte_stack/rte_stack_lf.h(11),
                 from /tmp/UBT1804_K4.15.0_ICC19.0.0/x86_64-native-linuxapp-icc/3d927d246f6b44ddb51da6c7375d545f/dpdk/lib/librte_stack/rte_stack.h(95),
                 from /tmp/UBT1804_K4.15.0_ICC19.0.0/x86_64-native-linuxapp-icc/3d927d246f6b44ddb51da6c7375d545f/dpdk/lib/librte_stack/rte_stack.c(16):
/tmp/UBT1804_K4.15.0_ICC19.0.0/x86_64-native-linuxapp-icc/3d927d246f6b44ddb51da6c7375d545f/dpdk/lib/librte_stack/rte_stack_lf_generic.h(71): error: expression must have integral type
  				(rte_int128_t *)&new_head,
  				                 ^

In file included from /tmp/UBT1804_K4.15.0_ICC19.0.0/x86_64-native-linuxapp-icc/3d927d246f6b44ddb51da6c7375d545f/dpdk/lib/librte_stack/rte_stack_lf.h(11),
                 from /tmp/UBT1804_K4.15.0_ICC19.0.0/x86_64-native-linuxapp-icc/3d927d246f6b44ddb51da6c7375d545f/dpdk/lib/librte_stack/rte_stack.h(95),
                 from /tmp/UBT1804_K4.15.0_ICC19.0.0/x86_64-native-linuxapp-icc/3d927d246f6b44ddb51da6c7375d545f/dpdk/lib/librte_stack/rte_stack.c(16):
/tmp/UBT1804_K4.15.0_ICC19.0.0/x86_64-native-linuxapp-icc/3d927d246f6b44ddb51da6c7375d545f/dpdk/lib/librte_stack/rte_stack_lf_generic.h(152): warning #266: function "rte_atomic128_cmp_exchange" declared implicitly
  		success = rte_atomic128_cmp_exchange(
  		          ^

In file included from /tmp/UBT1804_K4.15.0_ICC19.0.0/x86_64-native-linuxapp-icc/3d927d246f6b44ddb51da6c7375d545f/dpdk/lib/librte_stack/rte_stack_lf.h(11),
                 from /tmp/UBT1804_K4.15.0_ICC19.0.0/x86_64-native-linuxapp-icc/3d927d246f6b44ddb51da6c7375d545f/dpdk/lib/librte_stack/rte_stack.h(95),
                 from /tmp/UBT1804_K4.15.0_ICC19.0.0/x86_64-native-linuxapp-icc/3d927d246f6b44ddb51da6c7375d545f/dpdk/lib/librte_stack/rte_stack.c(16):
/tmp/UBT1804_K4.15.0_ICC19.0.0/x86_64-native-linuxapp-icc/3d927d246f6b44ddb51da6c7375d545f/dpdk/lib/librte_stack/rte_stack_lf_generic.h(153): error: identifier "rte_int128_t" is undefined
  				(rte_int128_t *)&list->head,
  				 ^

In file included from /tmp/UBT1804_K4.15.0_ICC19.0.0/x86_64-native-linuxapp-icc/3d927d246f6b44ddb51da6c7375d545f/dpdk/lib/librte_stack/rte_stack_lf.h(11),
                 from /tmp/UBT1804_K4.15.0_ICC19.0.0/x86_64-native-linuxapp-icc/3d927d246f6b44ddb51da6c7375d545f/dpdk/lib/librte_stack/rte_stack.h(95),
                 from /tmp/UBT1804_K4.15.0_ICC19.0.0/x86_64-native-linuxapp-icc/3d927d246f6b44ddb51da6c7375d545f/dpdk/lib/librte_stack/rte_stack.c(16):
/tmp/UBT1804_K4.15.0_ICC19.0.0/x86_64-native-linuxapp-icc/3d927d246f6b44ddb51da6c7375d545f/dpdk/lib/librte_stack/rte_stack_lf_generic.h(153): error: expected an expression
  				(rte_int128_t *)&list->head,
  				               ^

In file included from /tmp/UBT1804_K4.15.0_ICC19.0.0/x86_64-native-linuxapp-icc/3d927d246f6b44ddb51da6c7375d545f/dpdk/lib/librte_stack/rte_stack_lf.h(11),
                 from /tmp/UBT1804_K4.15.0_ICC19.0.0/x86_64-native-linuxapp-icc/3d927d246f6b44ddb51da6c7375d545f/dpdk/lib/librte_stack/rte_stack.h(95),
                 from /tmp/UBT1804_K4.15.0_ICC19.0.0/x86_64-native-linuxapp-icc/3d927d246f6b44ddb51da6c7375d545f/dpdk/lib/librte_stack/rte_stack.c(16):
/tmp/UBT1804_K4.15.0_ICC19.0.0/x86_64-native-linuxapp-icc/3d927d246f6b44ddb51da6c7375d545f/dpdk/lib/librte_stack/rte_stack_lf_generic.h(153): error: expression must have integral type
  				(rte_int128_t *)&list->head,
  				                 ^

In file included from /tmp/UBT1804_K4.15.0_ICC19.0.0/x86_64-native-linuxapp-icc/3d927d246f6b44ddb51da6c7375d545f/dpdk/lib/librte_stack/rte_stack_lf.h(11),
                 from /tmp/UBT1804_K4.15.0_ICC19.0.0/x86_64-native-linuxapp-icc/3d927d246f6b44ddb51da6c7375d545f/dpdk/lib/librte_stack/rte_stack.h(95),
                 from /tmp/UBT1804_K4.15.0_ICC19.0.0/x86_64-native-linuxapp-icc/3d927d246f6b44ddb51da6c7375d545f/dpdk/lib/librte_stack/rte_stack.c(16):
/tmp/UBT1804_K4.15.0_ICC19.0.0/x86_64-native-linuxapp-icc/3d927d246f6b44ddb51da6c7375d545f/dpdk/lib/librte_stack/rte_stack_lf_generic.h(154): error: expected an expression
  				(rte_int128_t *)&old_head,
  				               ^

In file included from /tmp/UBT1804_K4.15.0_ICC19.0.0/x86_64-native-linuxapp-icc/3d927d246f6b44ddb51da6c7375d545f/dpdk/lib/librte_stack/rte_stack_lf.h(11),
                 from /tmp/UBT1804_K4.15.0_ICC19.0.0/x86_64-native-linuxapp-icc/3d927d246f6b44ddb51da6c7375d545f/dpdk/lib/librte_stack/rte_stack.h(95),
                 from /tmp/UBT1804_K4.15.0_ICC19.0.0/x86_64-native-linuxapp-icc/3d927d246f6b44ddb51da6c7375d545f/dpdk/lib/librte_stack/rte_stack.c(16):
/tmp/UBT1804_K4.15.0_ICC19.0.0/x86_64-native-linuxapp-icc/3d927d246f6b44ddb51da6c7375d545f/dpdk/lib/librte_stack/rte_stack_lf_generic.h(154): error: expression must have integral type
  				(rte_int128_t *)&old_head,
  				                 ^

In file included from /tmp/UBT1804_K4.15.0_ICC19.0.0/x86_64-native-linuxapp-icc/3d927d246f6b44ddb51da6c7375d545f/dpdk/lib/librte_stack/rte_stack_lf.h(11),
                 from /tmp/UBT1804_K4.15.0_ICC19.0.0/x86_64-native-linuxapp-icc/3d927d246f6b44ddb51da6c7375d545f/dpdk/lib/librte_stack/rte_stack.h(95),
                 from /tmp/UBT1804_K4.15.0_ICC19.0.0/x86_64-native-linuxapp-icc/3d927d246f6b44ddb51da6c7375d545f/dpdk/lib/librte_stack/rte_stack.c(16):
/tmp/UBT1804_K4.15.0_ICC19.0.0/x86_64-native-linuxapp-icc/3d927d246f6b44ddb51da6c7375d545f/dpdk/lib/librte_stack/rte_stack_lf_generic.h(155): error: expected an expression
  				(rte_int128_t *)&new_head,
  				               ^

In file included from /tmp/UBT1804_K4.15.0_ICC19.0.0/x86_64-native-linuxapp-icc/3d927d246f6b44ddb51da6c7375d545f/dpdk/lib/librte_stack/rte_stack_lf.h(11),
                 from /tmp/UBT1804_K4.15.0_ICC19.0.0/x86_64-native-linuxapp-icc/3d927d246f6b44ddb51da6c7375d545f/dpdk/lib/librte_stack/rte_stack.h(95),
                 from /tmp/UBT1804_K4.15.0_ICC19.0.0/x86_64-native-linuxapp-icc/3d927d246f6b44ddb51da6c7375d545f/dpdk/lib/librte_stack/rte_stack.c(16):
/tmp/UBT1804_K4.15.0_ICC19.0.0/x86_64-native-linuxapp-icc/3d927d246f6b44ddb51da6c7375d545f/dpdk/lib/librte_stack/rte_stack_lf_generic.h(155): error: expression must have integral type
  				(rte_int128_t *)&new_head,
  				                 ^

compilation aborted for /tmp/UBT1804_K4.15.0_ICC19.0.0/x86_64-native-linuxapp-icc/3d927d246f6b44ddb51da6c7375d545f/dpdk/lib/librte_stack/rte_stack.c (code 2)
/tmp/UBT1804_K4.15.0_ICC19.0.0/x86_64-native-linuxapp-icc/3d927d246f6b44ddb51da6c7375d545f/dpdk/mk/internal/rte.compile-pre.mk:114: recipe for target 'rte_stack.o' failed
make[5]: *** [rte_stack.o] Error 2
make[5]: *** Waiting for unfinished jobs....
  AR librte_ring.a
  AR librte_jobstats.a
  SYMLINK-FILE include/cmdline_rdline.h
--
  AR librte_meter.a
  INSTALL-LIB librte_meter.a
In file included from /tmp/UBT1804_K4.15.0_ICC19.0.0/x86_64-native-linuxapp-icc/3d927d246f6b44ddb51da6c7375d545f/dpdk/lib/librte_stack/rte_stack_lf.h(11),
                 from /tmp/UBT1804_K4.15.0_ICC19.0.0/x86_64-native-linuxapp-icc/3d927d246f6b44ddb51da6c7375d545f/dpdk/lib/librte_stack/rte_stack.h(95),
                 from /tmp/UBT1804_K4.15.0_ICC19.0.0/x86_64-native-linuxapp-icc/3d927d246f6b44ddb51da6c7375d545f/dpdk/lib/librte_stack/rte_stack_std.c(5):
/tmp/UBT1804_K4.15.0_ICC19.0.0/x86_64-native-linuxapp-icc/3d927d246f6b44ddb51da6c7375d545f/dpdk/lib/librte_stack/rte_stack_lf_generic.h(68): warning #266: function "rte_atomic128_cmp_exchange" declared implicitly
  		success = rte_atomic128_cmp_exchange(
  		          ^

In file included from /tmp/UBT1804_K4.15.0_ICC19.0.0/x86_64-native-linuxapp-icc/3d927d246f6b44ddb51da6c7375d545f/dpdk/lib/librte_stack/rte_stack_lf.h(11),
                 from /tmp/UBT1804_K4.15.0_ICC19.0.0/x86_64-native-linuxapp-icc/3d927d246f6b44ddb51da6c7375d545f/dpdk/lib/librte_stack/rte_stack.h(95),
                 from /tmp/UBT1804_K4.15.0_ICC19.0.0/x86_64-native-linuxapp-icc/3d927d246f6b44ddb51da6c7375d545f/dpdk/lib/librte_stack/rte_stack_std.c(5):
/tmp/UBT1804_K4.15.0_ICC19.0.0/x86_64-native-linuxapp-icc/3d927d246f6b44ddb51da6c7375d545f/dpdk/lib/librte_stack/rte_stack_lf_generic.h(69): error: identifier "rte_int128_t" is undefined
  				(rte_int128_t *)&list->head,
  				 ^

In file included from /tmp/UBT1804_K4.15.0_ICC19.0.0/x86_64-native-linuxapp-icc/3d927d246f6b44ddb51da6c7375d545f/dpdk/lib/librte_stack/rte_stack_lf.h(11),
                 from /tmp/UBT1804_K4.15.0_ICC19.0.0/x86_64-native-linuxapp-icc/3d927d246f6b44ddb51da6c7375d545f/dpdk/lib/librte_stack/rte_stack.h(95),
                 from /tmp/UBT1804_K4.15.0_ICC19.0.0/x86_64-native-linuxapp-icc/3d927d246f6b44ddb51da6c7375d545f/dpdk/lib/librte_stack/rte_stack_std.c(5):
/tmp/UBT1804_K4.15.0_ICC19.0.0/x86_64-native-linuxapp-icc/3d927d246f6b44ddb51da6c7375d545f/dpdk/lib/librte_stack/rte_stack_lf_generic.h(69): error: expected an expression
  				(rte_int128_t *)&list->head,
  				               ^

In file included from /tmp/UBT1804_K4.15.0_ICC19.0.0/x86_64-native-linuxapp-icc/3d927d246f6b44ddb51da6c7375d545f/dpdk/lib/librte_stack/rte_stack_lf.h(11),
                 from /tmp/UBT1804_K4.15.0_ICC19.0.0/x86_64-native-linuxapp-icc/3d927d246f6b44ddb51da6c7375d545f/dpdk/lib/librte_stack/rte_stack.h(95),
                 from /tmp/UBT1804_K4.15.0_ICC19.0.0/x86_64-native-linuxapp-icc/3d927d246f6b44ddb51da6c7375d545f/dpdk/lib/librte_stack/rte_stack_std.c(5):
/tmp/UBT1804_K4.15.0_ICC19.0.0/x86_64-native-linuxapp-icc/3d927d246f6b44ddb51da6c7375d545f/dpdk/lib/librte_stack/rte_stack_lf_generic.h(69): error: expression must have integral type
  				(rte_int128_t *)&list->head,
  				                 ^

In file included from /tmp/UBT1804_K4.15.0_ICC19.0.0/x86_64-native-linuxapp-icc/3d927d246f6b44ddb51da6c7375d545f/dpdk/lib/librte_stack/rte_stack_lf.h(11),
                 from /tmp/UBT1804_K4.15.0_ICC19.0.0/x86_64-native-linuxapp-icc/3d927d246f6b44ddb51da6c7375d545f/dpdk/lib/librte_stack/rte_stack.h(95),
                 from /tmp/UBT1804_K4.15.0_ICC19.0.0/x86_64-native-linuxapp-icc/3d927d246f6b44ddb51da6c7375d545f/dpdk/lib/librte_stack/rte_stack_std.c(5):
/tmp/UBT1804_K4.15.0_ICC19.0.0/x86_64-native-linuxapp-icc/3d927d246f6b44ddb51da6c7375d545f/dpdk/lib/librte_stack/rte_stack_lf_generic.h(70): error: expected an expression
  				(rte_int128_t *)&old_head,
  				               ^

In file included from /tmp/UBT1804_K4.15.0_ICC19.0.0/x86_64-native-linuxapp-icc/3d927d246f6b44ddb51da6c7375d545f/dpdk/lib/librte_stack/rte_stack_lf.h(11),
                 from /tmp/UBT1804_K4.15.0_ICC19.0.0/x86_64-native-linuxapp-icc/3d927d246f6b44ddb51da6c7375d545f/dpdk/lib/librte_stack/rte_stack.h(95),
                 from /tmp/UBT1804_K4.15.0_ICC19.0.0/x86_64-native-linuxapp-icc/3d927d246f6b44ddb51da6c7375d545f/dpdk/lib/librte_stack/rte_stack_std.c(5):
/tmp/UBT1804_K4.15.0_ICC19.0.0/x86_64-native-linuxapp-icc/3d927d246f6b44ddb51da6c7375d545f/dpdk/lib/librte_stack/rte_stack_lf_generic.h(70): error: expression must have integral type
  				(rte_int128_t *)&old_head,
  				                 ^

In file included from /tmp/UBT1804_K4.15.0_ICC19.0.0/x86_64-native-linuxapp-icc/3d927d246f6b44ddb51da6c7375d545f/dpdk/lib/librte_stack/rte_stack_lf.h(11),
                 from /tmp/UBT1804_K4.15.0_ICC19.0.0/x86_64-native-linuxapp-icc/3d927d246f6b44ddb51da6c7375d545f/dpdk/lib/librte_stack/rte_stack.h(95),
                 from /tmp/UBT1804_K4.15.0_ICC19.0.0/x86_64-native-linuxapp-icc/3d927d246f6b44ddb51da6c7375d545f/dpdk/lib/librte_stack/rte_stack_std.c(5):
/tmp/UBT1804_K4.15.0_ICC19.0.0/x86_64-native-linuxapp-icc/3d927d246f6b44ddb51da6c7375d545f/dpdk/lib/librte_stack/rte_stack_lf_generic.h(71): error: expected an expression
  				(rte_int128_t *)&new_head,
  				               ^

In file included from /tmp/UBT1804_K4.15.0_ICC19.0.0/x86_64-native-linuxapp-icc/3d927d246f6b44ddb51da6c7375d545f/dpdk/lib/librte_stack/rte_stack_lf.h(11),
                 from /tmp/UBT1804_K4.15.0_ICC19.0.0/x86_64-native-linuxapp-icc/3d927d246f6b44ddb51da6c7375d545f/dpdk/lib/librte_stack/rte_stack.h(95),
                 from /tmp/UBT1804_K4.15.0_ICC19.0.0/x86_64-native-linuxapp-icc/3d927d246f6b44ddb51da6c7375d545f/dpdk/lib/librte_stack/rte_stack_std.c(5):
/tmp/UBT1804_K4.15.0_ICC19.0.0/x86_64-native-linuxapp-icc/3d927d246f6b44ddb51da6c7375d545f/dpdk/lib/librte_stack/rte_stack_lf_generic.h(71): error: expression must have integral type
  				(rte_int128_t *)&new_head,
  				                 ^

In file included from /tmp/UBT1804_K4.15.0_ICC19.0.0/x86_64-native-linuxapp-icc/3d927d246f6b44ddb51da6c7375d545f/dpdk/lib/librte_stack/rte_stack_lf.h(11),
                 from /tmp/UBT1804_K4.15.0_ICC19.0.0/x86_64-native-linuxapp-icc/3d927d246f6b44ddb51da6c7375d545f/dpdk/lib/librte_stack/rte_stack.h(95),
                 from /tmp/UBT1804_K4.15.0_ICC19.0.0/x86_64-native-linuxapp-icc/3d927d246f6b44ddb51da6c7375d545f/dpdk/lib/librte_stack/rte_stack_std.c(5):
/tmp/UBT1804_K4.15.0_ICC19.0.0/x86_64-native-linuxapp-icc/3d927d246f6b44ddb51da6c7375d545f/dpdk/lib/librte_stack/rte_stack_lf_generic.h(152): warning #266: function "rte_atomic128_cmp_exchange" declared implicitly
  		success = rte_atomic128_cmp_exchange(
  		          ^

In file included from /tmp/UBT1804_K4.15.0_ICC19.0.0/x86_64-native-linuxapp-icc/3d927d246f6b44ddb51da6c7375d545f/dpdk/lib/librte_stack/rte_stack_lf.h(11),
                 from /tmp/UBT1804_K4.15.0_ICC19.0.0/x86_64-native-linuxapp-icc/3d927d246f6b44ddb51da6c7375d545f/dpdk/lib/librte_stack/rte_stack.h(95),
                 from /tmp/UBT1804_K4.15.0_ICC19.0.0/x86_64-native-linuxapp-icc/3d927d246f6b44ddb51da6c7375d545f/dpdk/lib/librte_stack/rte_stack_std.c(5):
/tmp/UBT1804_K4.15.0_ICC19.0.0/x86_64-native-linuxapp-icc/3d927d246f6b44ddb51da6c7375d545f/dpdk/lib/librte_stack/rte_stack_lf_generic.h(153): error: identifier "rte_int128_t" is undefined
  				(rte_int128_t *)&list->head,
  				 ^

In file included from /tmp/UBT1804_K4.15.0_ICC19.0.0/x86_64-native-linuxapp-icc/3d927d246f6b44ddb51da6c7375d545f/dpdk/lib/librte_stack/rte_stack_lf.h(11),
                 from /tmp/UBT1804_K4.15.0_ICC19.0.0/x86_64-native-linuxapp-icc/3d927d246f6b44ddb51da6c7375d545f/dpdk/lib/librte_stack/rte_stack.h(95),
                 from /tmp/UBT1804_K4.15.0_ICC19.0.0/x86_64-native-linuxapp-icc/3d927d246f6b44ddb51da6c7375d545f/dpdk/lib/librte_stack/rte_stack_std.c(5):
/tmp/UBT1804_K4.15.0_ICC19.0.0/x86_64-native-linuxapp-icc/3d927d246f6b44ddb51da6c7375d545f/dpdk/lib/librte_stack/rte_stack_lf_generic.h(153): error: expected an expression
  				(rte_int128_t *)&list->head,
  				               ^

In file included from /tmp/UBT1804_K4.15.0_ICC19.0.0/x86_64-native-linuxapp-icc/3d927d246f6b44ddb51da6c7375d545f/dpdk/lib/librte_stack/rte_stack_lf.h(11),
                 from /tmp/UBT1804_K4.15.0_ICC19.0.0/x86_64-native-linuxapp-icc/3d927d246f6b44ddb51da6c7375d545f/dpdk/lib/librte_stack/rte_stack.h(95),
                 from /tmp/UBT1804_K4.15.0_ICC19.0.0/x86_64-native-linuxapp-icc/3d927d246f6b44ddb51da6c7375d545f/dpdk/lib/librte_stack/rte_stack_std.c(5):
/tmp/UBT1804_K4.15.0_ICC19.0.0/x86_64-native-linuxapp-icc/3d927d246f6b44ddb51da6c7375d545f/dpdk/lib/librte_stack/rte_stack_lf_generic.h(153): error: expression must have integral type
  				(rte_int128_t *)&list->head,
  				                 ^

In file included from /tmp/UBT1804_K4.15.0_ICC19.0.0/x86_64-native-linuxapp-icc/3d927d246f6b44ddb51da6c7375d545f/dpdk/lib/librte_stack/rte_stack_lf.h(11),
                 from /tmp/UBT1804_K4.15.0_ICC19.0.0/x86_64-native-linuxapp-icc/3d927d246f6b44ddb51da6c7375d545f/dpdk/lib/librte_stack/rte_stack.h(95),
                 from /tmp/UBT1804_K4.15.0_ICC19.0.0/x86_64-native-linuxapp-icc/3d927d246f6b44ddb51da6c7375d545f/dpdk/lib/librte_stack/rte_stack_std.c(5):
/tmp/UBT1804_K4.15.0_ICC19.0.0/x86_64-native-linuxapp-icc/3d927d246f6b44ddb51da6c7375d545f/dpdk/lib/librte_stack/rte_stack_lf_generic.h(154): error: expected an expression
  				(rte_int128_t *)&old_head,
  				               ^

In file included from /tmp/UBT1804_K4.15.0_ICC19.0.0/x86_64-native-linuxapp-icc/3d927d246f6b44ddb51da6c7375d545f/dpdk/lib/librte_stack/rte_stack_lf.h(11),
                 from /tmp/UBT1804_K4.15.0_ICC19.0.0/x86_64-native-linuxapp-icc/3d927d246f6b44ddb51da6c7375d545f/dpdk/lib/librte_stack/rte_stack.h(95),
                 from /tmp/UBT1804_K4.15.0_ICC19.0.0/x86_64-native-linuxapp-icc/3d927d246f6b44ddb51da6c7375d545f/dpdk/lib/librte_stack/rte_stack_std.c(5):
/tmp/UBT1804_K4.15.0_ICC19.0.0/x86_64-native-linuxapp-icc/3d927d246f6b44ddb51da6c7375d545f/dpdk/lib/librte_stack/rte_stack_lf_generic.h(154): error: expression must have integral type
  				(rte_int128_t *)&old_head,
  				                 ^

In file included from /tmp/UBT1804_K4.15.0_ICC19.0.0/x86_64-native-linuxapp-icc/3d927d246f6b44ddb51da6c7375d545f/dpdk/lib/librte_stack/rte_stack_lf.h(11),
                 from /tmp/UBT1804_K4.15.0_ICC19.0.0/x86_64-native-linuxapp-icc/3d927d246f6b44ddb51da6c7375d545f/dpdk/lib/librte_stack/rte_stack.h(95),
                 from /tmp/UBT1804_K4.15.0_ICC19.0.0/x86_64-native-linuxapp-icc/3d927d246f6b44ddb51da6c7375d545f/dpdk/lib/librte_stack/rte_stack_std.c(5):
/tmp/UBT1804_K4.15.0_ICC19.0.0/x86_64-native-linuxapp-icc/3d927d246f6b44ddb51da6c7375d545f/dpdk/lib/librte_stack/rte_stack_lf_generic.h(155): error: expected an expression
  				(rte_int128_t *)&new_head,
  				               ^

In file included from /tmp/UBT1804_K4.15.0_ICC19.0.0/x86_64-native-linuxapp-icc/3d927d246f6b44ddb51da6c7375d545f/dpdk/lib/librte_stack/rte_stack_lf.h(11),
                 from /tmp/UBT1804_K4.15.0_ICC19.0.0/x86_64-native-linuxapp-icc/3d927d246f6b44ddb51da6c7375d545f/dpdk/lib/librte_stack/rte_stack.h(95),
                 from /tmp/UBT1804_K4.15.0_ICC19.0.0/x86_64-native-linuxapp-icc/3d927d246f6b44ddb51da6c7375d545f/dpdk/lib/librte_stack/rte_stack_std.c(5):
/tmp/UBT1804_K4.15.0_ICC19.0.0/x86_64-native-linuxapp-icc/3d927d246f6b44ddb51da6c7375d545f/dpdk/lib/librte_stack/rte_stack_lf_generic.h(155): error: expression must have integral type
  				(rte_int128_t *)&new_head,
  				                 ^

compilation aborted for /tmp/UBT1804_K4.15.0_ICC19.0.0/x86_64-native-linuxapp-icc/3d927d246f6b44ddb51da6c7375d545f/dpdk/lib/librte_stack/rte_stack_std.c (code 2)
/tmp/UBT1804_K4.15.0_ICC19.0.0/x86_64-native-linuxapp-icc/3d927d246f6b44ddb51da6c7375d545f/dpdk/mk/internal/rte.compile-pre.mk:114: recipe for target 'rte_stack_std.o' failed
make[5]: *** [rte_stack_std.o] Error 2
/tmp/UBT1804_K4.15.0_ICC19.0.0/x86_64-native-linuxapp-icc/3d927d246f6b44ddb51da6c7375d545f/dpdk/mk/rte.subdir.mk:35: recipe for target 'librte_stack' failed
make[4]: *** [librte_stack] Error 2
make[4]: *** Waiting for unfinished jobs....
  CC cmdline.o
  CC cmdline_cirbuf.o
  CC cmdline_parse.o
--
  CC rte_mempool_ops_default.o
  AR librte_mempool.a
  INSTALL-LIB librte_mempool.a
  AR librte_power.a
  INSTALL-LIB librte_power.a
make[5]: warning:  Clock skew detected.  Your build may be incomplete.
  AR librte_hash.a
  INSTALL-LIB librte_hash.a
/tmp/UBT1804_K4.15.0_ICC19.0.0/x86_64-native-linuxapp-icc/3d927d246f6b44ddb51da6c7375d545f/dpdk/mk/rte.sdkbuild.mk:46: recipe for target 'lib' failed
make[3]: *** [lib] Error 2
/tmp/UBT1804_K4.15.0_ICC19.0.0/x86_64-native-linuxapp-icc/3d927d246f6b44ddb51da6c7375d545f/dpdk/mk/rte.sdkroot.mk:98: recipe for target 'all' failed
make[2]: *** [all] Error 2
/tmp/UBT1804_K4.15.0_ICC19.0.0/x86_64-native-linuxapp-icc/3d927d246f6b44ddb51da6c7375d545f/dpdk/mk/rte.sdkinstall.mk:60: recipe for target 'pre_install' failed
make[1]: *** [pre_install] Error 2
/tmp/UBT1804_K4.15.0_ICC19.0.0/x86_64-native-linuxapp-icc/3d927d246f6b44ddb51da6c7375d545f/dpdk/mk/rte.sdkroot.mk:77: recipe for target 'install' failed
make: *** [install] Error 2

*Failed Build #7:
OS: FC28
Target: x86_64-native-linuxapp-gcc
  CC acl_run_scalar.o
In file included from /tmp/FC28_K4.16.3_GCC8.0.1/x86_64-native-linuxapp-gcc/3d927d246f6b44ddb51da6c7375d545f/dpdk/lib/librte_stack/rte_stack_lf.h:11,
                 from /tmp/FC28_K4.16.3_GCC8.0.1/x86_64-native-linuxapp-gcc/3d927d246f6b44ddb51da6c7375d545f/dpdk/lib/librte_stack/rte_stack.h:95,
                 from /tmp/FC28_K4.16.3_GCC8.0.1/x86_64-native-linuxapp-gcc/3d927d246f6b44ddb51da6c7375d545f/dpdk/lib/librte_stack/rte_stack.c:16:
/tmp/FC28_K4.16.3_GCC8.0.1/x86_64-native-linuxapp-gcc/3d927d246f6b44ddb51da6c7375d545f/dpdk/lib/librte_stack/rte_stack_lf_generic.h: In function ‘__rte_stack_lf_push_elems’:
/tmp/FC28_K4.16.3_GCC8.0.1/x86_64-native-linuxapp-gcc/3d927d246f6b44ddb51da6c7375d545f/dpdk/lib/librte_stack/rte_stack_lf_generic.h:68:13: warning: implicit declaration of function ‘rte_atomic128_cmp_exchange’; did you mean ‘rte_atomic32_exchange’? [-Wimplicit-function-declaration]
   success = rte_atomic128_cmp_exchange(
             ^~~~~~~~~~~~~~~~~~~~~~~~~~
             rte_atomic32_exchange
== Build lib/librte_power
/tmp/FC28_K4.16.3_GCC8.0.1/x86_64-native-linuxapp-gcc/3d927d246f6b44ddb51da6c7375d545f/dpdk/lib/librte_stack/rte_stack_lf_generic.h:68:13: warning: nested extern declaration of ‘rte_atomic128_cmp_exchange’ [-Wnested-externs]
/tmp/FC28_K4.16.3_GCC8.0.1/x86_64-native-linuxapp-gcc/3d927d246f6b44ddb51da6c7375d545f/dpdk/lib/librte_stack/rte_stack_lf_generic.h:69:6: error: ‘rte_int128_t’ undeclared (first use in this function); did you mean ‘rte_iova_t’?
     (rte_int128_t *)&list->head,
      ^~~~~~~~~~~~
      rte_iova_t
/tmp/FC28_K4.16.3_GCC8.0.1/x86_64-native-linuxapp-gcc/3d927d246f6b44ddb51da6c7375d545f/dpdk/lib/librte_stack/rte_stack_lf_generic.h:69:6: note: each undeclared identifier is reported only once for each function it appears in
/tmp/FC28_K4.16.3_GCC8.0.1/x86_64-native-linuxapp-gcc/3d927d246f6b44ddb51da6c7375d545f/dpdk/lib/librte_stack/rte_stack_lf_generic.h:69:20: error: expected expression before ‘)’ token
     (rte_int128_t *)&list->head,
                    ^
/tmp/FC28_K4.16.3_GCC8.0.1/x86_64-native-linuxapp-gcc/3d927d246f6b44ddb51da6c7375d545f/dpdk/lib/librte_stack/rte_stack_lf_generic.h:50:28: warning: variable ‘new_head’ set but not used [-Wunused-but-set-variable]
   struct rte_stack_lf_head new_head;
                            ^~~~~~~~
/tmp/FC28_K4.16.3_GCC8.0.1/x86_64-native-linuxapp-gcc/3d927d246f6b44ddb51da6c7375d545f/dpdk/lib/librte_stack/rte_stack_lf_generic.h: In function ‘__rte_stack_lf_pop_elems’:
/tmp/FC28_K4.16.3_GCC8.0.1/x86_64-native-linuxapp-gcc/3d927d246f6b44ddb51da6c7375d545f/dpdk/lib/librte_stack/rte_stack_lf_generic.h:153:6: error: ‘rte_int128_t’ undeclared (first use in this function); did you mean ‘rte_iova_t’?
     (rte_int128_t *)&list->head,
      ^~~~~~~~~~~~
      rte_iova_t
/tmp/FC28_K4.16.3_GCC8.0.1/x86_64-native-linuxapp-gcc/3d927d246f6b44ddb51da6c7375d545f/dpdk/lib/librte_stack/rte_stack_lf_generic.h:153:20: error: expected expression before ‘)’ token
     (rte_int128_t *)&list->head,
                    ^
/tmp/FC28_K4.16.3_GCC8.0.1/x86_64-native-linuxapp-gcc/3d927d246f6b44ddb51da6c7375d545f/dpdk/lib/librte_stack/rte_stack_lf_generic.h:114:28: warning: variable ‘new_head’ set but not used [-Wunused-but-set-variable]
   struct rte_stack_lf_head new_head;
                            ^~~~~~~~
  AR librte_ring.a
make[5]: *** [/tmp/FC28_K4.16.3_GCC8.0.1/x86_64-native-linuxapp-gcc/3d927d246f6b44ddb51da6c7375d545f/dpdk/mk/internal/rte.compile-pre.mk:116: rte_stack.o] Error 1
  CC acl_run_sse.o

*Failed Build #8:
OS: RHEL75
Target: x86_64-native-linuxapp-gcc
  INSTALL-LIB librte_ring.a
In file included from /tmp/RHEL75_K3.10.0_GCC4.8.5/x86_64-native-linuxapp-gcc/3d927d246f6b44ddb51da6c7375d545f/dpdk/lib/librte_stack/rte_stack_lf.h:11:0,
                 from /tmp/RHEL75_K3.10.0_GCC4.8.5/x86_64-native-linuxapp-gcc/3d927d246f6b44ddb51da6c7375d545f/dpdk/lib/librte_stack/rte_stack.h:95,
                 from /tmp/RHEL75_K3.10.0_GCC4.8.5/x86_64-native-linuxapp-gcc/3d927d246f6b44ddb51da6c7375d545f/dpdk/lib/librte_stack/rte_stack.c:16:
/tmp/RHEL75_K3.10.0_GCC4.8.5/x86_64-native-linuxapp-gcc/3d927d246f6b44ddb51da6c7375d545f/dpdk/lib/librte_stack/rte_stack_lf_generic.h: In function ‘__rte_stack_lf_push_elems’:
/tmp/RHEL75_K3.10.0_GCC4.8.5/x86_64-native-linuxapp-gcc/3d927d246f6b44ddb51da6c7375d545f/dpdk/lib/librte_stack/rte_stack_lf_generic.h:68:3: warning: implicit declaration of function ‘rte_atomic128_cmp_exchange’ [-Wimplicit-function-declaration]
   success = rte_atomic128_cmp_exchange(
   ^
/tmp/RHEL75_K3.10.0_GCC4.8.5/x86_64-native-linuxapp-gcc/3d927d246f6b44ddb51da6c7375d545f/dpdk/lib/librte_stack/rte_stack_lf_generic.h:68:3: warning: nested extern declaration of ‘rte_atomic128_cmp_exchange’ [-Wnested-externs]
/tmp/RHEL75_K3.10.0_GCC4.8.5/x86_64-native-linuxapp-gcc/3d927d246f6b44ddb51da6c7375d545f/dpdk/lib/librte_stack/rte_stack_lf_generic.h:69:6: error: ‘rte_int128_t’ undeclared (first use in this function)
     (rte_int128_t *)&list->head,
      ^
/tmp/RHEL75_K3.10.0_GCC4.8.5/x86_64-native-linuxapp-gcc/3d927d246f6b44ddb51da6c7375d545f/dpdk/lib/librte_stack/rte_stack_lf_generic.h:69:6: note: each undeclared identifier is reported only once for each function it appears in
/tmp/RHEL75_K3.10.0_GCC4.8.5/x86_64-native-linuxapp-gcc/3d927d246f6b44ddb51da6c7375d545f/dpdk/lib/librte_stack/rte_stack_lf_generic.h:69:20: error: expected expression before ‘)’ token
     (rte_int128_t *)&list->head,
                    ^
/tmp/RHEL75_K3.10.0_GCC4.8.5/x86_64-native-linuxapp-gcc/3d927d246f6b44ddb51da6c7375d545f/dpdk/lib/librte_stack/rte_stack_lf_generic.h:50:28: warning: variable ‘new_head’ set but not used [-Wunused-but-set-variable]
   struct rte_stack_lf_head new_head;
                            ^
/tmp/RHEL75_K3.10.0_GCC4.8.5/x86_64-native-linuxapp-gcc/3d927d246f6b44ddb51da6c7375d545f/dpdk/lib/librte_stack/rte_stack_lf_generic.h: In function ‘__rte_stack_lf_pop_elems’:
/tmp/RHEL75_K3.10.0_GCC4.8.5/x86_64-native-linuxapp-gcc/3d927d246f6b44ddb51da6c7375d545f/dpdk/lib/librte_stack/rte_stack_lf_generic.h:153:6: error: ‘rte_int128_t’ undeclared (first use in this function)
     (rte_int128_t *)&list->head,
      ^
/tmp/RHEL75_K3.10.0_GCC4.8.5/x86_64-native-linuxapp-gcc/3d927d246f6b44ddb51da6c7375d545f/dpdk/lib/librte_stack/rte_stack_lf_generic.h:153:20: error: expected expression before ‘)’ token
     (rte_int128_t *)&list->head,
                    ^
/tmp/RHEL75_K3.10.0_GCC4.8.5/x86_64-native-linuxapp-gcc/3d927d246f6b44ddb51da6c7375d545f/dpdk/lib/librte_stack/rte_stack_lf_generic.h:114:28: warning: variable ‘new_head’ set but not used [-Wunused-but-set-variable]
   struct rte_stack_lf_head new_head;
                            ^
make[5]: *** [rte_stack.o] Error 1
make[4]: *** [librte_stack] Error 2
make[4]: *** Waiting for unfinished jobs....

*Failed Build #9:
OS: FC28
Target: x86_64-native-linuxapp-clang
== Build lib/librte_mempool
  SYMLINK-FILE include/cmdline_parse_portlist.h
In file included from /tmp/FC28_K4.16.3_Clang6.0.1/x86_64-native-linuxapp-clang/3d927d246f6b44ddb51da6c7375d545f/dpdk/lib/librte_stack/rte_stack.c:16:
In file included from /tmp/FC28_K4.16.3_Clang6.0.1/x86_64-native-linuxapp-clang/3d927d246f6b44ddb51da6c7375d545f/dpdk/lib/librte_stack/rte_stack.h:95:
In file included from /tmp/FC28_K4.16.3_Clang6.0.1/x86_64-native-linuxapp-clang/3d927d246f6b44ddb51da6c7375d545f/dpdk/lib/librte_stack/rte_stack_lf.h:11:
/tmp/FC28_K4.16.3_Clang6.0.1/x86_64-native-linuxapp-clang/3d927d246f6b44ddb51da6c7375d545f/dpdk/lib/librte_stack/rte_stack_lf_generic.h:68:13: warning: implicit declaration of function 'rte_atomic128_cmp_exchange' is invalid in C99 [-Wimplicit-function-declaration]
                success = rte_atomic128_cmp_exchange(
                          ^
/tmp/FC28_K4.16.3_Clang6.0.1/x86_64-native-linuxapp-clang/3d927d246f6b44ddb51da6c7375d545f/dpdk/lib/librte_stack/rte_stack_lf_generic.h:68:13: warning: this function declaration is not a prototype [-Wstrict-prototypes]
/tmp/FC28_K4.16.3_Clang6.0.1/x86_64-native-linuxapp-clang/3d927d246f6b44ddb51da6c7375d545f/dpdk/lib/librte_stack/rte_stack_lf_generic.h:69:20: error: expected expression
                                (rte_int128_t *)&list->head,
                                               ^
/tmp/FC28_K4.16.3_Clang6.0.1/x86_64-native-linuxapp-clang/3d927d246f6b44ddb51da6c7375d545f/dpdk/lib/librte_stack/rte_stack_lf_generic.h:69:6: error: use of undeclared identifier 'rte_int128_t'
                                (rte_int128_t *)&list->head,
                                 ^
/tmp/FC28_K4.16.3_Clang6.0.1/x86_64-native-linuxapp-clang/3d927d246f6b44ddb51da6c7375d545f/dpdk/lib/librte_stack/rte_stack_lf_generic.h:70:20: error: expected expression
                                (rte_int128_t *)&old_head,
                                               ^
/tmp/FC28_K4.16.3_Clang6.0.1/x86_64-native-linuxapp-clang/3d927d246f6b44ddb51da6c7375d545f/dpdk/lib/librte_stack/rte_stack_lf_generic.h:70:6: error: use of undeclared identifier 'rte_int128_t'
                                (rte_int128_t *)&old_head,
                                 ^
/tmp/FC28_K4.16.3_Clang6.0.1/x86_64-native-linuxapp-clang/3d927d246f6b44ddb51da6c7375d545f/dpdk/lib/librte_stack/rte_stack_lf_generic.h:71:20: error: expected expression
                                (rte_int128_t *)&new_head,
                                               ^
/tmp/FC28_K4.16.3_Clang6.0.1/x86_64-native-linuxapp-clang/3d927d246f6b44ddb51da6c7375d545f/dpdk/lib/librte_stack/rte_stack_lf_generic.h:71:6: error: use of undeclared identifier 'rte_int128_t'
                                (rte_int128_t *)&new_head,
                                 ^
/tmp/FC28_K4.16.3_Clang6.0.1/x86_64-native-linuxapp-clang/3d927d246f6b44ddb51da6c7375d545f/dpdk/lib/librte_stack/rte_stack_lf_generic.h:152:13: warning: implicit declaration of function 'rte_atomic128_cmp_exchange' is invalid in C99 [-Wimplicit-function-declaration]
                success = rte_atomic128_cmp_exchange(
                          ^
/tmp/FC28_K4.16.3_Clang6.0.1/x86_64-native-linuxapp-clang/3d927d246f6b44ddb51da6c7375d545f/dpdk/lib/librte_stack/rte_stack_lf_generic.h:153:20: error: expected expression
                                (rte_int128_t *)&list->head,
                                               ^
/tmp/FC28_K4.16.3_Clang6.0.1/x86_64-native-linuxapp-clang/3d927d246f6b44ddb51da6c7375d545f/dpdk/lib/librte_stack/rte_stack_lf_generic.h:153:6: error: use of undeclared identifier 'rte_int128_t'
                                (rte_int128_t *)&list->head,
                                 ^
/tmp/FC28_K4.16.3_Clang6.0.1/x86_64-native-linuxapp-clang/3d927d246f6b44ddb51da6c7375d545f/dpdk/lib/librte_stack/rte_stack_lf_generic.h:154:20: error: expected expression
                                (rte_int128_t *)&old_head,
                                               ^
/tmp/FC28_K4.16.3_Clang6.0.1/x86_64-native-linuxapp-clang/3d927d246f6b44ddb51da6c7375d545f/dpdk/lib/librte_stack/rte_stack_lf_generic.h:154:6: error: use of undeclared identifier 'rte_int128_t'
                                (rte_int128_t *)&old_head,
                                 ^
/tmp/FC28_K4.16.3_Clang6.0.1/x86_64-native-linuxapp-clang/3d927d246f6b44ddb51da6c7375d545f/dpdk/lib/librte_stack/rte_stack_lf_generic.h:155:20: error: expected expression
                                (rte_int128_t *)&new_head,
                                               ^
/tmp/FC28_K4.16.3_Clang6.0.1/x86_64-native-linuxapp-clang/3d927d246f6b44ddb51da6c7375d545f/dpdk/lib/librte_stack/rte_stack_lf_generic.h:155:6: error: use of undeclared identifier 'rte_int128_t'
                                (rte_int128_t *)&new_head,
                                 ^
3 warnings and 12 errors generated.
  AR librte_timer.a
  AR librte_jobstats.a
  INSTALL-LIB librte_timer.a
  INSTALL-LIB librte_jobstats.a
  CC cmdline.o
In file included from /tmp/FC28_K4.16.3_Clang6.0.1/x86_64-native-linuxapp-clang/3d927d246f6b44ddb51da6c7375d545f/dpdk/lib/librte_stack/rte_stack_std.c:5:
In file included from /tmp/FC28_K4.16.3_Clang6.0.1/x86_64-native-linuxapp-clang/3d927d246f6b44ddb51da6c7375d545f/dpdk/lib/librte_stack/rte_stack.h:95:
In file included from /tmp/FC28_K4.16.3_Clang6.0.1/x86_64-native-linuxapp-clang/3d927d246f6b44ddb51da6c7375d545f/dpdk/lib/librte_stack/rte_stack_lf.h:11:
/tmp/FC28_K4.16.3_Clang6.0.1/x86_64-native-linuxapp-clang/3d927d246f6b44ddb51da6c7375d545f/dpdk/lib/librte_stack/rte_stack_lf_generic.h:68:13: warning: implicit declaration of function 'rte_atomic128_cmp_exchange' is invalid in C99 [-Wimplicit-function-declaration]
                success = rte_atomic128_cmp_exchange(
                          ^
/tmp/FC28_K4.16.3_Clang6.0.1/x86_64-native-linuxapp-clang/3d927d246f6b44ddb51da6c7375d545f/dpdk/lib/librte_stack/rte_stack_lf_generic.h:68:13: warning: this function declaration is not a prototype [-Wstrict-prototypes]
/tmp/FC28_K4.16.3_Clang6.0.1/x86_64-native-linuxapp-clang/3d927d246f6b44ddb51da6c7375d545f/dpdk/lib/librte_stack/rte_stack_lf_generic.h:69:20: error: expected expression
                                (rte_int128_t *)&list->head,
                                               ^
/tmp/FC28_K4.16.3_Clang6.0.1/x86_64-native-linuxapp-clang/3d927d246f6b44ddb51da6c7375d545f/dpdk/lib/librte_stack/rte_stack_lf_generic.h:69:6: error: use of undeclared identifier 'rte_int128_t'
                                (rte_int128_t *)&list->head,
                                 ^
/tmp/FC28_K4.16.3_Clang6.0.1/x86_64-native-linuxapp-clang/3d927d246f6b44ddb51da6c7375d545f/dpdk/lib/librte_stack/rte_stack_lf_generic.h:70:20: error: expected expression
                                (rte_int128_t *)&old_head,
                                               ^
/tmp/FC28_K4.16.3_Clang6.0.1/x86_64-native-linuxapp-clang/3d927d246f6b44ddb51da6c7375d545f/dpdk/lib/librte_stack/rte_stack_lf_generic.h:70:6: error: use of undeclared identifier 'rte_int128_t'
                                (rte_int128_t *)&old_head,
                                 ^
/tmp/FC28_K4.16.3_Clang6.0.1/x86_64-native-linuxapp-clang/3d927d246f6b44ddb51da6c7375d545f/dpdk/lib/librte_stack/rte_stack_lf_generic.h:71:20: error: expected expression
                                (rte_int128_t *)&new_head,
                                               ^
/tmp/FC28_K4.16.3_Clang6.0.1/x86_64-native-linuxapp-clang/3d927d246f6b44ddb51da6c7375d545f/dpdk/lib/librte_stack/rte_stack_lf_generic.h:71:6: error: use of undeclared identifier 'rte_int128_t'
                                (rte_int128_t *)&new_head,
                                 ^
/tmp/FC28_K4.16.3_Clang6.0.1/x86_64-native-linuxapp-clang/3d927d246f6b44ddb51da6c7375d545f/dpdk/lib/librte_stack/rte_stack_lf_generic.h:152:13: warning: implicit declaration of function 'rte_atomic128_cmp_exchange' is invalid in C99 [-Wimplicit-function-declaration]
                success = rte_atomic128_cmp_exchange(
                          ^
/tmp/FC28_K4.16.3_Clang6.0.1/x86_64-native-linuxapp-clang/3d927d246f6b44ddb51da6c7375d545f/dpdk/lib/librte_stack/rte_stack_lf_generic.h:153:20: error: expected expression
                                (rte_int128_t *)&list->head,
                                               ^
/tmp/FC28_K4.16.3_Clang6.0.1/x86_64-native-linuxapp-clang/3d927d246f6b44ddb51da6c7375d545f/dpdk/lib/librte_stack/rte_stack_lf_generic.h:153:6: error: use of undeclared identifier 'rte_int128_t'
                                (rte_int128_t *)&list->head,
                                 ^
/tmp/FC28_K4.16.3_Clang6.0.1/x86_64-native-linuxapp-clang/3d927d246f6b44ddb51da6c7375d545f/dpdk/lib/librte_stack/rte_stack_lf_generic.h:154:20: error: expected expression
                                (rte_int128_t *)&old_head,
                                               ^
/tmp/FC28_K4.16.3_Clang6.0.1/x86_64-native-linuxapp-clang/3d927d246f6b44ddb51da6c7375d545f/dpdk/lib/librte_stack/rte_stack_lf_generic.h:154:6: error: use of undeclared identifier 'rte_int128_t'
                                (rte_int128_t *)&old_head,
                                 ^
/tmp/FC28_K4.16.3_Clang6.0.1/x86_64-native-linuxapp-clang/3d927d246f6b44ddb51da6c7375d545f/dpdk/lib/librte_stack/rte_stack_lf_generic.h:155:20: error: expected expression
                                (rte_int128_t *)&new_head,
                                               ^
/tmp/FC28_K4.16.3_Clang6.0.1/x86_64-native-linuxapp-clang/3d927d246f6b44ddb51da6c7375d545f/dpdk/lib/librte_stack/rte_stack_lf_generic.h:155:6: error: use of undeclared identifier 'rte_int128_t'
                                (rte_int128_t *)&new_head,
                                 ^
3 warnings and 12 errors generated.
== Build lib/librte_hash
== Build lib/librte_power
  CC acl_run_scalar.o
  SYMLINK-FILE include/rte_mempool.h
  CC rte_mempool.o
--
  CC cmdline_parse_ipaddr.o
  CC rte_cuckoo_hash.o
In file included from /tmp/FC28_K4.16.3_Clang6.0.1/x86_64-native-linuxapp-clang/3d927d246f6b44ddb51da6c7375d545f/dpdk/lib/librte_stack/rte_stack_lf.c:5:
In file included from /tmp/FC28_K4.16.3_Clang6.0.1/x86_64-native-linuxapp-clang/3d927d246f6b44ddb51da6c7375d545f/dpdk/lib/librte_stack/rte_stack.h:95:
In file included from /tmp/FC28_K4.16.3_Clang6.0.1/x86_64-native-linuxapp-clang/3d927d246f6b44ddb51da6c7375d545f/dpdk/lib/librte_stack/rte_stack_lf.h:11:
/tmp/FC28_K4.16.3_Clang6.0.1/x86_64-native-linuxapp-clang/3d927d246f6b44ddb51da6c7375d545f/dpdk/lib/librte_stack/rte_stack_lf_generic.h:68:13: warning: implicit declaration of function 'rte_atomic128_cmp_exchange' is invalid in C99 [-Wimplicit-function-declaration]
                success = rte_atomic128_cmp_exchange(
                          ^
/tmp/FC28_K4.16.3_Clang6.0.1/x86_64-native-linuxapp-clang/3d927d246f6b44ddb51da6c7375d545f/dpdk/lib/librte_stack/rte_stack_lf_generic.h:68:13: warning: this function declaration is not a prototype [-Wstrict-prototypes]
/tmp/FC28_K4.16.3_Clang6.0.1/x86_64-native-linuxapp-clang/3d927d246f6b44ddb51da6c7375d545f/dpdk/lib/librte_stack/rte_stack_lf_generic.h:69:20: error: expected expression
                                (rte_int128_t *)&list->head,
                                               ^
/tmp/FC28_K4.16.3_Clang6.0.1/x86_64-native-linuxapp-clang/3d927d246f6b44ddb51da6c7375d545f/dpdk/lib/librte_stack/rte_stack_lf_generic.h:69:6: error: use of undeclared identifier 'rte_int128_t'
                                (rte_int128_t *)&list->head,
                                 ^
/tmp/FC28_K4.16.3_Clang6.0.1/x86_64-native-linuxapp-clang/3d927d246f6b44ddb51da6c7375d545f/dpdk/lib/librte_stack/rte_stack_lf_generic.h:70:20: error: expected expression
                                (rte_int128_t *)&old_head,
                                               ^
/tmp/FC28_K4.16.3_Clang6.0.1/x86_64-native-linuxapp-clang/3d927d246f6b44ddb51da6c7375d545f/dpdk/lib/librte_stack/rte_stack_lf_generic.h:70:6: error: use of undeclared identifier 'rte_int128_t'
                                (rte_int128_t *)&old_head,
                                 ^
/tmp/FC28_K4.16.3_Clang6.0.1/x86_64-native-linuxapp-clang/3d927d246f6b44ddb51da6c7375d545f/dpdk/lib/librte_stack/rte_stack_lf_generic.h:71:20: error: expected expression
                                (rte_int128_t *)&new_head,
                                               ^
/tmp/FC28_K4.16.3_Clang6.0.1/x86_64-native-linuxapp-clang/3d927d246f6b44ddb51da6c7375d545f/dpdk/lib/librte_stack/rte_stack_lf_generic.h:71:6: error: use of undeclared identifier 'rte_int128_t'
                                (rte_int128_t *)&new_head,
                                 ^
/tmp/FC28_K4.16.3_Clang6.0.1/x86_64-native-linuxapp-clang/3d927d246f6b44ddb51da6c7375d545f/dpdk/lib/librte_stack/rte_stack_lf_generic.h:152:13: warning: implicit declaration of function 'rte_atomic128_cmp_exchange' is invalid in C99 [-Wimplicit-function-declaration]
                success = rte_atomic128_cmp_exchange(
                          ^
/tmp/FC28_K4.16.3_Clang6.0.1/x86_64-native-linuxapp-clang/3d927d246f6b44ddb51da6c7375d545f/dpdk/lib/librte_stack/rte_stack_lf_generic.h:153:20: error: expected expression
                                (rte_int128_t *)&list->head,
                                               ^
/tmp/FC28_K4.16.3_Clang6.0.1/x86_64-native-linuxapp-clang/3d927d246f6b44ddb51da6c7375d545f/dpdk/lib/librte_stack/rte_stack_lf_generic.h:153:6: error: use of undeclared identifier 'rte_int128_t'
                                (rte_int128_t *)&list->head,
                                 ^
/tmp/FC28_K4.16.3_Clang6.0.1/x86_64-native-linuxapp-clang/3d927d246f6b44ddb51da6c7375d545f/dpdk/lib/librte_stack/rte_stack_lf_generic.h  CC rte_fbk_hash.o
:154:20: error: expected expression
                                (rte_int128_t *)&old_head,
                                               ^
/tmp/FC28_K4.16.3_Clang6.0.1/x86_64-native-linuxapp-clang/3d927d246f6b44ddb51da6c7375d545f/dpdk/lib/librte_stack/rte_stack_lf_generic.h:154:6: error: use of undeclared identifier 'rte_int128_t'
                                (rte_int128_t *)&old_head,
                                 ^
  CC cmdline_parse_num.o
/tmp/FC28_K4.16.3_Clang6.0.1/x86_64-native-linuxapp-clang/3d927d246f6b44ddb51da6c7375d545f/dpdk/lib/librte_stack/rte_stack_lf_generic.h:155:20: error: expected expression
                                (rte_int128_t *)&new_head,
                                               ^
/tmp/FC28_K4.16.3_Clang6.0.1/x86_64-native-linuxapp-clang/3d927d246f6b44ddb51da6c7375d545f/dpdk/lib/librte_stack/rte_stack_lf_generic.h:155:6: error: use of undeclared identifier 'rte_int128_t'
                                (rte_int128_t *)&new_head,
                                 ^
3 warnings and 12 errors generated.
make[5]: *** [/tmp/FC28_K4.16.3_Clang6.0.1/x86_64-native-linuxapp-clang/3d927d246f6b44ddb51da6c7375d545f/dpdk/mk/internal/rte.compile-pre.mk:116: rte_stack_lf.o] Error 1
make[4]: *** [/tmp/FC28_K4.16.3_Clang6.0.1/x86_64-native-linuxapp-clang/3d927d246f6b44ddb51da6c7375d545f/dpdk/mk/rte.subdir.mk:37: librte_stack] Error 2
make[4]: *** Waiting for unfinished jobs....
  CC cmdline_parse_string.o
  CC power_kvm_vm.o

*Failed Build #10:
OS: FreeBSD11.2
Target: x86_64-native-bsdapp-clang
In file included from   SYMLINK-FILE include/cmdline_socket.h
In file included from /tmp/FreeBSD11.2_K11.2_Clang6.0.0/x86_64-native-bsdapp-clang/3d927d246f6b44ddb51da6c7375d545f/dpdk/lib/librte_stack/rte_stack.c/tmp/FreeBSD11.2_K11.2_Clang6.0.0/x86_64-native-bsdapp-clang/3d927d246f6b44ddb51da6c7375d545f/dpdk/lib/librte_stack/rte_stack_std.c::16:
5In file included from /tmp/FreeBSD11.2_K11.2_Clang6.0.0/x86_64-native-bsdapp-clang/3d927d246f6b44ddb51da6c7375d545f/dpdk/lib/librte_stack/rte_stack.h:95:
In file included from /tmp/FreeBSD11.2_K11.2_Clang6.0.0/x86_64-native-bsdapp-clang/3d927d246f6b44ddb51da6c7375d545f/dpdk/lib/librte_stack/rte_stack_lf.h:11:
/tmp/FreeBSD11.2_K11.2_Clang6.0.0/x86_64-native-bsdapp-clang/3d927d246f6b44ddb51da6c7375d545f/dpdk/lib/librte_stack/rte_stack_lf_generic.h:68:13:
: warning: implicit declaration of function 'rte_atomic128_cmp_exchange' is invalid in C99 [-Wimplicit-function-declaration]
                success = rte_atomic128_cmp_exchange(
                          ^
/tmp/FreeBSD11.2_K11.2_Clang6.0.0/x86_64-native-bsdapp-clang/3d927d246f6b44ddb51da6c7375d545f/dpdk/lib/librte_stack/rte_stack_lf_generic.h:68:13: warning: this function declaration is not a prototype [-Wstrict-prototypes]
In file included from /tmp/FreeBSD11.2_K11.2_Clang6.0.0/x86_64-native-bsdapp-clang/3d927d246f6b44ddb51da6c7375d545f/dpdk/lib/librte_stack/rte_stack.h:95:
In file included from /tmp/FreeBSD11.2_K11.2_Clang6.0.0/x86_64-native-bsdapp-clang/3d927d246f6b44ddb51da6c7375d545f/dpdk/lib/librte_stack/rte_stack_lf.h:11:
/tmp/FreeBSD11.2_K11.2_Clang6.0.0/x86_64-native-bsdapp-clang/3d927d246f6b44ddb51da6c7375d545f/dpdk/lib/librte_stack/rte_stack_lf_generic.h:68:13: warning: implicit declaration of function 'rte_atomic128_cmp_exchange' is invalid in C99 [-Wimplicit-function-declaration]
                success = rte_atomic128_cmp_exchange(/tmp/FreeBSD11.2_K11.2_Clang6.0.0/x86_64-native-bsdapp-clang/3d927d246f6b44ddb51da6c7375d545f/dpdk/lib/librte_stack/rte_stack_lf_generic.h:69:20: error: expected expression
                                (rte_int128_t *)&list->head,
                                               ^
  CC acl_gen.o
/tmp/FreeBSD11.2_K11.2_Clang6.0.0/x86_64-native-bsdapp-clang/3d927d246f6b44ddb51da6c7375d545f/dpdk/lib/librte_stack/rte_stack_lf_generic.h:  CC acl_run_scalar.o
69:6: error
                          ^
/tmp/FreeBSD11.2_K11.2_Clang6.0.0/x86_64-native-bsdapp-clang/3d927d246f6b44ddb51da6c7375d545f/dpdk/lib/librte_stack/rte_stack_lf_generic.h:68:13: warning: this function declaration is not a prototype [-Wstrict-prototypes]
/tmp/FreeBSD11.2_K11.2_Clang6.0.0/x86_64-native-bsdapp-clang/3d927d246f6b44ddb51da6c7375d545f/dpdk/lib/librte_stack/rte_stack_lf_generic.h:69:20: error: expected expression
                                (rte_int128_t *)&list->head,
                                               ^
/tmp/FreeBSD11.2_K11.2_Clang6.0.0/x86_64-native-bsdapp-clang/3d927d246f6b44ddb51da6c7375d545f/dpdk/lib/librte_stack/rte_stack_lf_generic.h:69:6: error: use of undeclared identifier 'rte_int128_t'
                                (rte_int128_t *)&list->head,
                                 ^
: /tmp/FreeBSD11.2_K11.2_Clang6.0.0/x86_64-native-bsdapp-clang/3d927d246f6b44ddb51da6c7375d545f/dpdk/lib/librte_stack/rte_stack_lf_generic.h:70:20: error: expected expression
                                (rte_int128_t *)&old_head,
                                               ^
/tmp/FreeBSD11.2_K11.2_Clang6.0.0/x86_64-native-bsdapp-clang/3d927d246f6b44ddb51da6c7375d545f/dpdk/lib/librte_stack/rte_stack_lf_generic.h:70:6: error: use of undeclared identifier 'rte_int128_t'
                                (rte_int128_t *)&old_head,
                                 ^
/tmp/FreeBSD11.2_K11.2_Clang6.0.0/x86_64-native-bsdapp-clang/3d927d246f6b44ddb51da6c7375d545f/dpdk/lib/librte_stack/rte_stack_lf_generic.h:71:20: error: expected expression
                                (rte_int128_t *)&new_head,
                                               ^
/tmp/FreeBSD11.2_K11.2_Clang6.0.0/x86_64-native-bsdapp-clang/3d927d246f6b44ddb51da6c7375d545f/dpdk/lib/librte_stack/rte_stack_lf_generic.h:71:6: error: use of undeclared identifier 'rte_int128_t'
                                (rte_int128_t *)&new_head,
                                 ^
/tmp/FreeBSD11.2_K11.2_Clang6.0.0/x86_64-native-bsdapp-clang/3d927d246f6b44ddb51da6c7375d545f/dpdk/lib/librte_stack/rte_stack_lf_generic.h:152:13: warning: implicit declaration of function 'rte_atomic128_cmp_exchange' is invalid in C99 [-Wimplicit-function-declaration]
                success = rte_atomic128_cmp_exchange(
                          ^
/tmp/FreeBSD11.2_K11.2_Clang6.0.0/x86_64-native-bsdapp-clang/3d927d246f6b44ddb51da6c7375d545f/dpdk/lib/librte_stack/rte_stack_lf_generic.h:153use of undeclared identifier 'rte_int128_t'
                                (rte_int128_t *)&list->head,
                                 ^
:20/tmp/FreeBSD11.2_K11.2_Clang6.0.0/x86_64-native-bsdapp-clang/3d927d246f6b44ddb51da6c7375d545f/dpdk/lib/librte_stack/rte_stack_lf_generic.h:70:20: error: expected expression
                                (rte_int128_t *)&old_head,
                                               ^
/tmp/FreeBSD11.2_K11.2_Clang6.0.0/x86_64-native-bsdapp-clang/3d927d246f6b44ddb51da6c7375d545f/dpdk/lib/librte_stack/rte_stack_lf_generic.h:70:6: error: use of undeclared identifier 'rte_int128_t'
                                (rte_int128_t *)&old_head,
                                 ^
In file included from /tmp/FreeBSD11.2_K11.2_Clang6.0.0/x86_64-native-bsdapp-clang/3d927d246f6b44ddb51da6c7375d545f/dpdk/lib/librte_stack/rte_stack_lf.c:5:
In file included from /tmp/FreeBSD11.2_K11.2_Clang6.0.0/x86_64-native-bsdapp-clang/3d927d246f6b44ddb51da6c7375d545f/dpdk/lib/librte_stack/rte_stack.h:95:
In file included from /tmp/FreeBSD11.2_K11.2_Clang6.0.0/x86_64-native-bsdapp-clang/3d927d246f6b44ddb51da6c7375d545f/dpdk/lib/librte_stack/rte_stack_lf.h:11:
/tmp/FreeBSD11.2_K11.2_Clang6.0.0/x86_64-native-bsdapp-clang/3d927d246f6b44ddb51da6c7375d545f/dpdk/lib/librte_stack/rte_stack_lf_generic.h:68:13: warning: implicit declaration of function 'rte_atomic128_cmp_exchange' is invalid in C99 [-Wimplicit-function-declaration]
                success = rte_atomic128_cmp_exchange(
                          ^
/tmp/FreeBSD11.2_K11.2_Clang6.0.0/x86_64-native-bsdapp-clang/3d927d246f6b44ddb51da6c7375d545f/dpdk/lib/librte_stack/rte_stack_lf_generic.h:71:20/tmp/FreeBSD11.2_K11.2_Clang6.0.0/x86_64-native-bsdapp-clang/3d927d246f6b44ddb51da6c7375d545f/dpdk/lib/librte_stack/rte_stack_lf_generic.h: error:68:: expected expression
13                                (rte_int128_t *)&new_head,
                                               ^
:/tmp/FreeBSD11.2_K11.2_Clang6.0.0/x86_64-native-bsdapp-clang/3d927d246f6b44ddb51da6c7375d545f/dpdk/lib/librte_stack/rte_stack_lf_generic.h:71:6: error: use of undeclared identifier 'rte_int128_t'
                                (rte_int128_t *)&new_head,
                                 ^
 warning: this function declaration is not a prototype [-Wstrict-prototypes]
/tmp/FreeBSD11.2_K11.2_Clang6.0.0/x86_64-native-bsdapp-clang/3d927d246f6b44ddb51da6c7375d545f/dpdk/lib/librte_stack/rte_stack_lf_generic.h:152:13: warning: implicit declaration of function 'rte_atomic128_cmp_exchange' is invalid in C99 [-Wimplicit-function-declaration]
                success = rte_atomic128_cmp_exchange(
                          ^
/tmp/FreeBSD11.2_K11.2_Clang6.0.0/x86_64-native-bsdapp-clang/3d927d246f6b44ddb51da6c7375d545f/dpdk/lib/librte_stack/rte_stack_lf_generic.h:69:20: error: expected expression
                                (rte_int128_t *)&list->head,
                                               ^
/tmp/FreeBSD11.2_K11.2_Clang6.0.0/x86_64-native-bsdapp-clang/3d927d246f6b44ddb51da6c7375d545f/dpdk/lib/librte_stack/rte_stack_lf_generic.h:69:6: error: use of undeclared identifier 'rte_int128_t'
                                (rte_int128_t *)&list->head,
                                 ^
/tmp/FreeBSD11.2_K11.2_Clang6.0.0/x86_64-native-bsdapp-clang/3d927d246f6b44ddb51da6c7375d545f/dpdk/lib/librte_stack/rte_stack_lf_generic.h:153:20: error: expected expression
                                (rte_int128_t *)&list->head,
                                               ^
/tmp/FreeBSD11.2_K11.2_Clang6.0.0/x86_64-native-bsdapp-clang/3d927d246f6b44ddb51da6c7375d545f/dpdk/lib/librte_stack/rte_stack_lf_generic.h:153:6: error: use of undeclared identifier 'rte_int128_t'
                                (rte_int128_t *)&list->head,
                                 ^
/tmp/FreeBSD11.2_K11.2_Clang6.0.0/x86_64-native-bsdapp-clang/3d927d246f6b44ddb51da6c7375d545f/dpdk/lib/librte_stack/rte_stack_lf_generic.h:70:20: error: expected expression
                                (rte_int128_t *)&old_head,
                                               ^
/tmp/FreeBSD11.2_K11.2_Clang6.0.0/x86_64-native-bsdapp-clang/3d927d246f6b44ddb51da6c7375d545f/dpdk/lib/librte_stack/rte_stack_lf_generic.h:70:6: error: use of undeclared identifier 'rte_int128_t'
                                (rte_int128_t *)&old_head,
                                 ^
/tmp/FreeBSD11.2_K11.2_Clang6.0.0/x86_64-native-bsdapp-clang/3d927d246f6b44ddb51da6c7375d545f/dpdk/lib/librte_stack/rte_stack_lf_generic.h:154:20: error: expected expression
                                (rte_int128_t *)&old_head,
                                               ^
/tmp/FreeBSD11.2_K11.2_Clang6.0.0/x86_64-native-bsdapp-clang/3d927d246f6b44ddb51da6c7375d545f/dpdk/lib/librte_stack/rte_stack_lf_generic.h:154:6: error: use of undeclared identifier 'rte_int128_t'
                                (rte_int128_t *)&old_head,
                                 ^
/tmp/FreeBSD11.2_K11.2_Clang6.0.0/x86_64-native-bsdapp-clang/3d927d246f6b44ddb51da6c7375d545f/dpdk/lib/librte_stack/rte_stack_lf_generic.h:71:20: error: expected expression
                                (rte_int128_t *)&new_head,
                                               ^
/tmp/FreeBSD11.2_K11.2_Clang6.0.0/x86_64-native-bsdapp-clang/3d927d246f6b44ddb51da6c7375d545f/dpdk/lib/librte_stack/rte_stack_lf_generic.h:71:6: error: use of undeclared identifier 'rte_int128_t'
                                (rte_int128_t *)&new_head,
                                 ^
/tmp/FreeBSD11.2_K11.2_Clang6.0.0/x86_64-native-bsdapp-clang/3d927d246f6b44ddb51da6c7375d545f/dpdk/lib/librte_stack/rte_stack_lf_generic.h:155:20: error: expected expression
                                (rte_int128_t *)&new_head,
                                               ^
/tmp/FreeBSD11.2_K11.2_Clang6.0.0/x86_64-native-bsdapp-clang/3d927d246f6b44ddb51da6c7375d545f/dpdk/lib/librte_stack/rte_stack_lf_generic.h:155/tmp/FreeBSD11.2_K11.2_Clang6.0.0/x86_64-native-bsdapp-clang/3d927d246f6b44ddb51da6c7375d545f/dpdk/lib/librte_stack/rte_stack_lf_generic.h:152:13:: warning: implicit declaration of function 'rte_atomic128_cmp_exchange' is invalid in C99 [-Wimplicit-function-declaration]6: 
                success = rte_atomic128_cmp_exchange(
                          ^
/tmp/FreeBSD11.2_K11.2_Clang6.0.0/x86_64-native-bsdapp-clang/3d927d246f6b44ddb51da6c7375d545f/dpdk/lib/librte_stack/rte_stack_lf_generic.h:153:20: error: expected expression
                                (rte_int128_t *)&list->head,
                                               ^
/tmp/FreeBSD11.2_K11.2_Clang6.0.0/x86_64-native-bsdapp-clang/3d927d246f6b44ddb51da6c7375d545f/dpdk/lib/librte_stack/rte_stack_lf_generic.h:153:6: error: use of undeclared identifier 'rte_int128_t'
                                (rte_int128_t *)&list->head,
                                 ^
/tmp/FreeBSD11.2_K11.2_Clang6.0.0/x86_64-native-bsdapp-clang/3d927d246f6b44ddb51da6c7375d545f/dpdk/lib/librte_stack/rte_stack_lf_generic.h:154:20: error: expected expression
                                (rte_int128_t *)&old_head,
                                               ^
/tmp/FreeBSD11.2_K11.2_Clang6.0.0/x86_64-native-bsdapp-clang/3d927d246f6b44ddb51da6c7375d545f/dpdk/lib/librte_stack/rte_stack_lf_generic.h:154:6: error: use of undeclared identifier 'rte_int128_t'
                                (rte_int128_t *)&old_head,
                                 ^
/tmp/FreeBSD11.2_K11.2_Clang6.0.0/x86_64-native-bsdapp-clang/3d927d246f6b44ddb51da6c7375d545f/dpdk/lib/librte_stack/rte_stack_lf_generic.h:error155:20: error: expected expression
                                (rte_int128_t *)&new_head,
                                               ^
/tmp/FreeBSD11.2_K11.2_Clang6.0.0/x86_64-native-bsdapp-clang/3d927d246f6b44ddb51da6c7375d545f/dpdk/lib/librte_stack/rte_stack_lf_generic.h:155:6: error: use of undeclared identifier 'rte_int128_t'
                                (rte_int128_t *)&new_head,
                                 ^
3 warnings and 12 errors generated.
: error: expected expression
                                (rte_int128_t *)&list->head,
                                               ^
/tmp/FreeBSD11.2_K11.2_Clang6.0.0/x86_64-native-bsdapp-clang/3d927d246f6b44ddb51da6c7375d545f/dpdk/lib/librte_stack/rte_stack_lf_generic.h:153:6: error: use of undeclared identifier 'rte_int128_t'
                                (rte_int128_t *)&list->head,
                                 ^
/tmp/FreeBSD11.2_K11.2_Clang6.0.0/x86_64-native-bsdapp-clang/3d927d246f6b44ddb51da6c7375d545f/dpdk/lib/librte_stack/rte_stack_lf_generic.h:154:20: error: expected expression
                                (rte_int128_t *)&old_head,
                                               ^
/tmp/FreeBSD11.2_K11.2_Clang6.0.0/x86_64-native-bsdapp-clang/3d927d246f6b44ddb51da6c7375d545f/dpdk/lib/librte_stack/rte_stack_lf_generic.h:154:6: error: use of undeclared identifier 'rte_int128_t'
                                (rte_int128_t *)&old_head,
                                 ^
/tmp/FreeBSD11.2_K11.2_Clang6.0.0/x86_64-native-bsdapp-clang/3d927d246f6b44ddb51da6c7375d545f/dpdk/lib/librte_stack/rte_stack_lf_generic.hgmake[5]: *** [/tmp/FreeBSD11.2_K11.2_Clang6.0.0/x86_64-native-bsdapp-clang/3d927d246f6b44ddb51da6c7375d545f/dpdk/mk/internal/rte.compile-pre.mk:116: rte_stack_lf.o] Error 1
gmake[5]: *** Waiting for unfinished jobs....
  SYMLINK-FILE include/cmdline_cirbuf.h
--
                                (rte_int128_t *)&new_head,
                                 ^
== Build lib/librte_mempool
3  INSTALL-LIB librte_jobstats.a
  AR librte_meter.a
:155: warning20: error: expected expression
                                (rte_int128_t *)&new_head,
                                               ^
/tmp/FreeBSD11.2_K11.2_Clang6.0.0/x86_64-native-bsdapp-clang/3d927d246f6b44ddb51da6c7375d545f/dpdk/lib/librte_stack/rte_stack_lf_generic.h:155:6: error: use of undeclared identifier 'rte_int128_t'
                                (rte_int128_t *)&new_head,
                                 ^
3  INSTALL-LIB librte_meter.a
  CC acl_run_sse.o
s and 12 errors generated.
 warninggmake[5]: *** [/tmp/FreeBSD11.2_K11.2_Clang6.0.0/x86_64-native-bsdapp-clang/3d927d246f6b44ddb51da6c7375d545f/dpdk/mk/internal/rte.compile-pre.mk:116: rte_stack.o] Error 1
s and 12 error== Build lib/librte_hash
s generated.
gmake[5]: *** [/tmp/FreeBSD11.2_K11.2_Clang6.0.0/x86_64-native-bsdapp-clang/3d927d246f6b44ddb51da6c7375d545f/dpdk/mk/internal/rte.compile-pre.mk:116: rte_stack_std.o] Error 1
gmake[4]: *** [/tmp/FreeBSD11.2_K11.2_Clang6.0.0/x86_64-native-bsdapp-clang/3d927d246f6b44ddb51da6c7375d545f/dpdk/mk/rte.subdir.mk:36: librte_stack] Error 2
gmake[4]: *** Waiting for unfinished jobs....
  SYMLINK-FILE include/cmdline_parse_portlist.h

*Failed Build #11:
OS: FreeBSD12.0
Target: x86_64-native-bsdapp-clang
  AR librte_timer.a
  SYMLINK-FILE include/cmdline_parse_string.h
In file included from /tmp/FreeBSD12.0_K19.02_Clang6.0.1/x86_64-native-bsdapp-clang/3d927d246f6b44ddb51da6c7375d545f/dpdk/lib/librte_stack/rte_stack.c:16:
In file included from /tmp/FreeBSD12.0_K19.02_Clang6.0.1/x86_64-native-bsdapp-clang/3d927d246f6b44ddb51da6c7375d545f/dpdk/lib/librte_stack/rte_stack.h:95:
In file included from /tmp/FreeBSD12.0_K19.02_Clang6.0.1/x86_64-native-bsdapp-clang/3d927d246f6b44ddb51da6c7375d545f/dpdk/lib/librte_stack/rte_stack_lf.h:11:
/tmp/FreeBSD12.0_K19.02_Clang6.0.1/x86_64-native-bsdapp-clang/3d927d246f6b44ddb51da6c7375d545f/dpdk/lib/librte_stack/rte_stack_lf_generic.h:68:13: warning: implicit declaration of function 'rte_atomic128_cmp_exchange' is invalid in C99 [-Wimplicit-function-declaration]
                success = rte_atomic128_cmp_exchange(
                          ^
/tmp/FreeBSD12.0_K19.02_Clang6.0.1/x86_64-native-bsdapp-clang/3d927d246f6b44ddb51da6c7375d545f/dpdk/lib/librte_stack/rte_stack_lf_generic.h:68:13: warning: this function declaration is not a prototype [-Wstrict-prototypes]
/tmp/FreeBSD12.0_K19.02_Clang6.0.1/x86_64-native-bsdapp-clang/3d927d246f6b44ddb51da6c7375d545f/dpdk/lib/librte_stack/rte_stack_lf_generic.h:69:20: error: expected expression
                                (rte_int128_t *)&list->head,
                                               ^
/tmp/FreeBSD12.0_K19.02_Clang6.0.1/x86_64-native-bsdapp-clang/3d927d246f6b44ddb51da6c7375d545f/dpdk/lib/librte_stack/rte_stack_lf_generic.h:69:6: error: use of undeclared identifier 'rte_int128_t'
                                (rte_int128_t *)&list->head,
                                 ^
/tmp/FreeBSD12.0_K19.02_Clang6.0.1/x86_64-native-bsdapp-clang/3d927d246f6b44ddb51da6c7375d545f/dpdk/lib/librte_stack/rte_stack_lf_generic.h:70:20: error: expected expression
                                (rte_int128_t *)&old_head,
                                               ^
/tmp/FreeBSD12.0_K19.02_Clang6.0.1/x86_64-native-bsdapp-clang/3d927d246f6b44ddb51da6c7375d545f/dpdk/lib/librte_stack/rte_stack_lf_generic.h:70:6: error: use of undeclared identifier 'rte_int128_t'
                                (rte_int128_t *)&old_head,
                                 ^
/tmp/FreeBSD12.0_K19.02_Clang6.0.1/x86_64-native-bsdapp-clang/3d927d246f6b44ddb51da6c7375d545f/dpdk/lib/librte_stack/rte_stack_lf_generic.h:71:20: error: expected expression
                                (rte_int128_t *)&new_head,
                                               ^
/tmp/FreeBSD12.0_K19.02_Clang6.0.1/x86_64-native-bsdapp-clang/3d927d246f6b44ddb51da6c7375d545f/dpdk/lib/librte_stack/rte_stack_lf_generic.h:71:6: error: use of undeclared identifier 'rte_int128_t'
                                (rte_int128_t *)&new_head,
                                 ^
/tmp/FreeBSD12.0_K19.02_Clang6.0.1/x86_64-native-bsdapp-clang/3d927d246f6b44ddb51da6c7375d545f/dpdk/lib/librte_stack/rte_stack_lf_generic.h:152:13: warning: implicit declaration of function 'rte_atomic128_cmp_exchange' is invalid in C99 [-Wimplicit-function-declaration]
                success = rte_atomic128_cmp_exchange(
                          ^
  CC rte_stack_std.o
/tmp/FreeBSD12.0_K19.02_Clang6.0.1/x86_64-native-bsdapp-clang/3d927d246f6b44ddb51da6c7375d545f/dpdk/lib/librte_stack/rte_stack_lf_generic.h  INSTALL-LIB librte_timer.a
:153:20: error: expected expression
                                (rte_int128_t *)&list->head,
                                               ^
/tmp/FreeBSD12.0_K19.02_Clang6.0.1/x86_64-native-bsdapp-clang/3d927d246f6b44ddb51da6c7375d545f/dpdk/lib/librte_stack/rte_stack_lf_generic.h:153:6: error: use of undeclared identifier 'rte_int128_t'
                                (rte_int128_t *)&list->head,
                                 ^  SYMLINK-FILE include/cmdline_rdline.h

/tmp/FreeBSD12.0_K19.02_Clang6.0.1/x86_64-native-bsdapp-clang/3d927d246f6b44ddb51da6c7375d545f/dpdk/lib/librte_stack/rte_stack_lf_generic.h:154:20: error: expected expression
                                (rte_int128_t *)&old_head,
                                               ^
/tmp/FreeBSD12.0_K19.02_Clang6.0.1/x86_64-native-bsdapp-clang/3d927d246f6b44ddb51da6c7375d545f/dpdk/lib/librte_stack/rte_stack_lf_generic.h:154:6: error: use of undeclared identifier 'rte_int128_t'
                                (rte_int128_t *)&old_head,
                                 ^
/tmp/FreeBSD12.0_K19.02_Clang6.0.1/x86_64-native-bsdapp-clang/3d927d246f6b44ddb51da6c7375d545f/dpdk/lib/librte_stack/rte_stack_lf_generic.h:155:20: error: expected expression
                                (rte_int128_t *)&new_head,
                                               ^
/tmp/FreeBSD12.0_K19.02_Clang6.0.1/x86_64-native-bsdapp-clang/3d927d246f6b44ddb51da6c7375d545f/dpdk/lib/librte_stack/rte_stack_lf_generic.h:155:6: error: use of undeclared identifier 'rte_int128_t'
                                (rte_int128_t *)&new_head,
                                 ^
3 warnings and 12 errors generated.
gmake[5]: *** [/tmp/FreeBSD12.0_K19.02_Clang6.0.1/x86_64-native-bsdapp-clang/3d927d246f6b44ddb51da6c7375d545f/dpdk/mk/internal/rte.compile-pre.mk:116: rte_stack.o] Error 1
gmake[5]: *** Waiting for unfinished jobs....
  AR librte_ring.a
  INSTALL-LIB librte_ring.a
  CC acl_gen.o
  CC acl_bld.o
In file included from /tmp/FreeBSD12.0_K19.02_Clang6.0.1/x86_64-native-bsdapp-clang/3d927d246f6b44ddb51da6c7375d545f/dpdk/lib/librte_stack/rte_stack_std.c:5:
In file included from /tmp/FreeBSD12.0_K19.02_Clang6.0.1/x86_64-native-bsdapp-clang/3d927d246f6b44ddb51da6c7375d545f/dpdk/lib/librte_stack/rte_stack.h:95:
In file included from /tmp/FreeBSD12.0_K19.02_Clang6.0.1/x86_64-native-bsdapp-clang/3d927d246f6b44ddb51da6c7375d545f/dpdk/lib/librte_stack/rte_stack_lf.h:11:
/tmp/FreeBSD12.0_K19.02_Clang6.0.1/x86_64-native-bsdapp-clang/3d927d246f6b44ddb51da6c7375d545f/dpdk/lib/librte_stack/rte_stack_lf_generic.h:68:13: warning: implicit declaration of function 'rte_atomic128_cmp_exchange' is invalid in C99 [-Wimplicit-function-declaration]
                success = rte_atomic128_cmp_exchange(
                          ^
/tmp/FreeBSD12.0_K19.02_Clang6.0.1/x86_64-native-bsdapp-clang/3d927d246f6b44ddb51da6c7375d545f/dpdk/lib/librte_stack/rte_stack_lf_generic.h:68:13: warning: this function declaration is not a prototype [-Wstrict-prototypes]
/tmp/FreeBSD12.0_K19.02_Clang6.0.1/x86_64-native-bsdapp-clang/3d927d246f6b44ddb51da6c7375d545f/dpdk/lib/librte_stack/rte_stack_lf_generic.h:69:20: error: expected expression
                                (rte_int128_t *)&list->head,
                                               ^
/tmp/FreeBSD12.0_K19.02_Clang6.0.1/x86_64-native-bsdapp-clang/3d927d246f6b44ddb51da6c7375d545f/dpdk/lib/librte_stack/rte_stack_lf_generic.h:69:6: error: use of undeclared identifier 'rte_int128_t'
                                (rte_int128_t *)&list->head,
                                 ^
/tmp/FreeBSD12.0_K19.02_Clang6.0.1/x86_64-native-bsdapp-clang/3d927d246f6b44ddb51da6c7375d545f/dpdk/lib/librte_stack/rte_stack_lf_generic.h:70:  SYMLINK-FILE include/cmdline_vt100.h
20: error: expected expression
                                (rte_int128_t *)&old_head,
                                               ^
/tmp/FreeBSD12.0_K19.02_Clang6.0.1/x86_64-native-bsdapp-clang/3d927d246f6b44ddb51da6c7375d545f/dpdk/lib/librte_stack/rte_stack_lf_generic.h:70:6: error:   CC acl_run_sse.o
  CC acl_run_scalar.o
  SYMLINK-FILE include/cmdline_socket.h
use of undeclared identifier 'rte_int128_t'
                                (rte_int128_t *)&old_head,
== Build lib/librte_mempool
                                 ^
/tmp/FreeBSD12.0_K19.02_Clang6.0.1/x86_64-native-bsdapp-clang/3d927d246f6b44ddb51da6c7375d545f/dpdk/lib/librte_stack/rte_stack_lf_generic.h:71:20: error: expected expression
                                (rte_int128_t *)&new_head,
                                               ^
/tmp/FreeBSD12.0_K19.02_Clang6.0.1/x86_64-native-bsdapp-clang/3d927d246f6b44ddb51da6c7375d545f/dpdk/lib/librte_stack/rte_stack_lf_generic.h:71:6: error: use of undeclared identifier 'rte_int128_t'
                                (rte_int128_t *)&new_head,
                                 ^
/tmp/FreeBSD12.0_K19.02_Clang6.0.1/x86_64-native-bsdapp-clang/3d927d246f6b44ddb51da6c7375d545f/dpdk/lib/librte_stack/rte_stack_lf_generic.h:152:13: warning: implicit declaration of function 'rte_atomic128_cmp_exchange' is invalid in C99 [-Wimplicit-function-declaration]
                success = rte_atomic128_cmp_exchange(
                          ^
/tmp/FreeBSD12.0_K19.02_Clang6.0.1/x86_64-native-bsdapp-clang/3d927d246f6b44ddb51da6c7375d545f/dpdk/lib/librte_stack/rte_stack_lf_generic.h:153:20: error: expected expression
                                (rte_int128_t *)&list->head,
                                               ^
/tmp/FreeBSD12.0_K19.02_Clang6.0.1/x86_64-native-bsdapp-clang/3d927d246f6b44ddb51da6c7375d545f/dpdk/lib/librte_stack/rte_stack_lf_generic.h:153:6: error: use of undeclared identifier 'rte_int128_t'
                                (rte_int128_t *)&list->head,
                                 ^
/tmp/FreeBSD12.0_K19.02_Clang6.0.1/x86_64-native-bsdapp-clang/3d927d246f6b44ddb51da6c7375d545f/dpdk/lib/librte_stack/rte_stack_lf_generic.h:154:20: error: expected expression
                                (rte_int128_t *)&old_head,
                                               ^
/tmp/FreeBSD12.0_K19.02_Clang6.0.1/x86_64-native-bsdapp-clang/3d927d246f6b44ddb51da6c7375d545f/dpdk/lib/librte_stack/rte_stack_lf_generic.h:154:6: error: use of undeclared identifier 'rte_int128_t'
                                (rte_int128_t *)&old_head,
                                 ^
/tmp/FreeBSD12.0_K19.02_Clang6.0.1/x86_64-native-bsdapp-clang/3d927d246f6b44ddb51da6c7375d545f/dpdk/lib/librte_stack/rte_stack_lf_generic.h:155:20: error: expected expression
                                (rte_int128_t *)&new_head,
                                               ^
/tmp/FreeBSD12.0_K19.02_Clang6.0.1/x86_64-native-bsdapp-clang/3d927d246f6b44ddb51da6c7375d545f/dpdk/lib/librte_stack/rte_stack_lf_generic.h:155:6: error: use of undeclared identifier 'rte_int128_t'
                                (rte_int128_t *)&new_head,
                                 ^
3 warnings and 12 errors generated.
gmake[5]: *** [/tmp/FreeBSD12.0_K19.02_Clang6.0.1/x86_64-native-bsdapp-clang/3d927d246f6b44ddb51da6c7375d545f/dpdk/mk/internal/rte.compile-pre.mk:116: rte_stack_std.o] Error 1
gmake[4]: *** [/tmp/FreeBSD12.0_K19.02_Clang6.0.1/x86_64-native-bsdapp-clang/3d927d246f6b44ddb51da6c7375d545f/dpdk/mk/rte.subdir.mk:37: librte_stack] Error 2
gmake[4]: *** Waiting for unfinished jobs....
  CC acl_run_avx2.o
  SYMLINK-FILE include/cmdline_cirbuf.h

*Failed Build #12:
OS: FreeBSD11.2
Target: x86_64-native-bsdapp-gcc
  AR librte_metrics.a
In file included from /tmp/FreeBSD11.2_K11.2_GCC6.4.0/x86_64-native-bsdapp-gcc/3d927d246f6b44ddb51da6c7375d545f/dpdk/lib/librte_stack/rte_stack_lf.h:11:0,
                 from /tmp/FreeBSD11.2_K11.2_GCC6.4.0/x86_64-native-bsdapp-gcc/3d927d246f6b44ddb51da6c7375d545f/dpdk/lib/librte_stack/rte_stack.h:95,
                 from /tmp/FreeBSD11.2_K11.2_GCC6.4.0/x86_64-native-bsdapp-gcc/3d927d246f6b44ddb51da6c7375d545f/dpdk/lib/librte_stack/rte_stack.c:16:
/tmp/FreeBSD11.2_K11.2_GCC6.4.0/x86_64-native-bsdapp-gcc/3d927d246f6b44ddb51da6c7375d545f/dpdk/lib/librte_stack/rte_stack_lf_generic.h: In function '__rte_stack_lf_push_elems':
/tmp/FreeBSD11.2_K11.2_GCC6.4.0/x86_64-native-bsdapp-gcc/3d927d246f6b44ddb51da6c7375d545f/dpdk/lib/librte_stack/rte_stack_lf_generic.h:68:13: warning: implicit declaration of function 'rte_atomic128_cmp_exchange' [-Wimplicit-function-declaration]
   success = rte_atomic128_cmp_exchange(
             ^~~~~~~~~~~~~~~~~~~~~~~~~~
/tmp/FreeBSD11.2_K11.2_GCC6.4.0/x86_64-native-bsdapp-gcc/3d927d246f6b44ddb51da6c7375d545f/dpdk/lib/librte_stack/rte_stack_lf_generic.h:68:3: warning: nested extern declaration of 'rte_atomic128_cmp_exchange' [-Wnested-externs]
   success = rte_atomic128_cmp_exchange(
   ^~~~~~~
/tmp/FreeBSD11.2_K11.2_GCC6.4.0/x86_64-native-bsdapp-gcc/3d927d246f6b44ddb51da6c7375d545f/dpdk/lib/librte_stack/rte_stack_lf_generic.h:69:6: error: 'rte_int128_t' undeclared (first use in this function)
     (rte_int128_t *)&list->head,
      ^~~~~~~~~~~~
/tmp/FreeBSD11.2_K11.2_GCC6.4.0/x86_64-native-bsdapp-gcc/3d927d246f6b44ddb51da6c7375d545f/dpdk/lib/librte_stack/rte_stack_lf_generic.h:69:6: note: each undeclared identifier is reported only once for each function it appears in
/tmp/FreeBSD11.2_K11.2_GCC6.4.0/x86_64-native-bsdapp-gcc/3d927d246f6b44ddb51da6c7375d545f/dpdk/lib/librte_stack/rte_stack_lf_generic.h:69:20: error: expected expression before ')' token
     (rte_int128_t *)&list->head,
                    ^
/tmp/FreeBSD11.2_K11.2_GCC6.4.0/x86_64-native-bsdapp-gcc/3d927d246f6b44ddb51da6c7375d545f/dpdk/lib/librte_stack/rte_stack_lf_generic.h:50:28: warning: variable 'new_head' set but not used [-Wunused-but-set-variable]
   struct rte_stack_lf_head new_head;
                            ^~~~~~~~
  AR librte_timer.a
/tmp/FreeBSD11.2_K11.2_GCC6.4.0/x86_64-native-bsdapp-gcc/3d927d246f6b44ddb51da6c7375d545f/dpdk/lib/librte_stack/rte_stack_lf_generic.h: In function '__rte_stack_lf_pop_elems':
/tmp/FreeBSD11.2_K11.2_GCC6.4.0/x86_64-native-bsdapp-gcc/3d927d246f6b44ddb51da6c7375d545f/dpdk/lib/librte_stack/rte_stack_lf_generic.h:153:6: error: 'rte_int128_t' undeclared (first use in this function)
     (rte_int128_t *)&list->head,
      ^~~~~~~~~~~~
/tmp/FreeBSD11.2_K11.2_GCC6.4.0/x86_64-native-bsdapp-gcc/3d927d246f6b44ddb51da6c7375d545f/dpdk/lib/librte_stack/rte_stack_lf_generic.h:153:20: error: expected expression before ')' token
     (rte_int128_t *)&list->head,
                    ^
/tmp/FreeBSD11.2_K11.2_GCC6.4.0/x86_64-native-bsdapp-gcc/3d927d246f6b44ddb51da6c7375d545f/dpdk/lib/librte_stack/rte_stack_lf_generic.h:114:28: warning: variable 'new_head' set but not used [-Wunused-but-set-variable]
   struct rte_stack_lf_head new_head;
                            ^~~~~~~~
gmake[5]: *** [/tmp/FreeBSD11.2_K11.2_GCC6.4.0/x86_64-native-bsdapp-gcc/3d927d246f6b44ddb51da6c7375d545f/dpdk/mk/internal/rte.compile-pre.mk:116: rte_stack.o] Error 1
gmake[4]: *** [/tmp/FreeBSD11.2_K11.2_GCC6.4.0/x86_64-native-bsdapp-gcc/3d927d246f6b44ddb51da6c7375d545f/dpdk/mk/rte.subdir.mk:37: librte_stack] Error 2
  AR librte_pci.a

*Failed Build #13:
OS: FreeBSD12.0
Target: x86_64-native-bsdapp-gcc
  AR librte_pci.a
In file included from /tmp/FreeBSD12.0_K19.02_GCC7.3.0/x86_64-native-bsdapp-gcc/3d927d246f6b44ddb51da6c7375d545f/dpdk/lib/librte_stack/rte_stack_lf.h:11:0,
                 from /tmp/FreeBSD12.0_K19.02_GCC7.3.0/x86_64-native-bsdapp-gcc/3d927d246f6b44ddb51da6c7375d545f/dpdk/lib/librte_stack/rte_stack.h:95,
                 from /tmp/FreeBSD12.0_K19.02_GCC7.3.0/x86_64-native-bsdapp-gcc/3d927d246f6b44ddb51da6c7375d545f/dpdk/lib/librte_stack/rte_stack.c:16:
/tmp/FreeBSD12.0_K19.02_GCC7.3.0/x86_64-native-bsdapp-gcc/3d927d246f6b44ddb51da6c7375d545f/dpdk/lib/librte_stack/rte_stack_lf_generic.h: In function '__rte_stack_lf_push_elems':
/tmp/FreeBSD12.0_K19.02_GCC7.3.0/x86_64-native-bsdapp-gcc/3d927d246f6b44ddb51da6c7375d545f/dpdk/lib/librte_stack/rte_stack_lf_generic.h:68:13: warning: implicit declaration of function 'rte_atomic128_cmp_exchange'; did you mean 'rte_atomic32_exchange'? [-Wimplicit-function-declaration]
   success = rte_atomic128_cmp_exchange(
             ^~~~~~~~~~~~~~~~~~~~~~~~~~
             rte_atomic32_exchange
/tmp/FreeBSD12.0_K19.02_GCC7.3.0/x86_64-native-bsdapp-gcc/3d927d246f6b44ddb51da6c7375d545f/dpdk/lib/librte_stack/rte_stack_lf_generic.h:68:13: warning: nested extern declaration of 'rte_atomic128_cmp_exchange' [-Wnested-externs]
/tmp/FreeBSD12.0_K19.02_GCC7.3.0/x86_64-native-bsdapp-gcc/3d927d246f6b44ddb51da6c7375d545f/dpdk/lib/librte_stack/rte_stack_lf_generic.h:69:6: error: 'rte_int128_t' undeclared (first use in this function); did you mean '__int128_t'?
     (rte_int128_t *)&list->head,
      ^~~~~~~~~~~~
      __int128_t
/tmp/FreeBSD12.0_K19.02_GCC7.3.0/x86_64-native-bsdapp-gcc/3d927d246f6b44ddb51da6c7375d545f/dpdk/lib/librte_stack/rte_stack_lf_generic.h:69:6: note: each undeclared identifier is reported only once for each function it appears in
/tmp/FreeBSD12.0_K19.02_GCC7.3.0/x86_64-native-bsdapp-gcc/3d927d246f6b44ddb51da6c7375d545f/dpdk/lib/librte_stack/rte_stack_lf_generic.h:69:20: error: expected expression before ')' token
     (rte_int128_t *)&list->head,
                    ^
/tmp/FreeBSD12.0_K19.02_GCC7.3.0/x86_64-native-bsdapp-gcc/3d927d246f6b44ddb51da6c7375d545f/dpdk/lib/librte_stack/rte_stack_lf_generic.h:50:28: warning: variable 'new_head' set but not used [-Wunused-but-set-variable]
   struct rte_stack_lf_head new_head;
                            ^~~~~~~~
/tmp/FreeBSD12.0_K19.02_GCC7.3.0/x86_64-native-bsdapp-gcc/3d927d246f6b44ddb51da6c7375d545f/dpdk/lib/librte_stack/rte_stack_lf_generic.h: In function '__rte_stack_lf_pop_elems':
/tmp/FreeBSD12.0_K19.02_GCC7.3.0/x86_64-native-bsdapp-gcc/3d927d246f6b44ddb51da6c7375d545f/dpdk/lib/librte_stack/rte_stack_lf_generic.h:153:6: error: 'rte_int128_t' undeclared (first use in this function); did you mean '__int128_t'?
     (rte_int128_t *)&list->head,
      ^~~~~~~~~~~~
      __int128_t
/tmp/FreeBSD12.0_K19.02_GCC7.3.0/x86_64-native-bsdapp-gcc/3d927d246f6b44ddb51da6c7375d545f/dpdk/lib/librte_stack/rte_stack_lf_generic.h:153:20: error: expected expression before ')' token
     (rte_int128_t *)&list->head,
                    ^
/tmp/FreeBSD12.0_K19.02_GCC7.3.0/x86_64-native-bsdapp-gcc/3d927d246f6b44ddb51da6c7375d545f/dpdk/lib/librte_stack/rte_stack_lf_generic.h:114:28: warning: variable 'new_head' set but not used [-Wunused-but-set-variable]
   struct rte_stack_lf_head new_head;
                            ^~~~~~~~
gmake[5]: *** [/tmp/FreeBSD12.0_K19.02_GCC7.3.0/x86_64-native-bsdapp-gcc/3d927d246f6b44ddb51da6c7375d545f/dpdk/mk/internal/rte.compile-pre.mk:116: rte_stack.o] Error 1
gmake[4]: *** [/tmp/FreeBSD12.0_K19.02_GCC7.3.0/x86_64-native-bsdapp-gcc/3d927d246f6b44ddb51da6c7375d545f/dpdk/mk/rte.subdir.mk:37: librte_stack] Error 2
gmake[4]: *** Waiting for unfinished jobs....

*Failed Build #14:
OS: SUSE15
Target: x86_64-native-linuxapp-gcc
  CC rte_hypervisor.o
  CC rte_spinlock.o
  CC rte_cycles.o
  AR librte_eal.a
  INSTALL-LIB librte_eal.a
make[7]: warning:  Clock skew detected.  Your build may be incomplete.
== Build lib/librte_ring
== Build lib/librte_pci
== Build lib/librte_timer
== Build lib/librte_cmdline
== Build lib/librte_jobstats
--
  SYMLINK-FILE include/cmdline_parse_portlist.h
In file included from /tmp/SUSE15_K4.12.14_GCC7.3.1/x86_64-native-linuxapp-gcc/3d927d246f6b44ddb51da6c7375d545f/dpdk/lib/librte_stack/rte_stack_lf.h:11:0,
                 from /tmp/SUSE15_K4.12.14_GCC7.3.1/x86_64-native-linuxapp-gcc/3d927d246f6b44ddb51da6c7375d545f/dpdk/lib/librte_stack/rte_stack.h:95,
                 from /tmp/SUSE15_K4.12.14_GCC7.3.1/x86_64-native-linuxapp-gcc/3d927d246f6b44ddb51da6c7375d545f/dpdk/lib/librte_stack/rte_stack.c:16:
/tmp/SUSE15_K4.12.14_GCC7.3.1/x86_64-native-linuxapp-gcc/3d927d246f6b44ddb51da6c7375d545f/dpdk/lib/librte_stack/rte_stack_lf_generic.h: In function ‘__rte_stack_lf_push_elems’:
/tmp/SUSE15_K4.12.14_GCC7.3.1/x86_64-native-linuxapp-gcc/3d927d246f6b44ddb51da6c7375d545f/dpdk/lib/librte_stack/rte_stack_lf_generic.h:68:13: warning: implicit declaration of function ‘rte_atomic128_cmp_exchange’; did you mean ‘rte_atomic32_exchange’? [-Wimplicit-function-declaration]
   success = rte_atomic128_cmp_exchange(
             ^~~~~~~~~~~~~~~~~~~~~~~~~~
             rte_atomic32_exchange
/tmp/SUSE15_K4.12.14_GCC7.3.1/x86_64-native-linuxapp-gcc/3d927d246f6b44ddb51da6c7375d545f/dpdk/lib/librte_stack/rte_stack_lf_generic.h:68:13: warning: nested extern declaration of ‘rte_atomic128_cmp_exchange’ [-Wnested-externs]
/tmp/SUSE15_K4.12.14_GCC7.3.1/x86_64-native-linuxapp-gcc/3d927d246f6b44ddb51da6c7375d545f/dpdk/lib/librte_stack/rte_stack_lf_generic.h:69:6: error: ‘rte_int128_t’ undeclared (first use in this function); did you mean ‘__int128_t’?
     (rte_int128_t *)&list->head,
      ^~~~~~~~~~~~
      __int128_t
/tmp/SUSE15_K4.12.14_GCC7.3.1/x86_64-native-linuxapp-gcc/3d927d246f6b44ddb51da6c7375d545f/dpdk/lib/librte_stack/rte_stack_lf_generic.h:69:6: note: each undeclared identifier is reported only once for each function it appears in
/tmp/SUSE15_K4.12.14_GCC7.3.1/x86_64-native-linuxapp-gcc/3d927d246f6b44ddb51da6c7375d545f/dpdk/lib/librte_stack/rte_stack_lf_generic.h:69:20: error: expected expression before ‘)’ token
     (rte_int128_t *)&list->head,
                    ^
/tmp/SUSE15_K4.12.14_GCC7.3.1/x86_64-native-linuxapp-gcc/3d927d246f6b44ddb51da6c7375d545f/dpdk/lib/librte_stack/rte_stack_lf_generic.h:50:28: warning: variable ‘new_head’ set but not used [-Wunused-but-set-variable]
   struct rte_stack_lf_head new_head;
                            ^~~~~~~~
/tmp/SUSE15_K4.12.14_GCC7.3.1/x86_64-native-linuxapp-gcc/3d927d246f6b44ddb51da6c7375d545f/dpdk/lib/librte_stack/rte_stack_lf_generic.h: In function ‘__rte_stack_lf_pop_elems’:
/tmp/SUSE15_K4.12.14_GCC7.3.1/x86_64-native-linuxapp-gcc/3d927d246f6b44ddb51da6c7375d545f/dpdk/lib/librte_stack/rte_stack_lf_generic.h:153:6: error: ‘rte_int128_t’ undeclared (first use in this function); did you mean ‘__int128_t’?
     (rte_int128_t *)&list->head,
      ^~~~~~~~~~~~
      __int128_t
/tmp/SUSE15_K4.12.14_GCC7.3.1/x86_64-native-linuxapp-gcc/3d927d246f6b44ddb51da6c7375d545f/dpdk/lib/librte_stack/rte_stack_lf_generic.h:153:20: error: expected expression before ‘)’ token
     (rte_int128_t *)&list->head,
                    ^
/tmp/SUSE15_K4.12.14_GCC7.3.1/x86_64-native-linuxapp-gcc/3d927d246f6b44ddb51da6c7375d545f/dpdk/lib/librte_stack/rte_stack_lf_generic.h:114:28: warning: variable ‘new_head’ set but not used [-Wunused-but-set-variable]
   struct rte_stack_lf_head new_head;
                            ^~~~~~~~
make[5]: *** [/tmp/SUSE15_K4.12.14_GCC7.3.1/x86_64-native-linuxapp-gcc/3d927d246f6b44ddb51da6c7375d545f/dpdk/mk/internal/rte.compile-pre.mk:116: rte_stack.o] Error 1
make[5]: *** Waiting for unfinished jobs....
  CC acl_bld.o
--
  CC cmdline_cirbuf.o
In file included from /tmp/SUSE15_K4.12.14_GCC7.3.1/x86_64-native-linuxapp-gcc/3d927d246f6b44ddb51da6c7375d545f/dpdk/lib/librte_stack/rte_stack_lf.h:11:0,
                 from /tmp/SUSE15_K4.12.14_GCC7.3.1/x86_64-native-linuxapp-gcc/3d927d246f6b44ddb51da6c7375d545f/dpdk/lib/librte_stack/rte_stack.h:95,
                 from /tmp/SUSE15_K4.12.14_GCC7.3.1/x86_64-native-linuxapp-gcc/3d927d246f6b44ddb51da6c7375d545f/dpdk/lib/librte_stack/rte_stack_std.c:5:
/tmp/SUSE15_K4.12.14_GCC7.3.1/x86_64-native-linuxapp-gcc/3d927d246f6b44ddb51da6c7375d545f/dpdk/lib/librte_stack/rte_stack_lf_generic.h: In function ‘__rte_stack_lf_push_elems’:
/tmp/SUSE15_K4.12.14_GCC7.3.1/x86_64-native-linuxapp-gcc/3d927d246f6b44ddb51da6c7375d545f/dpdk/lib/librte_stack/rte_stack_lf_generic.h:68:13: warning: implicit declaration of function ‘rte_atomic128_cmp_exchange’; did you mean ‘rte_atomic32_exchange’? [-Wimplicit-function-declaration]
   success = rte_atomic128_cmp_exchange(
             ^~~~~~~~~~~~~~~~~~~~~~~~~~
             rte_atomic32_exchange
/tmp/SUSE15_K4.12.14_GCC7.3.1/x86_64-native-linuxapp-gcc/3d927d246f6b44ddb51da6c7375d545f/dpdk/lib/librte_stack/rte_stack_lf_generic.h:68:13: warning: nested extern declaration of ‘rte_atomic128_cmp_exchange’ [-Wnested-externs]
/tmp/SUSE15_K4.12.14_GCC7.3.1/x86_64-native-linuxapp-gcc/3d927d246f6b44ddb51da6c7375d545f/dpdk/lib/librte_stack/rte_stack_lf_generic.h:69:6: error: ‘rte_int128_t’ undeclared (first use in this function); did you mean ‘__int128_t’?
     (rte_int128_t *)&list->head,
      ^~~~~~~~~~~~
      __int128_t
/tmp/SUSE15_K4.12.14_GCC7.3.1/x86_64-native-linuxapp-gcc/3d927d246f6b44ddb51da6c7375d545f/dpdk/lib/librte_stack/rte_stack_lf_generic.h:69:6: note: each undeclared identifier is reported only once for each function it appears in
/tmp/SUSE15_K4.12.14_GCC7.3.1/x86_64-native-linuxapp-gcc/3d927d246f6b44ddb51da6c7375d545f/dpdk/lib/librte_stack/rte_stack_lf_generic.h:69:20: error: expected expression before ‘)’ token
     (rte_int128_t *)&list->head,
                    ^
/tmp/SUSE15_K4.12.14_GCC7.3.1/x86_64-native-linuxapp-gcc/3d927d246f6b44ddb51da6c7375d545f/dpdk/lib/librte_stack/rte_stack_lf_generic.h:50:28: warning: variable ‘new_head’ set but not used [-Wunused-but-set-variable]
   struct rte_stack_lf_head new_head;
                            ^~~~~~~~
/tmp/SUSE15_K4.12.14_GCC7.3.1/x86_64-native-linuxapp-gcc/3d927d246f6b44ddb51da6c7375d545f/dpdk/lib/librte_stack/rte_stack_lf_generic.h: In function ‘__rte_stack_lf_pop_elems’:
/tmp/SUSE15_K4.12.14_GCC7.3.1/x86_64-native-linuxapp-gcc/3d927d246f6b44ddb51da6c7375d545f/dpdk/lib/librte_stack/rte_stack_lf_generic.h:153:6: error: ‘rte_int128_t’ undeclared (first use in this function); did you mean ‘__int128_t’?
     (rte_int128_t *)&list->head,
      ^~~~~~~~~~~~
      __int128_t
/tmp/SUSE15_K4.12.14_GCC7.3.1/x86_64-native-linuxapp-gcc/3d927d246f6b44ddb51da6c7375d545f/dpdk/lib/librte_stack/rte_stack_lf_generic.h:153:20: error: expected expression before ‘)’ token
     (rte_int128_t *)&list->head,
                    ^
/tmp/SUSE15_K4.12.14_GCC7.3.1/x86_64-native-linuxapp-gcc/3d927d246f6b44ddb51da6c7375d545f/dpdk/lib/librte_stack/rte_stack_lf_generic.h:114:28: warning: variable ‘new_head’ set but not used [-Wunused-but-set-variable]
   struct rte_stack_lf_head new_head;
                            ^~~~~~~~
make[5]: *** [/tmp/SUSE15_K4.12.14_GCC7.3.1/x86_64-native-linuxapp-gcc/3d927d246f6b44ddb51da6c7375d545f/dpdk/mk/internal/rte.compile-pre.mk:116: rte_stack_std.o] Error 1
make[4]: *** [/tmp/SUSE15_K4.12.14_GCC7.3.1/x86_64-native-linuxapp-gcc/3d927d246f6b44ddb51da6c7375d545f/dpdk/mk/rte.subdir.mk:35: librte_stack] Error 2
make[4]: *** Waiting for unfinished jobs....
--
  INSTALL-LIB librte_mempool.a
  AR librte_acl.a
  INSTALL-LIB librte_acl.a
  AR librte_power.a
  INSTALL-LIB librte_power.a
make[5]: warning:  Clock skew detected.  Your build may be incomplete.
  AR librte_hash.a
  INSTALL-LIB librte_hash.a
make[3]: *** [/tmp/SUSE15_K4.12.14_GCC7.3.1/x86_64-native-linuxapp-gcc/3d927d246f6b44ddb51da6c7375d545f/dpdk/mk/rte.sdkbuild.mk:48: lib] Error 2
make[2]: *** [/tmp/SUSE15_K4.12.14_GCC7.3.1/x86_64-native-linuxapp-gcc/3d927d246f6b44ddb51da6c7375d545f/dpdk/mk/rte.sdkroot.mk:99: all] Error 2
make[1]: *** [/tmp/SUSE15_K4.12.14_GCC7.3.1/x86_64-native-linuxapp-gcc/3d927d246f6b44ddb51da6c7375d545f/dpdk/mk/rte.sdkinstall.mk:61: pre_install] Error 2

*Failed Build #15:
OS: FC29
Target: x86_64-native-linuxapp-gcc
  AR librte_meter.a
In file included from /tmp/FC29_K4.20_GCC8.0.1/x86_64-native-linuxapp-gcc/3d927d246f6b44ddb51da6c7375d545f/dpdk/lib/librte_stack/rte_stack_lf.h:11,
                 from /tmp/FC29_K4.20_GCC8.0.1/x86_64-native-linuxapp-gcc/3d927d246f6b44ddb51da6c7375d545f/dpdk/lib/librte_stack/rte_stack.h:95,
                 from /tmp/FC29_K4.20_GCC8.0.1/x86_64-native-linuxapp-gcc/3d927d246f6b44ddb51da6c7375d545f/dpdk/lib/librte_stack/rte_stack.c:16:
/tmp/FC29_K4.20_GCC8.0.1/x86_64-native-linuxapp-gcc/3d927d246f6b44ddb51da6c7375d545f/dpdk/lib/librte_stack/rte_stack_lf_generic.h: In function ‘__rte_stack_lf_push_elems’:
/tmp/FC29_K4.20_GCC8.0.1/x86_64-native-linuxapp-gcc/3d927d246f6b44ddb51da6c7375d545f/dpdk/lib/librte_stack/rte_stack_lf_generic.h:68:13: warning: implicit declaration of function ‘rte_atomic128_cmp_exchange’; did you mean ‘rte_atomic32_exchange’? [-Wimplicit-function-declaration]
   success = rte_atomic128_cmp_exchange(
             ^~~~~~~~~~~~~~~~~~~~~~~~~~
             rte_atomic32_exchange
/tmp/FC29_K4.20_GCC8.0.1/x86_64-native-linuxapp-gcc/3d927d246f6b44ddb51da6c7375d545f/dpdk/lib/librte_stack/rte_stack_lf_generic.h:68:13: warning: nested extern declaration of ‘rte_atomic128_cmp_exchange’ [-Wnested-externs]
== Build lib/librte_mempool
In file included from /tmp/FC29_K4.20_GCC8.0.1/x86_64-native-linuxapp-gcc/3d927d246f6b44ddb51da6c7375d545f/dpdk/lib/librte_stack/rte_stack_lf.h:11,
                 from /tmp/FC29_K4.20_GCC8.0.1/x86_64-native-linuxapp-gcc/3d927d246f6b44ddb51da6c7375d545f/dpdk/lib/librte_stack/rte_stack.h:95,
                 from /tmp/FC29_K4.20_GCC8.0.1/x86_64-native-linuxapp-gcc/3d927d246f6b44ddb51da6c7375d545f/dpdk/lib/librte_stack/rte_stack_std.c:5:
/tmp/FC29_K4.20_GCC8.0.1/x86_64-native-linuxapp-gcc/3d927d246f6b44ddb51da6c7375d545f/dpdk/lib/librte_stack/rte_stack_lf_generic.h: In function ‘__rte_stack_lf_push_elems’:
/tmp/FC29_K4.20_GCC8.0.1/x86_64-native-linuxapp-gcc/3d927d246f6b44ddb51da6c7375d545f/dpdk/lib/librte_stack/rte_stack_lf_generic.h:68:13: warning: implicit declaration of function ‘rte_atomic128_cmp_exchange’; did you mean ‘rte_atomic32_exchange’? [-Wimplicit-function-declaration]
   success = rte_atomic128_cmp_exchange(
             ^~~~~~~~~~~~~~~~~~~~~~~~~~
             rte_atomic32_exchange
/tmp/FC29_K4.20_GCC8.0.1/x86_64-native-linuxapp-gcc/3d927d246f6b44ddb51da6c7375d545f/dpdk/lib/librte_stack/rte_stack_lf_generic.h:68:13: warning: nested extern declaration of ‘rte_atomic128_cmp_exchange’ [-Wnested-externs]
  AR librte_jobstats.a
/tmp/FC29_K4.20_GCC8.0.1/x86_64-native-linuxapp-gcc/3d927d246f6b44ddb51da6c7375d545f/dpdk/lib/librte_stack/rte_stack_lf_generic.h:69:6: error: ‘rte_int128_t’ undeclared (first use in this function); did you mean ‘rte_iova_t’?
     (rte_int128_t *)&list->head,
      ^~~~~~~~~~~~
      rte_iova_t
/tmp/FC29_K4.20_GCC8.0.1/x86_64-native-linuxapp-gcc/3d927d246f6b44ddb51da6c7375d545f/dpdk/lib/librte_stack/rte_stack_lf_generic.h:69:6: note: each undeclared identifier is reported only once for each function it appears in
/tmp/FC29_K4.20_GCC8.0.1/x86_64-native-linuxapp-gcc/3d927d246f6b44ddb51da6c7375d545f/dpdk/lib/librte_stack/rte_stack_lf_generic.h:69:20: error: expected expression before ‘)’ token
     (rte_int128_t *)&list->head,
                    ^
/tmp/FC29_K4.20_GCC8.0.1/x86_64-native-linuxapp-gcc/3d927d246f6b44ddb51da6c7375d545f/dpdk/lib/librte_stack/rte_stack_lf_generic.h:50:28: warning: variable ‘new_head’ set but not used [-Wunused-but-set-variable]
   struct rte_stack_lf_head new_head;
                            ^~~~~~~~
  INSTALL-LIB librte_meter.a
/tmp/FC29_K4.20_GCC8.0.1/x86_64-native-linuxapp-gcc/3d927d246f6b44ddb51da6c7375d545f/dpdk/lib/librte_stack/rte_stack_lf_generic.h: In function ‘__rte_stack_lf_pop_elems’:
/tmp/FC29_K4.20_GCC8.0.1/x86_64-native-linuxapp-gcc/3d927d246f6b44ddb51da6c7375d545f/dpdk/lib/librte_stack/rte_stack_lf_generic.h:153:6: error: ‘rte_int128_t’ undeclared (first use in this function); did you mean ‘rte_iova_t’?
     (rte_int128_t *)&list->head,
      ^~~~~~~~~~~~
      rte_iova_t
/tmp/FC29_K4.20_GCC8.0.1/x86_64-native-linuxapp-gcc/3d927d246f6b44ddb51da6c7375d545f/dpdk/lib/librte_stack/rte_stack_lf_generic.h:153:20: error: expected expression before ‘)’ token
     (rte_int128_t *)&list->head,
                    ^
/tmp/FC29_K4.20_GCC8.0.1/x86_64-native-linuxapp-gcc/3d927d246f6b44ddb51da6c7375d545f/dpdk/lib/librte_stack/rte_stack_lf_generic.h:114:28: warning: variable ‘new_head’ set but not used [-Wunused-but-set-variable]
   struct rte_stack_lf_head new_head;
                            ^~~~~~~~
make[5]: *** [/tmp/FC29_K4.20_GCC8.0.1/x86_64-native-linuxapp-gcc/3d927d246f6b44ddb51da6c7375d545f/dpdk/mk/internal/rte.compile-pre.mk:116: rte_stack_std.o] Error 1
make[5]: *** Waiting for unfinished jobs....
/tmp/FC29_K4.20_GCC8.0.1/x86_64-native-linuxapp-gcc/3d927d246f6b44ddb51da6c7375d545f/dpdk/lib/librte_stack/rte_stack_lf_generic.h:69:6: error: ‘rte_int128_t’ undeclared (first use in this function); did you mean ‘rte_iova_t’?
     (rte_int128_t *)&list->head,
      ^~~~~~~~~~~~
      rte_iova_t
/tmp/FC29_K4.20_GCC8.0.1/x86_64-native-linuxapp-gcc/3d927d246f6b44ddb51da6c7375d545f/dpdk/lib/librte_stack/rte_stack_lf_generic.h:69:6: note: each undeclared identifier is reported only once for each function it appears in
/tmp/FC29_K4.20_GCC8.0.1/x86_64-native-linuxapp-gcc/3d927d246f6b44ddb51da6c7375d545f/dpdk/lib/librte_stack/rte_stack_lf_generic.h:69:20: error: expected expression before ‘)’ token
     (rte_int128_t *)&list->head,
                    ^
/tmp/FC29_K4.20_GCC8.0.1/x86_64-native-linuxapp-gcc/3d927d246f6b44ddb51da6c7375d545f/dpdk/lib/librte_stack/rte_stack_lf_generic.h:50:28: warning: variable ‘new_head’ set but not used [-Wunused-but-set-variable]
   struct rte_stack_lf_head new_head;
                            ^~~~~~~~
/tmp/FC29_K4.20_GCC8.0.1/x86_64-native-linuxapp-gcc/3d927d246f6b44ddb51da6c7375d545f/dpdk/lib/librte_stack/rte_stack_lf_generic.h: In function ‘__rte_stack_lf_pop_elems’:
/tmp/FC29_K4.20_GCC8.0.1/x86_64-native-linuxapp-gcc/3d927d246f6b44ddb51da6c7375d545f/dpdk/lib/librte_stack/rte_stack_lf_generic.h:153:6: error: ‘rte_int128_t’ undeclared (first use in this function); did you mean ‘rte_iova_t’?
     (rte_int128_t *)&list->head,
      ^~~~~~~~~~~~
      rte_iova_t
/tmp/FC29_K4.20_GCC8.0.1/x86_64-native-linuxapp-gcc/3d927d246f6b44ddb51da6c7375d545f/dpdk/lib/librte_stack/rte_stack_lf_generic.h:153:20: error: expected expression before ‘)’ token
     (rte_int128_t *)&list->head,
                    ^
/tmp/FC29_K4.20_GCC8.0.1/x86_64-native-linuxapp-gcc/3d927d246f6b44ddb51da6c7375d545f/dpdk/lib/librte_stack/rte_stack_lf_generic.h:114:28: warning: variable ‘new_head’ set but not used [-Wunused-but-set-variable]
   struct rte_stack_lf_head new_head;
                            ^~~~~~~~
  CC acl_gen.o
make[5]: *** [/tmp/FC29_K4.20_GCC8.0.1/x86_64-native-linuxapp-gcc/3d927d246f6b44ddb51da6c7375d545f/dpdk/mk/internal/rte.compile-pre.mk:116: rte_stack.o] Error 1
  INSTALL-LIB librte_jobstats.a
In file included from /tmp/FC29_K4.20_GCC8.0.1/x86_64-native-linuxapp-gcc/3d927d246f6b44ddb51da6c7375d545f/dpdk/lib/librte_stack/rte_stack_lf.h:11,
                 from /tmp/FC29_K4.20_GCC8.0.1/x86_64-native-linuxapp-gcc/3d927d246f6b44ddb51da6c7375d545f/dpdk/lib/librte_stack/rte_stack.h:95,
                 from /tmp/FC29_K4.20_GCC8.0.1/x86_64-native-linuxapp-gcc/3d927d246f6b44ddb51da6c7375d545f/dpdk/lib/librte_stack/rte_stack_lf.c:5:
/tmp/FC29_K4.20_GCC8.0.1/x86_64-native-linuxapp-gcc/3d927d246f6b44ddb51da6c7375d545f/dpdk/lib/librte_stack/rte_stack_lf_generic.h: In function ‘__rte_stack_lf_push_elems’:
/tmp/FC29_K4.20_GCC8.0.1/x86_64-native-linuxapp-gcc/3d927d246f6b44ddb51da6c7375d545f/dpdk/lib/librte_stack/rte_stack_lf_generic.h:68:13: warning: implicit declaration of function ‘rte_atomic128_cmp_exchange’; did you mean ‘rte_atomic32_exchange’? [-Wimplicit-function-declaration]
   success = rte_atomic128_cmp_exchange(
             ^~~~~~~~~~~~~~~~~~~~~~~~~~
             rte_atomic32_exchange
/tmp/FC29_K4.20_GCC8.0.1/x86_64-native-linuxapp-gcc/3d927d246f6b44ddb51da6c7375d545f/dpdk/lib/librte_stack/rte_stack_lf_generic.h:68:13: warning: nested extern declaration of ‘rte_atomic128_cmp_exchange’ [-Wnested-externs]
/tmp/FC29_K4.20_GCC8.0.1/x86_64-native-linuxapp-gcc/3d927d246f6b44ddb51da6c7375d545f/dpdk/lib/librte_stack/rte_stack_lf_generic.h:69:6: error: ‘rte_int128_t’ undeclared (first use in this function); did you mean ‘rte_iova_t’?
     (rte_int128_t *)&list->head,
      ^~~~~~~~~~~~
      rte_iova_t
/tmp/FC29_K4.20_GCC8.0.1/x86_64-native-linuxapp-gcc/3d927d246f6b44ddb51da6c7375d545f/dpdk/lib/librte_stack/rte_stack_lf_generic.h:69:6: note: each undeclared identifier is reported only once for each function it appears in
/tmp/FC29_K4.20_GCC8.0.1/x86_64-native-linuxapp-gcc/3d927d246f6b44ddb51da6c7375d545f/dpdk/lib/librte_stack/rte_stack_lf_generic.h:69:20: error: expected expression before ‘)’ token
     (rte_int128_t *)&list->head,
                    ^
/tmp/FC29_K4.20_GCC8.0.1/x86_64-native-linuxapp-gcc/3d927d246f6b44ddb51da6c7375d545f/dpdk/lib/librte_stack/rte_stack_lf_generic.h:50:28: warning: variable ‘new_head’ set but not used [-Wunused-but-set-variable]
   struct rte_stack_lf_head new_head;
                            ^~~~~~~~
/tmp/FC29_K4.20_GCC8.0.1/x86_64-native-linuxapp-gcc/3d927d246f6b44ddb51da6c7375d545f/dpdk/lib/librte_stack/rte_stack_lf_generic.h: In function ‘__rte_stack_lf_pop_elems’:
/tmp/FC29_K4.20_GCC8.0.1/x86_64-native-linuxapp-gcc/3d927d246f6b44ddb51da6c7375d545f/dpdk/lib/librte_stack/rte_stack_lf_generic.h:153:6: error: ‘rte_int128_t’ undeclared (first use in this function); did you mean ‘rte_iova_t’?
     (rte_int128_t *)&list->head,
      ^~~~~~~~~~~~
      rte_iova_t
/tmp/FC29_K4.20_GCC8.0.1/x86_64-native-linuxapp-gcc/3d927d246f6b44ddb51da6c7375d545f/dpdk/lib/librte_stack/rte_stack_lf_generic.h:153:20: error: expected expression before ‘)’ token
     (rte_int128_t *)&list->head,
                    ^
/tmp/FC29_K4.20_GCC8.0.1/x86_64-native-linuxapp-gcc/3d927d246f6b44ddb51da6c7375d545f/dpdk/lib/librte_stack/rte_stack_lf_generic.h:114:28: warning: variable ‘new_head’ set but not used [-Wunused-but-set-variable]
   struct rte_stack_lf_head new_head;
                            ^~~~~~~~
make[5]: *** [/tmp/FC29_K4.20_GCC8.0.1/x86_64-native-linuxapp-gcc/3d927d246f6b44ddb51da6c7375d545f/dpdk/mk/internal/rte.compile-pre.mk:116: rte_stack_lf.o] Error 1
make[4]: *** [/tmp/FC29_K4.20_GCC8.0.1/x86_64-native-linuxapp-gcc/3d927d246f6b44ddb51da6c7375d545f/dpdk/mk/rte.subdir.mk:37: librte_stack] Error 2
make[4]: *** Waiting for unfinished jobs....

*Failed Build #16:
OS: RHEL76
Target: x86_64-native-linuxapp-gcc
  AR librte_ring.a
In file included from /tmp/RHEL76_K3.10.0_GCC4.8.5/x86_64-native-linuxapp-gcc/3d927d246f6b44ddb51da6c7375d545f/dpdk/lib/librte_stack/rte_stack_lf.h:11:0,
                 from /tmp/RHEL76_K3.10.0_GCC4.8.5/x86_64-native-linuxapp-gcc/3d927d246f6b44ddb51da6c7375d545f/dpdk/lib/librte_stack/rte_stack.h:95,
                 from /tmp/RHEL76_K3.10.0_GCC4.8.5/x86_64-native-linuxapp-gcc/3d927d246f6b44ddb51da6c7375d545f/dpdk/lib/librte_stack/rte_stack.c:16:
/tmp/RHEL76_K3.10.0_GCC4.8.5/x86_64-native-linuxapp-gcc/3d927d246f6b44ddb51da6c7375d545f/dpdk/lib/librte_stack/rte_stack_lf_generic.h: In function ‘__rte_stack_lf_push_elems’:
/tmp/RHEL76_K3.10.0_GCC4.8.5/x86_64-native-linuxapp-gcc/3d927d246f6b44ddb51da6c7375d545f/dpdk/lib/librte_stack/rte_stack_lf_generic.h:68:3: warning: implicit declaration of function ‘rte_atomic128_cmp_exchange’ [-Wimplicit-function-declaration]
   success = rte_atomic128_cmp_exchange(
   ^
/tmp/RHEL76_K3.10.0_GCC4.8.5/x86_64-native-linuxapp-gcc/3d927d246f6b44ddb51da6c7375d545f/dpdk/lib/librte_stack/rte_stack_lf_generic.h:68:3: warning: nested extern declaration of ‘rte_atomic128_cmp_exchange’ [-Wnested-externs]
/tmp/RHEL76_K3.10.0_GCC4.8.5/x86_64-native-linuxapp-gcc/3d927d246f6b44ddb51da6c7375d545f/dpdk/lib/librte_stack/rte_stack_lf_generic.h:69:6: error: ‘rte_int128_t’ undeclared (first use in this function)
     (rte_int128_t *)&list->head,
      ^
/tmp/RHEL76_K3.10.0_GCC4.8.5/x86_64-native-linuxapp-gcc/3d927d246f6b44ddb51da6c7375d545f/dpdk/lib/librte_stack/rte_stack_lf_generic.h:69:6: note: each undeclared identifier is reported only once for each function it appears in
/tmp/RHEL76_K3.10.0_GCC4.8.5/x86_64-native-linuxapp-gcc/3d927d246f6b44ddb51da6c7375d545f/dpdk/lib/librte_stack/rte_stack_lf_generic.h:69:20: error: expected expression before ‘)’ token
     (rte_int128_t *)&list->head,
                    ^
/tmp/RHEL76_K3.10.0_GCC4.8.5/x86_64-native-linuxapp-gcc/3d927d246f6b44ddb51da6c7375d545f/dpdk/lib/librte_stack/rte_stack_lf_generic.h:50:28: warning: variable ‘new_head’ set but not used [-Wunused-but-set-variable]
   struct rte_stack_lf_head new_head;
                            ^
/tmp/RHEL76_K3.10.0_GCC4.8.5/x86_64-native-linuxapp-gcc/3d927d246f6b44ddb51da6c7375d545f/dpdk/lib/librte_stack/rte_stack_lf_generic.h: In function ‘__rte_stack_lf_pop_elems’:
/tmp/RHEL76_K3.10.0_GCC4.8.5/x86_64-native-linuxapp-gcc/3d927d246f6b44ddb51da6c7375d545f/dpdk/lib/librte_stack/rte_stack_lf_generic.h:153:6: error: ‘rte_int128_t’ undeclared (first use in this function)
     (rte_int128_t *)&list->head,
      ^
/tmp/RHEL76_K3.10.0_GCC4.8.5/x86_64-native-linuxapp-gcc/3d927d246f6b44ddb51da6c7375d545f/dpdk/lib/librte_stack/rte_stack_lf_generic.h:153:20: error: expected expression before ‘)’ token
     (rte_int128_t *)&list->head,
                    ^
/tmp/RHEL76_K3.10.0_GCC4.8.5/x86_64-native-linuxapp-gcc/3d927d246f6b44ddb51da6c7375d545f/dpdk/lib/librte_stack/rte_stack_lf_generic.h:114:28: warning: variable ‘new_head’ set but not used [-Wunused-but-set-variable]
   struct rte_stack_lf_head new_head;
                            ^
  SYMLINK-FILE include/cmdline_socket.h
  CC acl_run_scalar.o
make[5]: *** [rte_stack.o] Error 1

*Failed Build #17:
OS: FC29
Target: x86_64-native-linuxapp-clang
  CC acl_bld.o
== Build lib/librte_mempool
In file included from /tmp/FC29_K4.20_Clang6.0.1/x86_64-native-linuxapp-clang/3d927d246f6b44ddb51da6c7375d545f/dpdk/lib/librte_stack/rte_stack.c:16:
In file included from /tmp/FC29_K4.20_Clang6.0.1/x86_64-native-linuxapp-clang/3d927d246f6b44ddb51da6c7375d545f/dpdk/lib/librte_stack/rte_stack.h:95:
In file included from /tmp/FC29_K4.20_Clang6.0.1/x86_64-native-linuxapp-clang/3d927d246f6b44ddb51da6c7375d545f/dpdk/lib/librte_stack/rte_stack_lf.h:11:
/tmp/FC29_K4.20_Clang6.0.1/x86_64-native-linuxapp-clang/3d927d246f6b44ddb51da6c7375d545f/dpdk/lib/librte_stack/rte_stack_lf_generic.h:68:13: warning: implicit declaration of function 'rte_atomic128_cmp_exchange' is invalid in C99 [-Wimplicit-function-declaration]
                success = rte_atomic128_cmp_exchange(
                          ^
/tmp/FC29_K4.20_Clang6.0.1/x86_64-native-linuxapp-clang/3d927d246f6b44ddb51da6c7375d545f/dpdk/lib/librte_stack/rte_stack_lf_generic.h:68:13: warning: this function declaration is not a prototype [-Wstrict-prototypes]
/tmp/FC29_K4.20_Clang6.0.1/x86_64-native-linuxapp-clang/3d927d246f6b44ddb51da6c7375d545f/dpdk/lib/librte_stack/rte_stack_lf_generic.h:69:20: error: expected expression
                                (rte_int128_t *)&list->head,
                                               ^
/tmp/FC29_K4.20_Clang6.0.1/x86_64-native-linuxapp-clang/3d927d246f6b44ddb51da6c7375d545f/dpdk/lib/librte_stack/rte_stack_lf_generic.h:69:6: error: use of undeclared identifier 'rte_int128_t'
                                (rte_int128_t *)&list->head,
                                 ^
/tmp/FC29_K4.20_Clang6.0.1/x86_64-native-linuxapp-clang/3d927d246f6b44ddb51da6c7375d545f/dpdk/lib/librte_stack/rte_stack_lf_generic.h:70:20:   INSTALL-LIB librte_jobstats.a
error: expected expression
                                (rte_int128_t *)&old_head,
                                               ^
/tmp/FC29_K4.20_Clang6.0.1/x86_64-native-linuxapp-clang/3d927d246f6b44ddb51da6c7375d545f/dpdk/lib/librte_stack/rte_stack_lf_generic.h:70:6: error: use of undeclared identifier 'rte_int128_t'
                                (rte_int128_t *)&old_head,
                                 ^
/tmp/FC29_K4.20_Clang6.0.1/x86_64-native-linuxapp-clang/3d927d246f6b44ddb51da6c7375d545f/dpdk/lib/librte_stack/rte_stack_lf_generic.h:71:20: error: expected expression
                                (rte_int128_t *)&new_head,
                                               ^
/tmp/FC29_K4.20_Clang6.0.1/x86_64-native-linuxapp-clang/3d927d246f6b44ddb51da6c7375d545f/dpdk/lib/librte_stack/rte_stack_lf_generic.h:71:6: error: use of undeclared identifier 'rte_int128_t'
                                (rte_int128_t *)&new_head,
                                 ^
/tmp/FC29_K4.20_Clang6.0.1/x86_64-native-linuxapp-clang/3d927d246f6b44ddb51da6c7375d545f/dpdk/lib/librte_stack/rte_stack_lf_generic.h:152:13: warning: implicit declaration of function 'rte_atomic128_cmp_exchange' is invalid in C99 [-Wimplicit-function-declaration]
                success = rte_atomic128_cmp_exchange(
                          ^
/tmp/FC29_K4.20_Clang6.0.1/x86_64-native-linuxapp-clang/3d927d246f6b44ddb51da6c7375d545f/dpdk/lib/librte_stack/rte_stack_lf_generic.h:153:20: error: expected expression
                                (rte_int128_t *)&list->head,
                                               ^
/tmp/FC29_K4.20_Clang6.0.1/x86_64-native-linuxapp-clang/3d927d246f6b44ddb51da6c7375d545f/dpdk/lib/librte_stack/rte_stack_lf_generic.h:153:6: error: use of undeclared identifier 'rte_int128_t'
                                (rte_int128_t *)&list->head,
                                 ^
/tmp/FC29_K4.20_Clang6.0.1/x86_64-native-linuxapp-clang/3d927d246f6b44ddb51da6c7375d545f/dpdk/lib/librte_stack/rte_stack_lf_generic.h:154:20: error: expected expression
                                (rte_int128_t *)&old_head,
                                               ^
/tmp/FC29_K4.20_Clang6.0.1/x86_64-native-linuxapp-clang/3d927d246f6b44ddb51da6c7375d545f/dpdk/lib/librte_stack/rte_stack_lf_generic.h:154:6: error: use of undeclared identifier 'rte_int128_t'
                                (rte_int128_t *)&old_head,
                                 ^
/tmp/FC29_K4.20_Clang6.0.1/x86_64-native-linuxapp-clang/3d927d246f6b44ddb51da6c7375d545f/dpdk/lib/librte_stack/rte_stack_lf_generic.h:155:20: error: expected expression
                                (rte_int128_t *)&new_head,
                                               ^
/tmp/FC29_K4.20_Clang6.0.1/x86_64-native-linuxapp-clang/3d927d246f6b44ddb51da6c7375d545f/dpdk/lib/librte_stack/rte_stack_lf_generic.h:155:6: error: use of undeclared identifier 'rte_int128_t'
                                (rte_int128_t *)&new_head,
                                 ^
3 warnings and 12 errors generated.
make[5]: *** [/tmp/FC29_K4.20_Clang6.0.1/x86_64-native-linuxapp-clang/3d927d246f6b44ddb51da6c7375d545f/dpdk/mk/internal/rte.compile-pre.mk:116: rte_stack.o] Error 1
make[5]: *** Waiting for unfinished jobs....
  CC cmdline_cirbuf.o
In file included from /tmp/FC29_K4.20_Clang6.0.1/x86_64-native-linuxapp-clang/3d927d246f6b44ddb51da6c7375d545f/dpdk/lib/librte_stack/rte_stack_lf.c:5:
In file included from /tmp/FC29_K4.20_Clang6.0.1/x86_64-native-linuxapp-clang/3d927d246f6b44ddb51da6c7375d545f/dpdk/lib/librte_stack/rte_stack.h:95:
In file included from /tmp/FC29_K4.20_Clang6.0.1/x86_64-native-linuxapp-clang/3d927d246f6b44ddb51da6c7375d545f/dpdk/lib/librte_stack/rte_stack_lf.h:11:
/tmp/FC29_K4.20_Clang6.0.1/x86_64-native-linuxapp-clang/3d927d246f6b44ddb51da6c7375d545f/dpdk/lib/librte_stack/rte_stack_lf_generic.h:68:13: warning: implicit declaration of function 'rte_atomic128_cmp_exchange' is invalid in C99 [-Wimplicit-function-declaration]
                success = rte_atomic128_cmp_exchange(
                          ^
/tmp/FC29_K4.20_Clang6.0.1/x86_64-native-linuxapp-clang/3d927d246f6b44ddb51da6c7375d545f/dpdk/lib/librte_stack/rte_stack_lf_generic.h:68:13: warning: this function declaration is not a prototype [-Wstrict-prototypes]
/tmp/FC29_K4.20_Clang6.0.1/x86_64-native-linuxapp-clang/3d927d246f6b44ddb51da6c7375d545f/dpdk/lib/librte_stack/rte_stack_lf_generic.h:69:20: error: expected expression
                                (rte_int128_t *)&list->head,
                                               ^
/tmp/FC29_K4.20_Clang6.0.1/x86_64-native-linuxapp-clang/3d927d246f6b44ddb51da6c7375d545f/dpdk/lib/librte_stack/rte_stack_lf_generic.h:69:6: error: use of undeclared identifier 'rte_int128_t'
                                (rte_int128_t *)&list->head,
                                 ^
/tmp/FC29_K4.20_Clang6.0.1/x86_64-native-linuxapp-clang/3d927d246f6b44ddb51da6c7375d545f/dpdk/lib/librte_stack/rte_stack_lf_generic.h:70:20: error: expected expression
                                (rte_int128_t *)&old_head,
                                               ^
/tmp/FC29_K4.20_Clang6.0.1/x86_64-native-linuxapp-clang/3d927d246f6b44ddb51da6c7375d545f/dpdk/lib/librte_stack/rte_stack_lf_generic.h:70:6: error: use of undeclared identifier 'rte_int128_t'
                                (rte_int128_t *)&old_head,
                                 ^
/tmp/FC29_K4.20_Clang6.0.1/x86_64-native-linuxapp-clang/3d927d246f6b44ddb51da6c7375d545f/dpdk/lib/librte_stack/rte_stack_lf_generic.h:71:20: error: expected expression
                                (rte_int128_t *)&new_head,
                                               ^
/tmp/FC29_K4.20_Clang6.0.1/x86_64-native-linuxapp-clang/3d927d246f6b44ddb51da6c7375d545f/dpdk/lib/librte_stack/rte_stack_lf_generic.h:71:6: error: use of undeclared identifier 'rte_int128_t'
                                (rte_int128_t *)&new_head,
                                 ^
/tmp/FC29_K4.20_Clang6.0.1/x86_64-native-linuxapp-clang/3d927d246f6b44ddb51da6c7375d545f/dpdk/lib/librte_stack/rte_stack_lf_generic.h:152:13: warning: implicit declaration of function 'rte_atomic128_cmp_exchange' is invalid in C99 [-Wimplicit-function-declaration]
                success = rte_atomic128_cmp_exchange(
                          ^
/tmp/FC29_K4.20_Clang6.0.1/x86_64-native-linuxapp-clang/3d927d246f6b44ddb51da6c7375d545f/dpdk/lib/librte_stack/rte_stack_lf_generic.h:153:20: error: expected expression
                                (rte_int128_t *)&list->head,
                                               ^
/tmp/FC29_K4.20_Clang6.0.1/x86_64-native-linuxapp-clang/3d927d246f6b44ddb51da6c7375d545f/dpdk/lib/librte_stack/rte_stack_lf_generic.h:153:6: error: use of undeclared identifier 'rte_int128_t'
                                (rte_int128_t *)&list->head,
                                 ^
/tmp/FC29_K4.20_Clang6.0.1/x86_64-native-linuxapp-clang/3d927d246f6b44ddb51da6c7375d545f/dpdk/lib/librte_stack/rte_stack_lf_generic.h:154:20: error: expected expression
                                (rte_int128_t *)&old_head,
                                               ^
/tmp/FC29_K4.20_Clang6.0.1/x86_64-native-linuxapp-clang/3d927d246f6b44ddb51da6c7375d545f/dpdk/lib/librte_stack/rte_stack_lf_generic.h:154:6: error: use of undeclared identifier 'rte_int128_t'
                                (rte_int128_t *)&old_head,
                                 ^
/tmp/FC29_K4.20_Clang6.0.1/x86_64-native-linuxapp-clang/3d927d246f6b44ddb51da6c7375d545f/dpdk/lib/librte_stack/rte_stack_lf_generic.h:155:20: error: expected expression
                                (rte_int128_t *)&new_head,
                                               ^
/tmp/FC29_K4.20_Clang6.0.1/x86_64-native-linuxapp-clang/3d927d246f6b44ddb51da6c7375d545f/dpdk/lib/librte_stack/rte_stack_lf_generic.h:155:6: error: use of undeclared identifier 'rte_int128_t'
                                (rte_int128_t *)&new_head,
                                 ^
== Build lib/librte_hash
3 warnings and 12 errors generated.
make[5]: *** [/tmp/FC29_K4.20_Clang6.0.1/x86_64-native-linuxapp-clang/3d927d246f6b44ddb51da6c7375d545f/dpdk/mk/internal/rte.compile-pre.mk:116: rte_stack_lf.o] Error 1
  CC cmdline_parse.o
In file included from /tmp/FC29_K4.20_Clang6.0.1/x86_64-native-linuxapp-clang/3d927d246f6b44ddb51da6c7375d545f/dpdk/lib/librte_stack/rte_stack_std.c:5:
In file included from /tmp/FC29_K4.20_Clang6.0.1/x86_64-native-linuxapp-clang/3d927d246f6b44ddb51da6c7375d545f/dpdk/lib/librte_stack/rte_stack.h:95:
In file included from /tmp/FC29_K4.20_Clang6.0.1/x86_64-native-linuxapp-clang/3d927d246f6b44ddb51da6c7375d545f/dpdk/lib/librte_stack/rte_stack_lf.h:11:
/tmp/FC29_K4.20_Clang6.0.1/x86_64-native-linuxapp-clang/3d927d246f6b44ddb51da6c7375d545f/dpdk/lib/librte_stack/rte_stack_lf_generic.h:68:13: warning: implicit declaration of function 'rte_atomic128_cmp_exchange' is invalid in C99 [-Wimplicit-function-declaration]
                success = rte_atomic128_cmp_exchange(
                          ^
/tmp/FC29_K4.20_Clang6.0.1/x86_64-native-linuxapp-clang/3d927d246f6b44ddb51da6c7375d545f/dpdk/lib/librte_stack/rte_stack_lf_generic.h:68:13: warning: this function declaration is not a prototype [-Wstrict-prototypes]
/tmp/FC29_K4.20_Clang6.0.1/x86_64-native-linuxapp-clang/3d927d246f6b44ddb51da6c7375d545f/dpdk/lib/librte_stack/rte_stack_lf_generic.h:69:20: error: expected expression
                                (rte_int128_t *)&list->head,
                                               ^
/tmp/FC29_K4.20_Clang6.0.1/x86_64-native-linuxapp-clang/3d927d246f6b44ddb51da6c7375d545f/dpdk/lib/librte_stack/rte_stack_lf_generic.h:69:6: error: use of undeclared identifier 'rte_int128_t'
                                (rte_int128_t *)&list->head,
                                 ^
/tmp/FC29_K4.20_Clang6.0.1/x86_64-native-linuxapp-clang/3d927d246f6b44ddb51da6c7375d545f/dpdk/lib/librte_stack/rte_stack_lf_generic.h:70:20: error: expected expression
                                (rte_int128_t *)&old_head,
                                               ^
/tmp/FC29_K4.20_Clang6.0.1/x86_64-native-linuxapp-clang/3d927d246f6b44ddb51da6c7375d545f/dpdk/lib/librte_stack/rte_stack_lf_generic.h:70:6: error: use of undeclared identifier 'rte_int128_t'
                                (rte_int128_t *)&old_head,
                                 ^
/tmp/FC29_K4.20_Clang6.0.1/x86_64-native-linuxapp-clang/3d927d246f6b44ddb51da6c7375d545f/dpdk/lib/librte_stack/rte_stack_lf_generic.h:71:20: error: expected expression
                                (rte_int128_t *)&new_head,
                                               ^
/tmp/FC29_K4.20_Clang6.0.1/x86_64-native-linuxapp-clang/3d927d246f6b44ddb51da6c7375d545f/dpdk/lib/librte_stack/rte_stack_lf_generic.h:71:6: error: use of undeclared identifier 'rte_int128_t'
                                (rte_int128_t *)&new_head,
                                 ^
/tmp/FC29_K4.20_Clang6.0.1/x86_64-native-linuxapp-clang/3d927d246f6b44ddb51da6c7375d545f/dpdk/lib/librte_stack/rte_stack_lf_generic.h:152:13: warning: implicit declaration of function 'rte_atomic128_cmp_exchange' is invalid in C99 [-Wimplicit-function-declaration]
                success = rte_atomic128_cmp_exchange(
                          ^
/tmp/FC29_K4.20_Clang6.0.1/x86_64-native-linuxapp-clang/3d927d246f6b44ddb51da6c7375d545f/dpdk/lib/librte_stack/rte_stack_lf_generic.h:153:20: error: expected expression
                                (rte_int128_t *)&list->head,
                                               ^
/tmp/FC29_K4.20_Clang6.0.1/x86_64-native-linuxapp-clang/3d927d246f6b44ddb51da6c7375d545f/dpdk/lib/librte_stack/rte_stack_lf_generic.h:153:6: error: use of undeclared identifier 'rte_int128_t'
                                (rte_int128_t *)&list->head,
                                 ^
/tmp/FC29_K4.20_Clang6.0.1/x86_64-native-linuxapp-clang/3d927d246f6b44ddb51da6c7375d545f/dpdk/lib/librte_stack/rte_stack_lf_generic.h:154:20: error: expected expression
                                (rte_int128_t *)&old_head,
                                               ^
/tmp/FC29_K4.20_Clang6.0.1/x86_64-native-linuxapp-clang/3d927d246f6b44ddb51da6c7375d545f/dpdk/lib/librte_stack/rte_stack_lf_generic.h:154:6: error: use of undeclared identifier 'rte_int128_t'
                                (rte_int128_t *)&old_head,
                                 ^
/tmp/FC29_K4.20_Clang6.0.1/x86_64-native-linuxapp-clang/3d927d246f6b44ddb51da6c7375d545f/dpdk/lib/librte_stack/rte_stack_lf_generic.h:155:20: error: expected expression
                                (rte_int128_t *)&new_head,
                                               ^
/tmp/FC29_K4.20_Clang6.0.1/x86_64-native-linuxapp-clang/3d927d246f6b44ddb51da6c7375d545f/dpdk/lib/librte_stack/rte_stack_lf_generic.h:155:6: error: use of undeclared identifier 'rte_int128_t'
                                (rte_int128_t *)&new_head,
                                 ^
3 warnings and 12 errors generated.
make[5]: *** [/tmp/FC29_K4.20_Clang6.0.1/x86_64-native-linuxapp-clang/3d927d246f6b44ddb51da6c7375d545f/dpdk/mk/internal/rte.compile-pre.mk:116: rte_stack_std.o] Error 1
make[4]: *** [/tmp/FC29_K4.20_Clang6.0.1/x86_64-native-linuxapp-clang/3d927d246f6b44ddb51da6c7375d545f/dpdk/mk/rte.subdir.mk:37: librte_stack] Error 2
make[4]: *** Waiting for unfinished jobs....
  CC acl_gen.o
  CC cmdline_parse_etheraddr.o

*Failed Build #18:
OS: FC29
Target: x86_64-native-linuxapp-icc
  CC cmdline_cirbuf.o
  AR librte_timer.a
In file included from /tmp/FC29_K4.20_ICC19.0.0/x86_64-native-linuxapp-icc/3d927d246f6b44ddb51da6c7375d545f/dpdk/lib/librte_stack/rte_stack_lf.h(11),
                 from /tmp/FC29_K4.20_ICC19.0.0/x86_64-native-linuxapp-icc/3d927d246f6b44ddb51da6c7375d545f/dpdk/lib/librte_stack/rte_stack.h(95),
                 from /tmp/FC29_K4.20_ICC19.0.0/x86_64-native-linuxapp-icc/3d927d246f6b44ddb51da6c7375d545f/dpdk/lib/librte_stack/rte_stack.c(16):
/tmp/FC29_K4.20_ICC19.0.0/x86_64-native-linuxapp-icc/3d927d246f6b44ddb51da6c7375d545f/dpdk/lib/librte_stack/rte_stack_lf_generic.h(68): warning #266: function "rte_atomic128_cmp_exchange" declared implicitly
  		success = rte_atomic128_cmp_exchange(
  		          ^

In file included from /tmp/FC29_K4.20_ICC19.0.0/x86_64-native-linuxapp-icc/3d927d246f6b44ddb51da6c7375d545f/dpdk/lib/librte_stack/rte_stack_lf.h(11),
                 from /tmp/FC29_K4.20_ICC19.0.0/x86_64-native-linuxapp-icc/3d927d246f6b44ddb51da6c7375d545f/dpdk/lib/librte_stack/rte_stack.h(95),
                 from /tmp/FC29_K4.20_ICC19.0.0/x86_64-native-linuxapp-icc/3d927d246f6b44ddb51da6c7375d545f/dpdk/lib/librte_stack/rte_stack.c(16):
/tmp/FC29_K4.20_ICC19.0.0/x86_64-native-linuxapp-icc/3d927d246f6b44ddb51da6c7375d545f/dpdk/lib/librte_stack/rte_stack_lf_generic.h(69): error: identifier "rte_int128_t" is undefined
  				(rte_int128_t *)&list->head,
  				 ^

In file included from /tmp/FC29_K4.20_ICC19.0.0/x86_64-native-linuxapp-icc/3d927d246f6b44ddb51da6c7375d545f/dpdk/lib/librte_stack/rte_stack_lf.h(11),
                 from /tmp/FC29_K4.20_ICC19.0.0/x86_64-native-linuxapp-icc/3d927d246f6b44ddb51da6c7375d545f/dpdk/lib/librte_stack/rte_stack.h(95),
                 from /tmp/FC29_K4.20_ICC19.0.0/x86_64-native-linuxapp-icc/3d927d246f6b44ddb51da6c7375d545f/dpdk/lib/librte_stack/rte_stack.c(16):
/tmp/FC29_K4.20_ICC19.0.0/x86_64-native-linuxapp-icc/3d927d246f6b44ddb51da6c7375d545f/dpdk/lib/librte_stack/rte_stack_lf_generic.h(69): error: expected an expression
  				(rte_int128_t *)&list->head,
  				               ^

In file included from /tmp/FC29_K4.20_ICC19.0.0/x86_64-native-linuxapp-icc/3d927d246f6b44ddb51da6c7375d545f/dpdk/lib/librte_stack/rte_stack_lf.h(11),
                 from /tmp/FC29_K4.20_ICC19.0.0/x86_64-native-linuxapp-icc/3d927d246f6b44ddb51da6c7375d545f/dpdk/lib/librte_stack/rte_stack.h(95),
                 from /tmp/FC29_K4.20_ICC19.0.0/x86_64-native-linuxapp-icc/3d927d246f6b44ddb51da6c7375d545f/dpdk/lib/librte_stack/rte_stack.c(16):
/tmp/FC29_K4.20_ICC19.0.0/x86_64-native-linuxapp-icc/3d927d246f6b44ddb51da6c7375d545f/dpdk/lib/librte_stack/rte_stack_lf_generic.h(69): error: expression must have integral type
  				(rte_int128_t *)&list->head,
  				                 ^

In file included from /tmp/FC29_K4.20_ICC19.0.0/x86_64-native-linuxapp-icc/3d927d246f6b44ddb51da6c7375d545f/dpdk/lib/librte_stack/rte_stack_lf.h(11),
                 from /tmp/FC29_K4.20_ICC19.0.0/x86_64-native-linuxapp-icc/3d927d246f6b44ddb51da6c7375d545f/dpdk/lib/librte_stack/rte_stack.h(95),
                 from /tmp/FC29_K4.20_ICC19.0.0/x86_64-native-linuxapp-icc/3d927d246f6b44ddb51da6c7375d545f/dpdk/lib/librte_stack/rte_stack.c(16):
/tmp/FC29_K4.20_ICC19.0.0/x86_64-native-linuxapp-icc/3d927d246f6b44ddb51da6c7375d545f/dpdk/lib/librte_stack/rte_stack_lf_generic.h(70): error: expected an expression
  				(rte_int128_t *)&old_head,
  				               ^

In file included from /tmp/FC29_K4.20_ICC19.0.0/x86_64-native-linuxapp-icc/3d927d246f6b44ddb51da6c7375d545f/dpdk/lib/librte_stack/rte_stack_lf.h(11),
                 from /tmp/FC29_K4.20_ICC19.0.0/x86_64-native-linuxapp-icc/3d927d246f6b44ddb51da6c7375d545f/dpdk/lib/librte_stack/rte_stack.h(95),
                 from /tmp/FC29_K4.20_ICC19.0.0/x86_64-native-linuxapp-icc/3d927d246f6b44ddb51da6c7375d545f/dpdk/lib/librte_stack/rte_stack.c(16):
/tmp/FC29_K4.20_ICC19.0.0/x86_64-native-linuxapp-icc/3d927d246f6b44ddb51da6c7375d545f/dpdk/lib/librte_stack/rte_stack_lf_generic.h(70): error: expression must have integral type
  				(rte_int128_t *)&old_head,
  				                 ^

In file included from /tmp/FC29_K4.20_ICC19.0.0/x86_64-native-linuxapp-icc/3d927d246f6b44ddb51da6c7375d545f/dpdk/lib/librte_stack/rte_stack_lf.h(11),
                 from /tmp/FC29_K4.20_ICC19.0.0/x86_64-native-linuxapp-icc/3d927d246f6b44ddb51da6c7375d545f/dpdk/lib/librte_stack/rte_stack.h(95),
                 from /tmp/FC29_K4.20_ICC19.0.0/x86_64-native-linuxapp-icc/3d927d246f6b44ddb51da6c7375d545f/dpdk/lib/librte_stack/rte_stack.c(16):
/tmp/FC29_K4.20_ICC19.0.0/x86_64-native-linuxapp-icc/3d927d246f6b44ddb51da6c7375d545f/dpdk/lib/librte_stack/rte_stack_lf_generic.h(71): error: expected an expression
  				(rte_int128_t *)&new_head,
  				               ^

In file included from /tmp/FC29_K4.20_ICC19.0.0/x86_64-native-linuxapp-icc/3d927d246f6b44ddb51da6c7375d545f/dpdk/lib/librte_stack/rte_stack_lf.h(11),
                 from /tmp/FC29_K4.20_ICC19.0.0/x86_64-native-linuxapp-icc/3d927d246f6b44ddb51da6c7375d545f/dpdk/lib/librte_stack/rte_stack.h(95),
                 from /tmp/FC29_K4.20_ICC19.0.0/x86_64-native-linuxapp-icc/3d927d246f6b44ddb51da6c7375d545f/dpdk/lib/librte_stack/rte_stack.c(16):
/tmp/FC29_K4.20_ICC19.0.0/x86_64-native-linuxapp-icc/3d927d246f6b44ddb51da6c7375d545f/dpdk/lib/librte_stack/rte_stack_lf_generic.h(71): error: expression must have integral type
  				(rte_int128_t *)&new_head,
  				                 ^

In file included from /tmp/FC29_K4.20_ICC19.0.0/x86_64-native-linuxapp-icc/3d927d246f6b44ddb51da6c7375d545f/dpdk/lib/librte_stack/rte_stack_lf.h(11),
                 from /tmp/FC29_K4.20_ICC19.0.0/x86_64-native-linuxapp-icc/3d927d246f6b44ddb51da6c7375d545f/dpdk/lib/librte_stack/rte_stack.h(95),
                 from /tmp/FC29_K4.20_ICC19.0.0/x86_64-native-linuxapp-icc/3d927d246f6b44ddb51da6c7375d545f/dpdk/lib/librte_stack/rte_stack.c(16):
/tmp/FC29_K4.20_ICC19.0.0/x86_64-native-linuxapp-icc/3d927d246f6b44ddb51da6c7375d545f/dpdk/lib/librte_stack/rte_stack_lf_generic.h(152): warning #266: function "rte_atomic128_cmp_exchange" declared implicitly
  		success = rte_atomic128_cmp_exchange(
  		          ^

In file included from /tmp/FC29_K4.20_ICC19.0.0/x86_64-native-linuxapp-icc/3d927d246f6b44ddb51da6c7375d545f/dpdk/lib/librte_stack/rte_stack_lf.h(11),
                 from /tmp/FC29_K4.20_ICC19.0.0/x86_64-native-linuxapp-icc/3d927d246f6b44ddb51da6c7375d545f/dpdk/lib/librte_stack/rte_stack.h(95),
                 from /tmp/FC29_K4.20_ICC19.0.0/x86_64-native-linuxapp-icc/3d927d246f6b44ddb51da6c7375d545f/dpdk/lib/librte_stack/rte_stack.c(16):
/tmp/FC29_K4.20_ICC19.0.0/x86_64-native-linuxapp-icc/3d927d246f6b44ddb51da6c7375d545f/dpdk/lib/librte_stack/rte_stack_lf_generic.h(153): error: identifier "rte_int128_t" is undefined
  				(rte_int128_t *)&list->head,
  				 ^

In file included from /tmp/FC29_K4.20_ICC19.0.0/x86_64-native-linuxapp-icc/3d927d246f6b44ddb51da6c7375d545f/dpdk/lib/librte_stack/rte_stack_lf.h(11),
                 from /tmp/FC29_K4.20_ICC19.0.0/x86_64-native-linuxapp-icc/3d927d246f6b44ddb51da6c7375d545f/dpdk/lib/librte_stack/rte_stack.h(95),
                 from /tmp/FC29_K4.20_ICC19.0.0/x86_64-native-linuxapp-icc/3d927d246f6b44ddb51da6c7375d545f/dpdk/lib/librte_stack/rte_stack.c(16):
/tmp/FC29_K4.20_ICC19.0.0/x86_64-native-linuxapp-icc/3d927d246f6b44ddb51da6c7375d545f/dpdk/lib/librte_stack/rte_stack_lf_generic.h(153): error: expected an expression
  				(rte_int128_t *)&list->head,
  				               ^

In file included from /tmp/FC29_K4.20_ICC19.0.0/x86_64-native-linuxapp-icc/3d927d246f6b44ddb51da6c7375d545f/dpdk/lib/librte_stack/rte_stack_lf.h(11),
                 from /tmp/FC29_K4.20_ICC19.0.0/x86_64-native-linuxapp-icc/3d927d246f6b44ddb51da6c7375d545f/dpdk/lib/librte_stack/rte_stack.h(95),
                 from /tmp/FC29_K4.20_ICC19.0.0/x86_64-native-linuxapp-icc/3d927d246f6b44ddb51da6c7375d545f/dpdk/lib/librte_stack/rte_stack.c(16):
/tmp/FC29_K4.20_ICC19.0.0/x86_64-native-linuxapp-icc/3d927d246f6b44ddb51da6c7375d545f/dpdk/lib/librte_stack/rte_stack_lf_generic.h(153): error: expression must have integral type
  				(rte_int128_t *)&list->head,
  				                 ^

In file included from /tmp/FC29_K4.20_ICC19.0.0/x86_64-native-linuxapp-icc/3d927d246f6b44ddb51da6c7375d545f/dpdk/lib/librte_stack/rte_stack_lf.h(11),
                 from /tmp/FC29_K4.20_ICC19.0.0/x86_64-native-linuxapp-icc/3d927d246f6b44ddb51da6c7375d545f/dpdk/lib/librte_stack/rte_stack.h(95),
                 from /tmp/FC29_K4.20_ICC19.0.0/x86_64-native-linuxapp-icc/3d927d246f6b44ddb51da6c7375d545f/dpdk/lib/librte_stack/rte_stack.c(16):
/tmp/FC29_K4.20_ICC19.0.0/x86_64-native-linuxapp-icc/3d927d246f6b44ddb51da6c7375d545f/dpdk/lib/librte_stack/rte_stack_lf_generic.h(154): error: expected an expression
  				(rte_int128_t *)&old_head,
  				               ^

In file included from /tmp/FC29_K4.20_ICC19.0.0/x86_64-native-linuxapp-icc/3d927d246f6b44ddb51da6c7375d545f/dpdk/lib/librte_stack/rte_stack_lf.h(11),
                 from /tmp/FC29_K4.20_ICC19.0.0/x86_64-native-linuxapp-icc/3d927d246f6b44ddb51da6c7375d545f/dpdk/lib/librte_stack/rte_stack.h(95),
                 from /tmp/FC29_K4.20_ICC19.0.0/x86_64-native-linuxapp-icc/3d927d246f6b44ddb51da6c7375d545f/dpdk/lib/librte_stack/rte_stack.c(16):
/tmp/FC29_K4.20_ICC19.0.0/x86_64-native-linuxapp-icc/3d927d246f6b44ddb51da6c7375d545f/dpdk/lib/librte_stack/rte_stack_lf_generic.h(154): error: expression must have integral type
  				(rte_int128_t *)&old_head,
  				                 ^

In file included from /tmp/FC29_K4.20_ICC19.0.0/x86_64-native-linuxapp-icc/3d927d246f6b44ddb51da6c7375d545f/dpdk/lib/librte_stack/rte_stack_lf.h(11),
                 from /tmp/FC29_K4.20_ICC19.0.0/x86_64-native-linuxapp-icc/3d927d246f6b44ddb51da6c7375d545f/dpdk/lib/librte_stack/rte_stack.h(95),
                 from /tmp/FC29_K4.20_ICC19.0.0/x86_64-native-linuxapp-icc/3d927d246f6b44ddb51da6c7375d545f/dpdk/lib/librte_stack/rte_stack.c(16):
/tmp/FC29_K4.20_ICC19.0.0/x86_64-native-linuxapp-icc/3d927d246f6b44ddb51da6c7375d545f/dpdk/lib/librte_stack/rte_stack_lf_generic.h(155): error: expected an expression
  				(rte_int128_t *)&new_head,
  				               ^

In file included from /tmp/FC29_K4.20_ICC19.0.0/x86_64-native-linuxapp-icc/3d927d246f6b44ddb51da6c7375d545f/dpdk/lib/librte_stack/rte_stack_lf.h(11),
                 from /tmp/FC29_K4.20_ICC19.0.0/x86_64-native-linuxapp-icc/3d927d246f6b44ddb51da6c7375d545f/dpdk/lib/librte_stack/rte_stack.h(95),
                 from /tmp/FC29_K4.20_ICC19.0.0/x86_64-native-linuxapp-icc/3d927d246f6b44ddb51da6c7375d545f/dpdk/lib/librte_stack/rte_stack.c(16):
/tmp/FC29_K4.20_ICC19.0.0/x86_64-native-linuxapp-icc/3d927d246f6b44ddb51da6c7375d545f/dpdk/lib/librte_stack/rte_stack_lf_generic.h(155): error: expression must have integral type
  				(rte_int128_t *)&new_head,
  				                 ^

compilation aborted for /tmp/FC29_K4.20_ICC19.0.0/x86_64-native-linuxapp-icc/3d927d246f6b44ddb51da6c7375d545f/dpdk/lib/librte_stack/rte_stack.c (code 2)
make[5]: *** [/tmp/FC29_K4.20_ICC19.0.0/x86_64-native-linuxapp-icc/3d927d246f6b44ddb51da6c7375d545f/dpdk/mk/internal/rte.compile-pre.mk:116: rte_stack.o] Error 2
--
  CC acl_bld.o
  CC cmdline_parse_ipaddr.o
In file included from /tmp/FC29_K4.20_ICC19.0.0/x86_64-native-linuxapp-icc/3d927d246f6b44ddb51da6c7375d545f/dpdk/lib/librte_stack/rte_stack_lf.h(11),
                 from /tmp/FC29_K4.20_ICC19.0.0/x86_64-native-linuxapp-icc/3d927d246f6b44ddb51da6c7375d545f/dpdk/lib/librte_stack/rte_stack.h(95),
                 from /tmp/FC29_K4.20_ICC19.0.0/x86_64-native-linuxapp-icc/3d927d246f6b44ddb51da6c7375d545f/dpdk/lib/librte_stack/rte_stack_std.c(5):
/tmp/FC29_K4.20_ICC19.0.0/x86_64-native-linuxapp-icc/3d927d246f6b44ddb51da6c7375d545f/dpdk/lib/librte_stack/rte_stack_lf_generic.h(68): warning #266: function "rte_atomic128_cmp_exchange" declared implicitly
  		success = rte_atomic128_cmp_exchange(
  		          ^

In file included from /tmp/FC29_K4.20_ICC19.0.0/x86_64-native-linuxapp-icc/3d927d246f6b44ddb51da6c7375d545f/dpdk/lib/librte_stack/rte_stack_lf.h(11),
                 from /tmp/FC29_K4.20_ICC19.0.0/x86_64-native-linuxapp-icc/3d927d246f6b44ddb51da6c7375d545f/dpdk/lib/librte_stack/rte_stack.h(95),
                 from /tmp/FC29_K4.20_ICC19.0.0/x86_64-native-linuxapp-icc/3d927d246f6b44ddb51da6c7375d545f/dpdk/lib/librte_stack/rte_stack_std.c(5):
/tmp/FC29_K4.20_ICC19.0.0/x86_64-native-linuxapp-icc/3d927d246f6b44ddb51da6c7375d545f/dpdk/lib/librte_stack/rte_stack_lf_generic.h(69): error: identifier "rte_int128_t" is undefined
  				(rte_int128_t *)&list->head,
  				 ^

In file included from /tmp/FC29_K4.20_ICC19.0.0/x86_64-native-linuxapp-icc/3d927d246f6b44ddb51da6c7375d545f/dpdk/lib/librte_stack/rte_stack_lf.h(11),
                 from /tmp/FC29_K4.20_ICC19.0.0/x86_64-native-linuxapp-icc/3d927d246f6b44ddb51da6c7375d545f/dpdk/lib/librte_stack/rte_stack.h(95),
                 from /tmp/FC29_K4.20_ICC19.0.0/x86_64-native-linuxapp-icc/3d927d246f6b44ddb51da6c7375d545f/dpdk/lib/librte_stack/rte_stack_std.c(5):
/tmp/FC29_K4.20_ICC19.0.0/x86_64-native-linuxapp-icc/3d927d246f6b44ddb51da6c7375d545f/dpdk/lib/librte_stack/rte_stack_lf_generic.h(69): error: expected an expression
  				(rte_int128_t *)&list->head,
  				               ^

In file included from /tmp/FC29_K4.20_ICC19.0.0/x86_64-native-linuxapp-icc/3d927d246f6b44ddb51da6c7375d545f/dpdk/lib/librte_stack/rte_stack_lf.h(11),
                 from /tmp/FC29_K4.20_ICC19.0.0/x86_64-native-linuxapp-icc/3d927d246f6b44ddb51da6c7375d545f/dpdk/lib/librte_stack/rte_stack.h(95),
                 from /tmp/FC29_K4.20_ICC19.0.0/x86_64-native-linuxapp-icc/3d927d246f6b44ddb51da6c7375d545f/dpdk/lib/librte_stack/rte_stack_std.c(5):
/tmp/FC29_K4.20_ICC19.0.0/x86_64-native-linuxapp-icc/3d927d246f6b44ddb51da6c7375d545f/dpdk/lib/librte_stack/rte_stack_lf_generic.h(69): error: expression must have integral type
  				(rte_int128_t *)&list->head,
  				                 ^

In file included from /tmp/FC29_K4.20_ICC19.0.0/x86_64-native-linuxapp-icc/3d927d246f6b44ddb51da6c7375d545f/dpdk/lib/librte_stack/rte_stack_lf.h(11),
                 from /tmp/FC29_K4.20_ICC19.0.0/x86_64-native-linuxapp-icc/3d927d246f6b44ddb51da6c7375d545f/dpdk/lib/librte_stack/rte_stack.h(95),
                 from /tmp/FC29_K4.20_ICC19.0.0/x86_64-native-linuxapp-icc/3d927d246f6b44ddb51da6c7375d545f/dpdk/lib/librte_stack/rte_stack_std.c(5):
/tmp/FC29_K4.20_ICC19.0.0/x86_64-native-linuxapp-icc/3d927d246f6b44ddb51da6c7375d545f/dpdk/lib/librte_stack/rte_stack_lf_generic.h(70): error: expected an expression
  				(rte_int128_t *)&old_head,
  				               ^

In file included from /tmp/FC29_K4.20_ICC19.0.0/x86_64-native-linuxapp-icc/3d927d246f6b44ddb51da6c7375d545f/dpdk/lib/librte_stack/rte_stack_lf.h(11),
                 from /tmp/FC29_K4.20_ICC19.0.0/x86_64-native-linuxapp-icc/3d927d246f6b44ddb51da6c7375d545f/dpdk/lib/librte_stack/rte_stack.h(95),
                 from /tmp/FC29_K4.20_ICC19.0.0/x86_64-native-linuxapp-icc/3d927d246f6b44ddb51da6c7375d545f/dpdk/lib/librte_stack/rte_stack_std.c(5):
/tmp/FC29_K4.20_ICC19.0.0/x86_64-native-linuxapp-icc/3d927d246f6b44ddb51da6c7375d545f/dpdk/lib/librte_stack/rte_stack_lf_generic.h(70): error: expression must have integral type
  				(rte_int128_t *)&old_head,
  				                 ^

In file included from /tmp/FC29_K4.20_ICC19.0.0/x86_64-native-linuxapp-icc/3d927d246f6b44ddb51da6c7375d545f/dpdk/lib/librte_stack/rte_stack_lf.h(11),
                 from /tmp/FC29_K4.20_ICC19.0.0/x86_64-native-linuxapp-icc/3d927d246f6b44ddb51da6c7375d545f/dpdk/lib/librte_stack/rte_stack.h(95),
                 from /tmp/FC29_K4.20_ICC19.0.0/x86_64-native-linuxapp-icc/3d927d246f6b44ddb51da6c7375d545f/dpdk/lib/librte_stack/rte_stack_std.c(5):
/tmp/FC29_K4.20_ICC19.0.0/x86_64-native-linuxapp-icc/3d927d246f6b44ddb51da6c7375d545f/dpdk/lib/librte_stack/rte_stack_lf_generic.h(71): error: expected an expression
  				(rte_int128_t *)&new_head,
  				               ^

In file included from /tmp/FC29_K4.20_ICC19.0.0/x86_64-native-linuxapp-icc/3d927d246f6b44ddb51da6c7375d545f/dpdk/lib/librte_stack/rte_stack_lf.h(11),
                 from /tmp/FC29_K4.20_ICC19.0.0/x86_64-native-linuxapp-icc/3d927d246f6b44ddb51da6c7375d545f/dpdk/lib/librte_stack/rte_stack.h(95),
                 from /tmp/FC29_K4.20_ICC19.0.0/x86_64-native-linuxapp-icc/3d927d246f6b44ddb51da6c7375d545f/dpdk/lib/librte_stack/rte_stack_std.c(5):
/tmp/FC29_K4.20_ICC19.0.0/x86_64-native-linuxapp-icc/3d927d246f6b44ddb51da6c7375d545f/dpdk/lib/librte_stack/rte_stack_lf_generic.h(71): error: expression must have integral type
  				(rte_int128_t *)&new_head,
  				                 ^

In file included from /tmp/FC29_K4.20_ICC19.0.0/x86_64-native-linuxapp-icc/3d927d246f6b44ddb51da6c7375d545f/dpdk/lib/librte_stack/rte_stack_lf.h(11),
                 from /tmp/FC29_K4.20_ICC19.0.0/x86_64-native-linuxapp-icc/3d927d246f6b44ddb51da6c7375d545f/dpdk/lib/librte_stack/rte_stack.h(95),
                 from /tmp/FC29_K4.20_ICC19.0.0/x86_64-native-linuxapp-icc/3d927d246f6b44ddb51da6c7375d545f/dpdk/lib/librte_stack/rte_stack_std.c(5):
/tmp/FC29_K4.20_ICC19.0.0/x86_64-native-linuxapp-icc/3d927d246f6b44ddb51da6c7375d545f/dpdk/lib/librte_stack/rte_stack_lf_generic.h(152): warning #266: function "rte_atomic128_cmp_exchange" declared implicitly
  		success = rte_atomic128_cmp_exchange(
  		          ^

In file included from /tmp/FC29_K4.20_ICC19.0.0/x86_64-native-linuxapp-icc/3d927d246f6b44ddb51da6c7375d545f/dpdk/lib/librte_stack/rte_stack_lf.h(11),
                 from /tmp/FC29_K4.20_ICC19.0.0/x86_64-native-linuxapp-icc/3d927d246f6b44ddb51da6c7375d545f/dpdk/lib/librte_stack/rte_stack.h(95),
                 from /tmp/FC29_K4.20_ICC19.0.0/x86_64-native-linuxapp-icc/3d927d246f6b44ddb51da6c7375d545f/dpdk/lib/librte_stack/rte_stack_std.c(5):
/tmp/FC29_K4.20_ICC19.0.0/x86_64-native-linuxapp-icc/3d927d246f6b44ddb51da6c7375d545f/dpdk/lib/librte_stack/rte_stack_lf_generic.h(153): error: identifier "rte_int128_t" is undefined
  				(rte_int128_t *)&list->head,
  				 ^

In file included from /tmp/FC29_K4.20_ICC19.0.0/x86_64-native-linuxapp-icc/3d927d246f6b44ddb51da6c7375d545f/dpdk/lib/librte_stack/rte_stack_lf.h(11),
                 from /tmp/FC29_K4.20_ICC19.0.0/x86_64-native-linuxapp-icc/3d927d246f6b44ddb51da6c7375d545f/dpdk/lib/librte_stack/rte_stack.h(95),
                 from /tmp/FC29_K4.20_ICC19.0.0/x86_64-native-linuxapp-icc/3d927d246f6b44ddb51da6c7375d545f/dpdk/lib/librte_stack/rte_stack_std.c(5):
/tmp/FC29_K4.20_ICC19.0.0/x86_64-native-linuxapp-icc/3d927d246f6b44ddb51da6c7375d545f/dpdk/lib/librte_stack/rte_stack_lf_generic.h(153): error: expected an expression
  				(rte_int128_t *)&list->head,
  				               ^

In file included from /tmp/FC29_K4.20_ICC19.0.0/x86_64-native-linuxapp-icc/3d927d246f6b44ddb51da6c7375d545f/dpdk/lib/librte_stack/rte_stack_lf.h(11),
                 from /tmp/FC29_K4.20_ICC19.0.0/x86_64-native-linuxapp-icc/3d927d246f6b44ddb51da6c7375d545f/dpdk/lib/librte_stack/rte_stack.h(95),
                 from /tmp/FC29_K4.20_ICC19.0.0/x86_64-native-linuxapp-icc/3d927d246f6b44ddb51da6c7375d545f/dpdk/lib/librte_stack/rte_stack_std.c(5):
/tmp/FC29_K4.20_ICC19.0.0/x86_64-native-linuxapp-icc/3d927d246f6b44ddb51da6c7375d545f/dpdk/lib/librte_stack/rte_stack_lf_generic.h(153): error: expression must have integral type
  				(rte_int128_t *)&list->head,
  				                 ^

In file included from /tmp/FC29_K4.20_ICC19.0.0/x86_64-native-linuxapp-icc/3d927d246f6b44ddb51da6c7375d545f/dpdk/lib/librte_stack/rte_stack_lf.h(11),
                 from /tmp/FC29_K4.20_ICC19.0.0/x86_64-native-linuxapp-icc/3d927d246f6b44ddb51da6c7375d545f/dpdk/lib/librte_stack/rte_stack.h(95),
                 from /tmp/FC29_K4.20_ICC19.0.0/x86_64-native-linuxapp-icc/3d927d246f6b44ddb51da6c7375d545f/dpdk/lib/librte_stack/rte_stack_std.c(5):
/tmp/FC29_K4.20_ICC19.0.0/x86_64-native-linuxapp-icc/3d927d246f6b44ddb51da6c7375d545f/dpdk/lib/librte_stack/rte_stack_lf_generic.h(154): error: expected an expression
  				(rte_int128_t *)&old_head,
  				               ^

In file included from /tmp/FC29_K4.20_ICC19.0.0/x86_64-native-linuxapp-icc/3d927d246f6b44ddb51da6c7375d545f/dpdk/lib/librte_stack/rte_stack_lf.h(11),
                 from /tmp/FC29_K4.20_ICC19.0.0/x86_64-native-linuxapp-icc/3d927d246f6b44ddb51da6c7375d545f/dpdk/lib/librte_stack/rte_stack.h(95),
                 from /tmp/FC29_K4.20_ICC19.0.0/x86_64-native-linuxapp-icc/3d927d246f6b44ddb51da6c7375d545f/dpdk/lib/librte_stack/rte_stack_std.c(5):
/tmp/FC29_K4.20_ICC19.0.0/x86_64-native-linuxapp-icc/3d927d246f6b44ddb51da6c7375d545f/dpdk/lib/librte_stack/rte_stack_lf_generic.h(154): error: expression must have integral type
  				(rte_int128_t *)&old_head,
  				                 ^

In file included from /tmp/FC29_K4.20_ICC19.0.0/x86_64-native-linuxapp-icc/3d927d246f6b44ddb51da6c7375d545f/dpdk/lib/librte_stack/rte_stack_lf.h(11),
                 from /tmp/FC29_K4.20_ICC19.0.0/x86_64-native-linuxapp-icc/3d927d246f6b44ddb51da6c7375d545f/dpdk/lib/librte_stack/rte_stack.h(95),
                 from /tmp/FC29_K4.20_ICC19.0.0/x86_64-native-linuxapp-icc/3d927d246f6b44ddb51da6c7375d545f/dpdk/lib/librte_stack/rte_stack_std.c(5):
/tmp/FC29_K4.20_ICC19.0.0/x86_64-native-linuxapp-icc/3d927d246f6b44ddb51da6c7375d545f/dpdk/lib/librte_stack/rte_stack_lf_generic.h(155): error: expected an expression
  				(rte_int128_t *)&new_head,
  				               ^

In file included from /tmp/FC29_K4.20_ICC19.0.0/x86_64-native-linuxapp-icc/3d927d246f6b44ddb51da6c7375d545f/dpdk/lib/librte_stack/rte_stack_lf.h(11),
                 from /tmp/FC29_K4.20_ICC19.0.0/x86_64-native-linuxapp-icc/3d927d246f6b44ddb51da6c7375d545f/dpdk/lib/librte_stack/rte_stack.h(95),
                 from /tmp/FC29_K4.20_ICC19.0.0/x86_64-native-linuxapp-icc/3d927d246f6b44ddb51da6c7375d545f/dpdk/lib/librte_stack/rte_stack_std.c(5):
/tmp/FC29_K4.20_ICC19.0.0/x86_64-native-linuxapp-icc/3d927d246f6b44ddb51da6c7375d545f/dpdk/lib/librte_stack/rte_stack_lf_generic.h(155): error: expression must have integral type
  				(rte_int128_t *)&new_head,
  				                 ^

== Build lib/librte_mempool
compilation aborted for /tmp/FC29_K4.20_ICC19.0.0/x86_64-native-linuxapp-icc/3d927d246f6b44ddb51da6c7375d545f/dpdk/lib/librte_stack/rte_stack_std.c (code 2)

*Failed Build #19:
OS: CENTOS74
Target: x86_64-native-linuxapp-gcc
  CC acl_run_scalar.o
In file included from /tmp/CENTOS74_K3.10.0_GCC4.8.5/x86_64-native-linuxapp-gcc/3d927d246f6b44ddb51da6c7375d545f/dpdk/lib/librte_stack/rte_stack_lf.h:11:0,
                 from /tmp/CENTOS74_K3.10.0_GCC4.8.5/x86_64-native-linuxapp-gcc/3d927d246f6b44ddb51da6c7375d545f/dpdk/lib/librte_stack/rte_stack.h:95,
                 from /tmp/CENTOS74_K3.10.0_GCC4.8.5/x86_64-native-linuxapp-gcc/3d927d246f6b44ddb51da6c7375d545f/dpdk/lib/librte_stack/rte_stack.c:16:
/tmp/CENTOS74_K3.10.0_GCC4.8.5/x86_64-native-linuxapp-gcc/3d927d246f6b44ddb51da6c7375d545f/dpdk/lib/librte_stack/rte_stack_lf_generic.h: In function ‘__rte_stack_lf_push_elems’:
/tmp/CENTOS74_K3.10.0_GCC4.8.5/x86_64-native-linuxapp-gcc/3d927d246f6b44ddb51da6c7375d545f/dpdk/lib/librte_stack/rte_stack_lf_generic.h:68:3: warning: implicit declaration of function ‘rte_atomic128_cmp_exchange’ [-Wimplicit-function-declaration]
   success = rte_atomic128_cmp_exchange(
   ^
/tmp/CENTOS74_K3.10.0_GCC4.8.5/x86_64-native-linuxapp-gcc/3d927d246f6b44ddb51da6c7375d545f/dpdk/lib/librte_stack/rte_stack_lf_generic.h:68:3: warning: nested extern declaration of ‘rte_atomic128_cmp_exchange’ [-Wnested-externs]
/tmp/CENTOS74_K3.10.0_GCC4.8.5/x86_64-native-linuxapp-gcc/3d927d246f6b44ddb51da6c7375d545f/dpdk/lib/librte_stack/rte_stack_lf_generic.h:69:6: error: ‘rte_int128_t’ undeclared (first use in this function)
     (rte_int128_t *)&list->head,
      ^
/tmp/CENTOS74_K3.10.0_GCC4.8.5/x86_64-native-linuxapp-gcc/3d927d246f6b44ddb51da6c7375d545f/dpdk/lib/librte_stack/rte_stack_lf_generic.h:69:6: note: each undeclared identifier is reported only once for each function it appears in
/tmp/CENTOS74_K3.10.0_GCC4.8.5/x86_64-native-linuxapp-gcc/3d927d246f6b44ddb51da6c7375d545f/dpdk/lib/librte_stack/rte_stack_lf_generic.h:69:20: error: expected expression before ‘)’ token
     (rte_int128_t *)&list->head,
                    ^
/tmp/CENTOS74_K3.10.0_GCC4.8.5/x86_64-native-linuxapp-gcc/3d927d246f6b44ddb51da6c7375d545f/dpdk/lib/librte_stack/rte_stack_lf_generic.h:50:28: warning: variable ‘new_head’ set but not used [-Wunused-but-set-variable]
   struct rte_stack_lf_head new_head;
                            ^
/tmp/CENTOS74_K3.10.0_GCC4.8.5/x86_64-native-linuxapp-gcc/3d927d246f6b44ddb51da6c7375d545f/dpdk/lib/librte_stack/rte_stack_lf_generic.h: In function ‘__rte_stack_lf_pop_elems’:
/tmp/CENTOS74_K3.10.0_GCC4.8.5/x86_64-native-linuxapp-gcc/3d927d246f6b44ddb51da6c7375d545f/dpdk/lib/librte_stack/rte_stack_lf_generic.h:153:6: error: ‘rte_int128_t’ undeclared (first use in this function)
     (rte_int128_t *)&list->head,
      ^
/tmp/CENTOS74_K3.10.0_GCC4.8.5/x86_64-native-linuxapp-gcc/3d927d246f6b44ddb51da6c7375d545f/dpdk/lib/librte_stack/rte_stack_lf_generic.h:153:20: error: expected expression before ‘)’ token
     (rte_int128_t *)&list->head,
                    ^
/tmp/CENTOS74_K3.10.0_GCC4.8.5/x86_64-native-linuxapp-gcc/3d927d246f6b44ddb51da6c7375d545f/dpdk/lib/librte_stack/rte_stack_lf_generic.h:114:28: warning: variable ‘new_head’ set but not used [-Wunused-but-set-variable]
   struct rte_stack_lf_head new_head;
                            ^
make[5]: *** [rte_stack.o] Error 1
make[5]: *** Waiting for unfinished jobs....
In file included from /tmp/CENTOS74_K3.10.0_GCC4.8.5/x86_64-native-linuxapp-gcc/3d927d246f6b44ddb51da6c7375d545f/dpdk/lib/librte_stack/rte_stack_lf.h:11:0,
                 from /tmp/CENTOS74_K3.10.0_GCC4.8.5/x86_64-native-linuxapp-gcc/3d927d246f6b44ddb51da6c7375d545f/dpdk/lib/librte_stack/rte_stack.h:95,
                 from /tmp/CENTOS74_K3.10.0_GCC4.8.5/x86_64-native-linuxapp-gcc/3d927d246f6b44ddb51da6c7375d545f/dpdk/lib/librte_stack/rte_stack_std.c:5:
/tmp/CENTOS74_K3.10.0_GCC4.8.5/x86_64-native-linuxapp-gcc/3d927d246f6b44ddb51da6c7375d545f/dpdk/lib/librte_stack/rte_stack_lf_generic.h: In function ‘__rte_stack_lf_push_elems’:
/tmp/CENTOS74_K3.10.0_GCC4.8.5/x86_64-native-linuxapp-gcc/3d927d246f6b44ddb51da6c7375d545f/dpdk/lib/librte_stack/rte_stack_lf_generic.h:68:3: warning: implicit declaration of function ‘rte_atomic128_cmp_exchange’ [-Wimplicit-function-declaration]
   success = rte_atomic128_cmp_exchange(
   ^
/tmp/CENTOS74_K3.10.0_GCC4.8.5/x86_64-native-linuxapp-gcc/3d927d246f6b44ddb51da6c7375d545f/dpdk/lib/librte_stack/rte_stack_lf_generic.h:68:3: warning: nested extern declaration of ‘rte_atomic128_cmp_exchange’ [-Wnested-externs]
/tmp/CENTOS74_K3.10.0_GCC4.8.5/x86_64-native-linuxapp-gcc/3d927d246f6b44ddb51da6c7375d545f/dpdk/lib/librte_stack/rte_stack_lf_generic.h:69:6: error: ‘rte_int128_t’ undeclared (first use in this function)
     (rte_int128_t *)&list->head,
      ^
/tmp/CENTOS74_K3.10.0_GCC4.8.5/x86_64-native-linuxapp-gcc/3d927d246f6b44ddb51da6c7375d545f/dpdk/lib/librte_stack/rte_stack_lf_generic.h:69:6: note: each undeclared identifier is reported only once for each function it appears in
/tmp/CENTOS74_K3.10.0_GCC4.8.5/x86_64-native-linuxapp-gcc/3d927d246f6b44ddb51da6c7375d545f/dpdk/lib/librte_stack/rte_stack_lf_generic.h:69:20: error: expected expression before ‘)’ token
     (rte_int128_t *)&list->head,
                    ^
/tmp/CENTOS74_K3.10.0_GCC4.8.5/x86_64-native-linuxapp-gcc/3d927d246f6b44ddb51da6c7375d545f/dpdk/lib/librte_stack/rte_stack_lf_generic.h:50:28: warning: variable ‘new_head’ set but not used [-Wunused-but-set-variable]
   struct rte_stack_lf_head new_head;
                            ^
/tmp/CENTOS74_K3.10.0_GCC4.8.5/x86_64-native-linuxapp-gcc/3d927d246f6b44ddb51da6c7375d545f/dpdk/lib/librte_stack/rte_stack_lf_generic.h: In function ‘__rte_stack_lf_pop_elems’:
/tmp/CENTOS74_K3.10.0_GCC4.8.5/x86_64-native-linuxapp-gcc/3d927d246f6b44ddb51da6c7375d545f/dpdk/lib/librte_stack/rte_stack_lf_generic.h:153:6: error: ‘rte_int128_t’ undeclared (first use in this function)
     (rte_int128_t *)&list->head,
      ^
/tmp/CENTOS74_K3.10.0_GCC4.8.5/x86_64-native-linuxapp-gcc/3d927d246f6b44ddb51da6c7375d545f/dpdk/lib/librte_stack/rte_stack_lf_generic.h:153:20: error: expected expression before ‘)’ token
     (rte_int128_t *)&list->head,
                    ^
/tmp/CENTOS74_K3.10.0_GCC4.8.5/x86_64-native-linuxapp-gcc/3d927d246f6b44ddb51da6c7375d545f/dpdk/lib/librte_stack/rte_stack_lf_generic.h:114:28: warning: variable ‘new_head’ set but not used [-Wunused-but-set-variable]
   struct rte_stack_lf_head new_head;
                            ^
make[5]: *** [rte_stack_std.o] Error 1
make[4]: *** [librte_stack] Error 2
make[4]: *** Waiting for unfinished jobs....

*Failed Build #20:
OS: CENTOS75
Target: x86_64-native-linuxapp-gcc
== Build lib/librte_hash
In file included from /tmp/CENTOS75_K3.10.0_GCC4.8.5/x86_64-native-linuxapp-gcc/3d927d246f6b44ddb51da6c7375d545f/dpdk/lib/librte_stack/rte_stack_lf.h:11:0,
                 from /tmp/CENTOS75_K3.10.0_GCC4.8.5/x86_64-native-linuxapp-gcc/3d927d246f6b44ddb51da6c7375d545f/dpdk/lib/librte_stack/rte_stack.h:95,
                 from /tmp/CENTOS75_K3.10.0_GCC4.8.5/x86_64-native-linuxapp-gcc/3d927d246f6b44ddb51da6c7375d545f/dpdk/lib/librte_stack/rte_stack.c:16:
/tmp/CENTOS75_K3.10.0_GCC4.8.5/x86_64-native-linuxapp-gcc/3d927d246f6b44ddb51da6c7375d545f/dpdk/lib/librte_stack/rte_stack_lf_generic.h: In function ‘__rte_stack_lf_push_elems’:
/tmp/CENTOS75_K3.10.0_GCC4.8.5/x86_64-native-linuxapp-gcc/3d927d246f6b44ddb51da6c7375d545f/dpdk/lib/librte_stack/rte_stack_lf_generic.h:68:3: warning: implicit declaration of function ‘rte_atomic128_cmp_exchange’ [-Wimplicit-function-declaration]
   success = rte_atomic128_cmp_exchange(
   ^
/tmp/CENTOS75_K3.10.0_GCC4.8.5/x86_64-native-linuxapp-gcc/3d927d246f6b44ddb51da6c7375d545f/dpdk/lib/librte_stack/rte_stack_lf_generic.h:68:3: warning: nested extern declaration of ‘rte_atomic128_cmp_exchange’ [-Wnested-externs]
/tmp/CENTOS75_K3.10.0_GCC4.8.5/x86_64-native-linuxapp-gcc/3d927d246f6b44ddb51da6c7375d545f/dpdk/lib/librte_stack/rte_stack_lf_generic.h:69:6: error: ‘rte_int128_t’ undeclared (first use in this function)
     (rte_int128_t *)&list->head,
      ^
/tmp/CENTOS75_K3.10.0_GCC4.8.5/x86_64-native-linuxapp-gcc/3d927d246f6b44ddb51da6c7375d545f/dpdk/lib/librte_stack/rte_stack_lf_generic.h:69:6: note: each undeclared identifier is reported only once for each function it appears in
/tmp/CENTOS75_K3.10.0_GCC4.8.5/x86_64-native-linuxapp-gcc/3d927d246f6b44ddb51da6c7375d545f/dpdk/lib/librte_stack/rte_stack_lf_generic.h:69:20: error: expected expression before ‘)’ token
     (rte_int128_t *)&list->head,
                    ^
/tmp/CENTOS75_K3.10.0_GCC4.8.5/x86_64-native-linuxapp-gcc/3d927d246f6b44ddb51da6c7375d545f/dpdk/lib/librte_stack/rte_stack_lf_generic.h:50:28: warning: variable ‘new_head’ set but not used [-Wunused-but-set-variable]
   struct rte_stack_lf_head new_head;
                            ^
/tmp/CENTOS75_K3.10.0_GCC4.8.5/x86_64-native-linuxapp-gcc/3d927d246f6b44ddb51da6c7375d545f/dpdk/lib/librte_stack/rte_stack_lf_generic.h: In function ‘__rte_stack_lf_pop_elems’:
/tmp/CENTOS75_K3.10.0_GCC4.8.5/x86_64-native-linuxapp-gcc/3d927d246f6b44ddb51da6c7375d545f/dpdk/lib/librte_stack/rte_stack_lf_generic.h:153:6: error: ‘rte_int128_t’ undeclared (first use in this function)
     (rte_int128_t *)&list->head,
      ^
/tmp/CENTOS75_K3.10.0_GCC4.8.5/x86_64-native-linuxapp-gcc/3d927d246f6b44ddb51da6c7375d545f/dpdk/lib/librte_stack/rte_stack_lf_generic.h:153:20: error: expected expression before ‘)’ token
     (rte_int128_t *)&list->head,
                    ^
/tmp/CENTOS75_K3.10.0_GCC4.8.5/x86_64-native-linuxapp-gcc/3d927d246f6b44ddb51da6c7375d545f/dpdk/lib/librte_stack/rte_stack_lf_generic.h:114:28: warning: variable ‘new_head’ set but not used [-Wunused-but-set-variable]
   struct rte_stack_lf_head new_head;
                            ^
  CC cmdline.o
  AR librte_timer.a
  AR librte_jobstats.a

*Failed Build #21:
OS: RHEL74
Target: x86_64-native-linuxapp-gcc
  CC cmdline_cirbuf.o
In file included from /tmp/RHEL74_K3.10.0_GCC4.8.5/x86_64-native-linuxapp-gcc/3d927d246f6b44ddb51da6c7375d545f/dpdk/lib/librte_stack/rte_stack_lf.h:11:0,
                 from /tmp/RHEL74_K3.10.0_GCC4.8.5/x86_64-native-linuxapp-gcc/3d927d246f6b44ddb51da6c7375d545f/dpdk/lib/librte_stack/rte_stack.h:95,
                 from /tmp/RHEL74_K3.10.0_GCC4.8.5/x86_64-native-linuxapp-gcc/3d927d246f6b44ddb51da6c7375d545f/dpdk/lib/librte_stack/rte_stack.c:16:
/tmp/RHEL74_K3.10.0_GCC4.8.5/x86_64-native-linuxapp-gcc/3d927d246f6b44ddb51da6c7375d545f/dpdk/lib/librte_stack/rte_stack_lf_generic.h: In function ‘__rte_stack_lf_push_elems’:
/tmp/RHEL74_K3.10.0_GCC4.8.5/x86_64-native-linuxapp-gcc/3d927d246f6b44ddb51da6c7375d545f/dpdk/lib/librte_stack/rte_stack_lf_generic.h:68:3: warning: implicit declaration of function ‘rte_atomic128_cmp_exchange’ [-Wimplicit-function-declaration]
   success = rte_atomic128_cmp_exchange(
   ^
/tmp/RHEL74_K3.10.0_GCC4.8.5/x86_64-native-linuxapp-gcc/3d927d246f6b44ddb51da6c7375d545f/dpdk/lib/librte_stack/rte_stack_lf_generic.h:68:3: warning: nested extern declaration of ‘rte_atomic128_cmp_exchange’ [-Wnested-externs]
/tmp/RHEL74_K3.10.0_GCC4.8.5/x86_64-native-linuxapp-gcc/3d927d246f6b44ddb51da6c7375d545f/dpdk/lib/librte_stack/rte_stack_lf_generic.h:69:6: error: ‘rte_int128_t’ undeclared (first use in this function)
     (rte_int128_t *)&list->head,
      ^
/tmp/RHEL74_K3.10.0_GCC4.8.5/x86_64-native-linuxapp-gcc/3d927d246f6b44ddb51da6c7375d545f/dpdk/lib/librte_stack/rte_stack_lf_generic.h:69:6: note: each undeclared identifier is reported only once for each function it appears in
/tmp/RHEL74_K3.10.0_GCC4.8.5/x86_64-native-linuxapp-gcc/3d927d246f6b44ddb51da6c7375d545f/dpdk/lib/librte_stack/rte_stack_lf_generic.h:69:20: error: expected expression before ‘)’ token
     (rte_int128_t *)&list->head,
                    ^
/tmp/RHEL74_K3.10.0_GCC4.8.5/x86_64-native-linuxapp-gcc/3d927d246f6b44ddb51da6c7375d545f/dpdk/lib/librte_stack/rte_stack_lf_generic.h:50:28: warning: variable ‘new_head’ set but not used [-Wunused-but-set-variable]
   struct rte_stack_lf_head new_head;
                            ^
/tmp/RHEL74_K3.10.0_GCC4.8.5/x86_64-native-linuxapp-gcc/3d927d246f6b44ddb51da6c7375d545f/dpdk/lib/librte_stack/rte_stack_lf_generic.h: In function ‘__rte_stack_lf_pop_elems’:
/tmp/RHEL74_K3.10.0_GCC4.8.5/x86_64-native-linuxapp-gcc/3d927d246f6b44ddb51da6c7375d545f/dpdk/lib/librte_stack/rte_stack_lf_generic.h:153:6: error: ‘rte_int128_t’ undeclared (first use in this function)
     (rte_int128_t *)&list->head,
      ^
/tmp/RHEL74_K3.10.0_GCC4.8.5/x86_64-native-linuxapp-gcc/3d927d246f6b44ddb51da6c7375d545f/dpdk/lib/librte_stack/rte_stack_lf_generic.h:153:20: error: expected expression before ‘)’ token
     (rte_int128_t *)&list->head,
                    ^
/tmp/RHEL74_K3.10.0_GCC4.8.5/x86_64-native-linuxapp-gcc/3d927d246f6b44ddb51da6c7375d545f/dpdk/lib/librte_stack/rte_stack_lf_generic.h:114:28: warning: variable ‘new_head’ set but not used [-Wunused-but-set-variable]
   struct rte_stack_lf_head new_head;
                            ^
make[5]: *** [rte_stack.o] Error 1
make[4]: *** [librte_stack] Error 2
make[4]: *** Waiting for unfinished jobs....

*Failed Build #22:
OS: FC28
Target: x86_64-native-linuxapp-icc
== Build lib/librte_power
  SYMLINK-FILE include/cmdline_socket.h
In file included from /tmp/FC28_K4.16.3_ICC19.0.0/x86_64-native-linuxapp-icc/3d927d246f6b44ddb51da6c7375d545f/dpdk/lib/librte_stack/rte_stack_lf.h(11),
                 from /tmp/FC28_K4.16.3_ICC19.0.0/x86_64-native-linuxapp-icc/3d927d246f6b44ddb51da6c7375d545f/dpdk/lib/librte_stack/rte_stack.h(95),
                 from /tmp/FC28_K4.16.3_ICC19.0.0/x86_64-native-linuxapp-icc/3d927d246f6b44ddb51da6c7375d545f/dpdk/lib/librte_stack/rte_stack.c(16):
/tmp/FC28_K4.16.3_ICC19.0.0/x86_64-native-linuxapp-icc/3d927d246f6b44ddb51da6c7375d545f/dpdk/lib/librte_stack/rte_stack_lf_generic.h(68): warning #266: function "rte_atomic128_cmp_exchange" declared implicitly
  		success = rte_atomic128_cmp_exchange(
  		          ^

In file included from /tmp/FC28_K4.16.3_ICC19.0.0/x86_64-native-linuxapp-icc/3d927d246f6b44ddb51da6c7375d545f/dpdk/lib/librte_stack/rte_stack_lf.h(11),
                 from /tmp/FC28_K4.16.3_ICC19.0.0/x86_64-native-linuxapp-icc/3d927d246f6b44ddb51da6c7375d545f/dpdk/lib/librte_stack/rte_stack.h(95),
                 from /tmp/FC28_K4.16.3_ICC19.0.0/x86_64-native-linuxapp-icc/3d927d246f6b44ddb51da6c7375d545f/dpdk/lib/librte_stack/rte_stack.c(16):
/tmp/FC28_K4.16.3_ICC19.0.0/x86_64-native-linuxapp-icc/3d927d246f6b44ddb51da6c7375d545f/dpdk/lib/librte_stack/rte_stack_lf_generic.h(69): error: identifier "rte_int128_t" is undefined
  				(rte_int128_t *)&list->head,
  				 ^

In file included from /tmp/FC28_K4.16.3_ICC19.0.0/x86_64-native-linuxapp-icc/3d927d246f6b44ddb51da6c7375d545f/dpdk/lib/librte_stack/rte_stack_lf.h(11),
                 from /tmp/FC28_K4.16.3_ICC19.0.0/x86_64-native-linuxapp-icc/3d927d246f6b44ddb51da6c7375d545f/dpdk/lib/librte_stack/rte_stack.h(95),
                 from /tmp/FC28_K4.16.3_ICC19.0.0/x86_64-native-linuxapp-icc/3d927d246f6b44ddb51da6c7375d545f/dpdk/lib/librte_stack/rte_stack.c(16):
/tmp/FC28_K4.16.3_ICC19.0.0/x86_64-native-linuxapp-icc/3d927d246f6b44ddb51da6c7375d545f/dpdk/lib/librte_stack/rte_stack_lf_generic.h(69): error: expected an expression
  				(rte_int128_t *)&list->head,
  				               ^

In file included from /tmp/FC28_K4.16.3_ICC19.0.0/x86_64-native-linuxapp-icc/3d927d246f6b44ddb51da6c7375d545f/dpdk/lib/librte_stack/rte_stack_lf.h(11),
                 from /tmp/FC28_K4.16.3_ICC19.0.0/x86_64-native-linuxapp-icc/3d927d246f6b44ddb51da6c7375d545f/dpdk/lib/librte_stack/rte_stack.h(95),
                 from /tmp/FC28_K4.16.3_ICC19.0.0/x86_64-native-linuxapp-icc/3d927d246f6b44ddb51da6c7375d545f/dpdk/lib/librte_stack/rte_stack.c(16):
/tmp/FC28_K4.16.3_ICC19.0.0/x86_64-native-linuxapp-icc/3d927d246f6b44ddb51da6c7375d545f/dpdk/lib/librte_stack/rte_stack_lf_generic.h(69): error: expression must have integral type
  				(rte_int128_t *)&list->head,
  				                 ^

In file included from /tmp/FC28_K4.16.3_ICC19.0.0/x86_64-native-linuxapp-icc/3d927d246f6b44ddb51da6c7375d545f/dpdk/lib/librte_stack/rte_stack_lf.h(11),
                 from /tmp/FC28_K4.16.3_ICC19.0.0/x86_64-native-linuxapp-icc/3d927d246f6b44ddb51da6c7375d545f/dpdk/lib/librte_stack/rte_stack.h(95),
                 from /tmp/FC28_K4.16.3_ICC19.0.0/x86_64-native-linuxapp-icc/3d927d246f6b44ddb51da6c7375d545f/dpdk/lib/librte_stack/rte_stack.c(16):
/tmp/FC28_K4.16.3_ICC19.0.0/x86_64-native-linuxapp-icc/3d927d246f6b44ddb51da6c7375d545f/dpdk/lib/librte_stack/rte_stack_lf_generic.h(70): error: expected an expression
  				(rte_int128_t *)&old_head,
  				               ^

In file included from /tmp/FC28_K4.16.3_ICC19.0.0/x86_64-native-linuxapp-icc/3d927d246f6b44ddb51da6c7375d545f/dpdk/lib/librte_stack/rte_stack_lf.h(11),
                 from /tmp/FC28_K4.16.3_ICC19.0.0/x86_64-native-linuxapp-icc/3d927d246f6b44ddb51da6c7375d545f/dpdk/lib/librte_stack/rte_stack.h(95),
                 from /tmp/FC28_K4.16.3_ICC19.0.0/x86_64-native-linuxapp-icc/3d927d246f6b44ddb51da6c7375d545f/dpdk/lib/librte_stack/rte_stack.c(16):
/tmp/FC28_K4.16.3_ICC19.0.0/x86_64-native-linuxapp-icc/3d927d246f6b44ddb51da6c7375d545f/dpdk/lib/librte_stack/rte_stack_lf_generic.h(70): error: expression must have integral type
  				(rte_int128_t *)&old_head,
  				                 ^

In file included from /tmp/FC28_K4.16.3_ICC19.0.0/x86_64-native-linuxapp-icc/3d927d246f6b44ddb51da6c7375d545f/dpdk/lib/librte_stack/rte_stack_lf.h(11),
                 from /tmp/FC28_K4.16.3_ICC19.0.0/x86_64-native-linuxapp-icc/3d927d246f6b44ddb51da6c7375d545f/dpdk/lib/librte_stack/rte_stack.h(95),
                 from /tmp/FC28_K4.16.3_ICC19.0.0/x86_64-native-linuxapp-icc/3d927d246f6b44ddb51da6c7375d545f/dpdk/lib/librte_stack/rte_stack.c(16):
/tmp/FC28_K4.16.3_ICC19.0.0/x86_64-native-linuxapp-icc/3d927d246f6b44ddb51da6c7375d545f/dpdk/lib/librte_stack/rte_stack_lf_generic.h(71): error: expected an expression
  				(rte_int128_t *)&new_head,
  				               ^

In file included from /tmp/FC28_K4.16.3_ICC19.0.0/x86_64-native-linuxapp-icc/3d927d246f6b44ddb51da6c7375d545f/dpdk/lib/librte_stack/rte_stack_lf.h(11),
                 from /tmp/FC28_K4.16.3_ICC19.0.0/x86_64-native-linuxapp-icc/3d927d246f6b44ddb51da6c7375d545f/dpdk/lib/librte_stack/rte_stack.h(95),
                 from /tmp/FC28_K4.16.3_ICC19.0.0/x86_64-native-linuxapp-icc/3d927d246f6b44ddb51da6c7375d545f/dpdk/lib/librte_stack/rte_stack.c(16):
/tmp/FC28_K4.16.3_ICC19.0.0/x86_64-native-linuxapp-icc/3d927d246f6b44ddb51da6c7375d545f/dpdk/lib/librte_stack/rte_stack_lf_generic.h(71): error: expression must have integral type
  				(rte_int128_t *)&new_head,
  				                 ^

In file included from /tmp/FC28_K4.16.3_ICC19.0.0/x86_64-native-linuxapp-icc/3d927d246f6b44ddb51da6c7375d545f/dpdk/lib/librte_stack/rte_stack_lf.h(11),
                 from /tmp/FC28_K4.16.3_ICC19.0.0/x86_64-native-linuxapp-icc/3d927d246f6b44ddb51da6c7375d545f/dpdk/lib/librte_stack/rte_stack.h(95),
                 from /tmp/FC28_K4.16.3_ICC19.0.0/x86_64-native-linuxapp-icc/3d927d246f6b44ddb51da6c7375d545f/dpdk/lib/librte_stack/rte_stack.c(16):
/tmp/FC28_K4.16.3_ICC19.0.0/x86_64-native-linuxapp-icc/3d927d246f6b44ddb51da6c7375d545f/dpdk/lib/librte_stack/rte_stack_lf_generic.h(152): warning #266: function "rte_atomic128_cmp_exchange" declared implicitly
  		success = rte_atomic128_cmp_exchange(
  		          ^

In file included from /tmp/FC28_K4.16.3_ICC19.0.0/x86_64-native-linuxapp-icc/3d927d246f6b44ddb51da6c7375d545f/dpdk/lib/librte_stack/rte_stack_lf.h(11),
                 from /tmp/FC28_K4.16.3_ICC19.0.0/x86_64-native-linuxapp-icc/3d927d246f6b44ddb51da6c7375d545f/dpdk/lib/librte_stack/rte_stack.h(95),
                 from /tmp/FC28_K4.16.3_ICC19.0.0/x86_64-native-linuxapp-icc/3d927d246f6b44ddb51da6c7375d545f/dpdk/lib/librte_stack/rte_stack.c(16):
/tmp/FC28_K4.16.3_ICC19.0.0/x86_64-native-linuxapp-icc/3d927d246f6b44ddb51da6c7375d545f/dpdk/lib/librte_stack/rte_stack_lf_generic.h(153): error: identifier "rte_int128_t" is undefined
  				(rte_int128_t *)&list->head,
  				 ^

In file included from /tmp/FC28_K4.16.3_ICC19.0.0/x86_64-native-linuxapp-icc/3d927d246f6b44ddb51da6c7375d545f/dpdk/lib/librte_stack/rte_stack_lf.h(11),
                 from /tmp/FC28_K4.16.3_ICC19.0.0/x86_64-native-linuxapp-icc/3d927d246f6b44ddb51da6c7375d545f/dpdk/lib/librte_stack/rte_stack.h(95),
                 from /tmp/FC28_K4.16.3_ICC19.0.0/x86_64-native-linuxapp-icc/3d927d246f6b44ddb51da6c7375d545f/dpdk/lib/librte_stack/rte_stack.c(16):
/tmp/FC28_K4.16.3_ICC19.0.0/x86_64-native-linuxapp-icc/3d927d246f6b44ddb51da6c7375d545f/dpdk/lib/librte_stack/rte_stack_lf_generic.h(153): error: expected an expression
  				(rte_int128_t *)&list->head,
  				               ^

In file included from /tmp/FC28_K4.16.3_ICC19.0.0/x86_64-native-linuxapp-icc/3d927d246f6b44ddb51da6c7375d545f/dpdk/lib/librte_stack/rte_stack_lf.h(11),
                 from /tmp/FC28_K4.16.3_ICC19.0.0/x86_64-native-linuxapp-icc/3d927d246f6b44ddb51da6c7375d545f/dpdk/lib/librte_stack/rte_stack.h(95),
                 from /tmp/FC28_K4.16.3_ICC19.0.0/x86_64-native-linuxapp-icc/3d927d246f6b44ddb51da6c7375d545f/dpdk/lib/librte_stack/rte_stack.c(16):
/tmp/FC28_K4.16.3_ICC19.0.0/x86_64-native-linuxapp-icc/3d927d246f6b44ddb51da6c7375d545f/dpdk/lib/librte_stack/rte_stack_lf_generic.h(153): error: expression must have integral type
  				(rte_int128_t *)&list->head,
  				                 ^

In file included from /tmp/FC28_K4.16.3_ICC19.0.0/x86_64-native-linuxapp-icc/3d927d246f6b44ddb51da6c7375d545f/dpdk/lib/librte_stack/rte_stack_lf.h(11),
                 from /tmp/FC28_K4.16.3_ICC19.0.0/x86_64-native-linuxapp-icc/3d927d246f6b44ddb51da6c7375d545f/dpdk/lib/librte_stack/rte_stack.h(95),
                 from /tmp/FC28_K4.16.3_ICC19.0.0/x86_64-native-linuxapp-icc/3d927d246f6b44ddb51da6c7375d545f/dpdk/lib/librte_stack/rte_stack.c(16):
/tmp/FC28_K4.16.3_ICC19.0.0/x86_64-native-linuxapp-icc/3d927d246f6b44ddb51da6c7375d545f/dpdk/lib/librte_stack/rte_stack_lf_generic.h(154): error: expected an expression
  				(rte_int128_t *)&old_head,
  				               ^

In file included from /tmp/FC28_K4.16.3_ICC19.0.0/x86_64-native-linuxapp-icc/3d927d246f6b44ddb51da6c7375d545f/dpdk/lib/librte_stack/rte_stack_lf.h(11),
                 from /tmp/FC28_K4.16.3_ICC19.0.0/x86_64-native-linuxapp-icc/3d927d246f6b44ddb51da6c7375d545f/dpdk/lib/librte_stack/rte_stack.h(95),
                 from /tmp/FC28_K4.16.3_ICC19.0.0/x86_64-native-linuxapp-icc/3d927d246f6b44ddb51da6c7375d545f/dpdk/lib/librte_stack/rte_stack.c(16):
/tmp/FC28_K4.16.3_ICC19.0.0/x86_64-native-linuxapp-icc/3d927d246f6b44ddb51da6c7375d545f/dpdk/lib/librte_stack/rte_stack_lf_generic.h(154): error: expression must have integral type
  				(rte_int128_t *)&old_head,
  				                 ^

In file included from /tmp/FC28_K4.16.3_ICC19.0.0/x86_64-native-linuxapp-icc/3d927d246f6b44ddb51da6c7375d545f/dpdk/lib/librte_stack/rte_stack_lf.h(11),
                 from /tmp/FC28_K4.16.3_ICC19.0.0/x86_64-native-linuxapp-icc/3d927d246f6b44ddb51da6c7375d545f/dpdk/lib/librte_stack/rte_stack.h(95),
                 from /tmp/FC28_K4.16.3_ICC19.0.0/x86_64-native-linuxapp-icc/3d927d246f6b44ddb51da6c7375d545f/dpdk/lib/librte_stack/rte_stack.c(16):
/tmp/FC28_K4.16.3_ICC19.0.0/x86_64-native-linuxapp-icc/3d927d246f6b44ddb51da6c7375d545f/dpdk/lib/librte_stack/rte_stack_lf_generic.h(155): error: expected an expression
  				(rte_int128_t *)&new_head,
  				               ^

In file included from /tmp/FC28_K4.16.3_ICC19.0.0/x86_64-native-linuxapp-icc/3d927d246f6b44ddb51da6c7375d545f/dpdk/lib/librte_stack/rte_stack_lf.h(11),
                 from /tmp/FC28_K4.16.3_ICC19.0.0/x86_64-native-linuxapp-icc/3d927d246f6b44ddb51da6c7375d545f/dpdk/lib/librte_stack/rte_stack.h(95),
                 from /tmp/FC28_K4.16.3_ICC19.0.0/x86_64-native-linuxapp-icc/3d927d246f6b44ddb51da6c7375d545f/dpdk/lib/librte_stack/rte_stack.c(16):
/tmp/FC28_K4.16.3_ICC19.0.0/x86_64-native-linuxapp-icc/3d927d246f6b44ddb51da6c7375d545f/dpdk/lib/librte_stack/rte_stack_lf_generic.h(155): error: expression must have integral type
  				(rte_int128_t *)&new_head,
  				                 ^

compilation aborted for /tmp/FC28_K4.16.3_ICC19.0.0/x86_64-native-linuxapp-icc/3d927d246f6b44ddb51da6c7375d545f/dpdk/lib/librte_stack/rte_stack.c (code 2)
make[5]: *** [/tmp/FC28_K4.16.3_ICC19.0.0/x86_64-native-linuxapp-icc/3d927d246f6b44ddb51da6c7375d545f/dpdk/mk/internal/rte.compile-pre.mk:116: rte_stack.o] Error 2
--
  CC cmdline.o
  CC cmdline_cirbuf.o
In file included from /tmp/FC28_K4.16.3_ICC19.0.0/x86_64-native-linuxapp-icc/3d927d246f6b44ddb51da6c7375d545f/dpdk/lib/librte_stack/rte_stack_lf.h(11),
                 from /tmp/FC28_K4.16.3_ICC19.0.0/x86_64-native-linuxapp-icc/3d927d246f6b44ddb51da6c7375d545f/dpdk/lib/librte_stack/rte_stack.h(95),
                 from /tmp/FC28_K4.16.3_ICC19.0.0/x86_64-native-linuxapp-icc/3d927d246f6b44ddb51da6c7375d545f/dpdk/lib/librte_stack/rte_stack_std.c(5):
/tmp/FC28_K4.16.3_ICC19.0.0/x86_64-native-linuxapp-icc/3d927d246f6b44ddb51da6c7375d545f/dpdk/lib/librte_stack/rte_stack_lf_generic.h(68): warning #266: function "rte_atomic128_cmp_exchange" declared implicitly
  		success = rte_atomic128_cmp_exchange(
  		          ^

In file included from /tmp/FC28_K4.16.3_ICC19.0.0/x86_64-native-linuxapp-icc/3d927d246f6b44ddb51da6c7375d545f/dpdk/lib/librte_stack/rte_stack_lf.h(11),
                 from /tmp/FC28_K4.16.3_ICC19.0.0/x86_64-native-linuxapp-icc/3d927d246f6b44ddb51da6c7375d545f/dpdk/lib/librte_stack/rte_stack.h(95),
                 from /tmp/FC28_K4.16.3_ICC19.0.0/x86_64-native-linuxapp-icc/3d927d246f6b44ddb51da6c7375d545f/dpdk/lib/librte_stack/rte_stack_std.c(5):
/tmp/FC28_K4.16.3_ICC19.0.0/x86_64-native-linuxapp-icc/3d927d246f6b44ddb51da6c7375d545f/dpdk/lib/librte_stack/rte_stack_lf_generic.h(69): error: identifier "rte_int128_t" is undefined
  				(rte_int128_t *)&list->head,
  				 ^

In file included from /tmp/FC28_K4.16.3_ICC19.0.0/x86_64-native-linuxapp-icc/3d927d246f6b44ddb51da6c7375d545f/dpdk/lib/librte_stack/rte_stack_lf.h(11),
                 from /tmp/FC28_K4.16.3_ICC19.0.0/x86_64-native-linuxapp-icc/3d927d246f6b44ddb51da6c7375d545f/dpdk/lib/librte_stack/rte_stack.h(95),
                 from /tmp/FC28_K4.16.3_ICC19.0.0/x86_64-native-linuxapp-icc/3d927d246f6b44ddb51da6c7375d545f/dpdk/lib/librte_stack/rte_stack_std.c(5):
/tmp/FC28_K4.16.3_ICC19.0.0/x86_64-native-linuxapp-icc/3d927d246f6b44ddb51da6c7375d545f/dpdk/lib/librte_stack/rte_stack_lf_generic.h(69): error: expected an expression
  				(rte_int128_t *)&list->head,
  				               ^

In file included from /tmp/FC28_K4.16.3_ICC19.0.0/x86_64-native-linuxapp-icc/3d927d246f6b44ddb51da6c7375d545f/dpdk/lib/librte_stack/rte_stack_lf.h(11),
                 from /tmp/FC28_K4.16.3_ICC19.0.0/x86_64-native-linuxapp-icc/3d927d246f6b44ddb51da6c7375d545f/dpdk/lib/librte_stack/rte_stack.h(95),
                 from /tmp/FC28_K4.16.3_ICC19.0.0/x86_64-native-linuxapp-icc/3d927d246f6b44ddb51da6c7375d545f/dpdk/lib/librte_stack/rte_stack_std.c(5):
/tmp/FC28_K4.16.3_ICC19.0.0/x86_64-native-linuxapp-icc/3d927d246f6b44ddb51da6c7375d545f/dpdk/lib/librte_stack/rte_stack_lf_generic.h(69): error: expression must have integral type
  				(rte_int128_t *)&list->head,
  				                 ^

In file included from /tmp/FC28_K4.16.3_ICC19.0.0/x86_64-native-linuxapp-icc/3d927d246f6b44ddb51da6c7375d545f/dpdk/lib/librte_stack/rte_stack_lf.h(11),
                 from /tmp/FC28_K4.16.3_ICC19.0.0/x86_64-native-linuxapp-icc/3d927d246f6b44ddb51da6c7375d545f/dpdk/lib/librte_stack/rte_stack.h(95),
                 from /tmp/FC28_K4.16.3_ICC19.0.0/x86_64-native-linuxapp-icc/3d927d246f6b44ddb51da6c7375d545f/dpdk/lib/librte_stack/rte_stack_std.c(5):
/tmp/FC28_K4.16.3_ICC19.0.0/x86_64-native-linuxapp-icc/3d927d246f6b44ddb51da6c7375d545f/dpdk/lib/librte_stack/rte_stack_lf_generic.h(70): error: expected an expression
  				(rte_int128_t *)&old_head,
  				               ^

In file included from /tmp/FC28_K4.16.3_ICC19.0.0/x86_64-native-linuxapp-icc/3d927d246f6b44ddb51da6c7375d545f/dpdk/lib/librte_stack/rte_stack_lf.h(11),
                 from /tmp/FC28_K4.16.3_ICC19.0.0/x86_64-native-linuxapp-icc/3d927d246f6b44ddb51da6c7375d545f/dpdk/lib/librte_stack/rte_stack.h(95),
                 from /tmp/FC28_K4.16.3_ICC19.0.0/x86_64-native-linuxapp-icc/3d927d246f6b44ddb51da6c7375d545f/dpdk/lib/librte_stack/rte_stack_std.c(5):
/tmp/FC28_K4.16.3_ICC19.0.0/x86_64-native-linuxapp-icc/3d927d246f6b44ddb51da6c7375d545f/dpdk/lib/librte_stack/rte_stack_lf_generic.h(70): error: expression must have integral type
  				(rte_int128_t *)&old_head,
  				                 ^

In file included from /tmp/FC28_K4.16.3_ICC19.0.0/x86_64-native-linuxapp-icc/3d927d246f6b44ddb51da6c7375d545f/dpdk/lib/librte_stack/rte_stack_lf.h(11),
                 from /tmp/FC28_K4.16.3_ICC19.0.0/x86_64-native-linuxapp-icc/3d927d246f6b44ddb51da6c7375d545f/dpdk/lib/librte_stack/rte_stack.h(95),
                 from /tmp/FC28_K4.16.3_ICC19.0.0/x86_64-native-linuxapp-icc/3d927d246f6b44ddb51da6c7375d545f/dpdk/lib/librte_stack/rte_stack_std.c(5):
/tmp/FC28_K4.16.3_ICC19.0.0/x86_64-native-linuxapp-icc/3d927d246f6b44ddb51da6c7375d545f/dpdk/lib/librte_stack/rte_stack_lf_generic.h(71): error: expected an expression
  				(rte_int128_t *)&new_head,
  				               ^

In file included from /tmp/FC28_K4.16.3_ICC19.0.0/x86_64-native-linuxapp-icc/3d927d246f6b44ddb51da6c7375d545f/dpdk/lib/librte_stack/rte_stack_lf.h(11),
                 from /tmp/FC28_K4.16.3_ICC19.0.0/x86_64-native-linuxapp-icc/3d927d246f6b44ddb51da6c7375d545f/dpdk/lib/librte_stack/rte_stack.h(95),
                 from /tmp/FC28_K4.16.3_ICC19.0.0/x86_64-native-linuxapp-icc/3d927d246f6b44ddb51da6c7375d545f/dpdk/lib/librte_stack/rte_stack_std.c(5):
/tmp/FC28_K4.16.3_ICC19.0.0/x86_64-native-linuxapp-icc/3d927d246f6b44ddb51da6c7375d545f/dpdk/lib/librte_stack/rte_stack_lf_generic.h(71): error: expression must have integral type
  				(rte_int128_t *)&new_head,
  				                 ^

In file included from /tmp/FC28_K4.16.3_ICC19.0.0/x86_64-native-linuxapp-icc/3d927d246f6b44ddb51da6c7375d545f/dpdk/lib/librte_stack/rte_stack_lf.h(11),
                 from /tmp/FC28_K4.16.3_ICC19.0.0/x86_64-native-linuxapp-icc/3d927d246f6b44ddb51da6c7375d545f/dpdk/lib/librte_stack/rte_stack.h(95),
                 from /tmp/FC28_K4.16.3_ICC19.0.0/x86_64-native-linuxapp-icc/3d927d246f6b44ddb51da6c7375d545f/dpdk/lib/librte_stack/rte_stack_std.c(5):
/tmp/FC28_K4.16.3_ICC19.0.0/x86_64-native-linuxapp-icc/3d927d246f6b44ddb51da6c7375d545f/dpdk/lib/librte_stack/rte_stack_lf_generic.h(152): warning #266: function "rte_atomic128_cmp_exchange" declared implicitly
  		success = rte_atomic128_cmp_exchange(
  		          ^

In file included from /tmp/FC28_K4.16.3_ICC19.0.0/x86_64-native-linuxapp-icc/3d927d246f6b44ddb51da6c7375d545f/dpdk/lib/librte_stack/rte_stack_lf.h(11),
                 from /tmp/FC28_K4.16.3_ICC19.0.0/x86_64-native-linuxapp-icc/3d927d246f6b44ddb51da6c7375d545f/dpdk/lib/librte_stack/rte_stack.h(95),
                 from /tmp/FC28_K4.16.3_ICC19.0.0/x86_64-native-linuxapp-icc/3d927d246f6b44ddb51da6c7375d545f/dpdk/lib/librte_stack/rte_stack_std.c(5):
/tmp/FC28_K4.16.3_ICC19.0.0/x86_64-native-linuxapp-icc/3d927d246f6b44ddb51da6c7375d545f/dpdk/lib/librte_stack/rte_stack_lf_generic.h(153): error: identifier "rte_int128_t" is undefined
  				(rte_int128_t *)&list->head,
  				 ^

In file included from /tmp/FC28_K4.16.3_ICC19.0.0/x86_64-native-linuxapp-icc/3d927d246f6b44ddb51da6c7375d545f/dpdk/lib/librte_stack/rte_stack_lf.h(11),
                 from /tmp/FC28_K4.16.3_ICC19.0.0/x86_64-native-linuxapp-icc/3d927d246f6b44ddb51da6c7375d545f/dpdk/lib/librte_stack/rte_stack.h(95),
                 from /tmp/FC28_K4.16.3_ICC19.0.0/x86_64-native-linuxapp-icc/3d927d246f6b44ddb51da6c7375d545f/dpdk/lib/librte_stack/rte_stack_std.c(5):
/tmp/FC28_K4.16.3_ICC19.0.0/x86_64-native-linuxapp-icc/3d927d246f6b44ddb51da6c7375d545f/dpdk/lib/librte_stack/rte_stack_lf_generic.h(153): error: expected an expression
  				(rte_int128_t *)&list->head,
  				               ^

In file included from /tmp/FC28_K4.16.3_ICC19.0.0/x86_64-native-linuxapp-icc/3d927d246f6b44ddb51da6c7375d545f/dpdk/lib/librte_stack/rte_stack_lf.h(11),
                 from /tmp/FC28_K4.16.3_ICC19.0.0/x86_64-native-linuxapp-icc/3d927d246f6b44ddb51da6c7375d545f/dpdk/lib/librte_stack/rte_stack.h(95),
                 from /tmp/FC28_K4.16.3_ICC19.0.0/x86_64-native-linuxapp-icc/3d927d246f6b44ddb51da6c7375d545f/dpdk/lib/librte_stack/rte_stack_std.c(5):
/tmp/FC28_K4.16.3_ICC19.0.0/x86_64-native-linuxapp-icc/3d927d246f6b44ddb51da6c7375d545f/dpdk/lib/librte_stack/rte_stack_lf_generic.h(153): error: expression must have integral type
  				(rte_int128_t *)&list->head,
  				                 ^

In file included from /tmp/FC28_K4.16.3_ICC19.0.0/x86_64-native-linuxapp-icc/3d927d246f6b44ddb51da6c7375d545f/dpdk/lib/librte_stack/rte_stack_lf.h(11),
                 from /tmp/FC28_K4.16.3_ICC19.0.0/x86_64-native-linuxapp-icc/3d927d246f6b44ddb51da6c7375d545f/dpdk/lib/librte_stack/rte_stack.h(95),
                 from /tmp/FC28_K4.16.3_ICC19.0.0/x86_64-native-linuxapp-icc/3d927d246f6b44ddb51da6c7375d545f/dpdk/lib/librte_stack/rte_stack_std.c(5):
/tmp/FC28_K4.16.3_ICC19.0.0/x86_64-native-linuxapp-icc/3d927d246f6b44ddb51da6c7375d545f/dpdk/lib/librte_stack/rte_stack_lf_generic.h(154): error: expected an expression
  				(rte_int128_t *)&old_head,
  				               ^

In file included from /tmp/FC28_K4.16.3_ICC19.0.0/x86_64-native-linuxapp-icc/3d927d246f6b44ddb51da6c7375d545f/dpdk/lib/librte_stack/rte_stack_lf.h(11),
                 from /tmp/FC28_K4.16.3_ICC19.0.0/x86_64-native-linuxapp-icc/3d927d246f6b44ddb51da6c7375d545f/dpdk/lib/librte_stack/rte_stack.h(95),
                 from /tmp/FC28_K4.16.3_ICC19.0.0/x86_64-native-linuxapp-icc/3d927d246f6b44ddb51da6c7375d545f/dpdk/lib/librte_stack/rte_stack_std.c(5):
/tmp/FC28_K4.16.3_ICC19.0.0/x86_64-native-linuxapp-icc/3d927d246f6b44ddb51da6c7375d545f/dpdk/lib/librte_stack/rte_stack_lf_generic.h(154): error: expression must have integral type
  				(rte_int128_t *)&old_head,
  				                 ^

In file included from /tmp/FC28_K4.16.3_ICC19.0.0/x86_64-native-linuxapp-icc/3d927d246f6b44ddb51da6c7375d545f/dpdk/lib/librte_stack/rte_stack_lf.h(11),
                 from /tmp/FC28_K4.16.3_ICC19.0.0/x86_64-native-linuxapp-icc/3d927d246f6b44ddb51da6c7375d545f/dpdk/lib/librte_stack/rte_stack.h(95),
                 from /tmp/FC28_K4.16.3_ICC19.0.0/x86_64-native-linuxapp-icc/3d927d246f6b44ddb51da6c7375d545f/dpdk/lib/librte_stack/rte_stack_std.c(5):
/tmp/FC28_K4.16.3_ICC19.0.0/x86_64-native-linuxapp-icc/3d927d246f6b44ddb51da6c7375d545f/dpdk/lib/librte_stack/rte_stack_lf_generic.h(155): error: expected an expression
  				(rte_int128_t *)&new_head,
  				               ^

In file included from /tmp/FC28_K4.16.3_ICC19.0.0/x86_64-native-linuxapp-icc/3d927d246f6b44ddb51da6c7375d545f/dpdk/lib/librte_stack/rte_stack_lf.h(11),
                 from /tmp/FC28_K4.16.3_ICC19.0.0/x86_64-native-linuxapp-icc/3d927d246f6b44ddb51da6c7375d545f/dpdk/lib/librte_stack/rte_stack.h(95),
                 from /tmp/FC28_K4.16.3_ICC19.0.0/x86_64-native-linuxapp-icc/3d927d246f6b44ddb51da6c7375d545f/dpdk/lib/librte_stack/rte_stack_std.c(5):
/tmp/FC28_K4.16.3_ICC19.0.0/x86_64-native-linuxapp-icc/3d927d246f6b44ddb51da6c7375d545f/dpdk/lib/librte_stack/rte_stack_lf_generic.h(155): error: expression must have integral type
  				(rte_int128_t *)&new_head,
  				                 ^

compilation aborted for /tmp/FC28_K4.16.3_ICC19.0.0/x86_64-native-linuxapp-icc/3d927d246f6b44ddb51da6c7375d545f/dpdk/lib/librte_stack/rte_stack_std.c (code 2)
make[5]: *** [/tmp/FC28_K4.16.3_ICC19.0.0/x86_64-native-linuxapp-icc/3d927d246f6b44ddb51da6c7375d545f/dpdk/mk/internal/rte.compile-pre.mk:116: rte_stack_std.o] Error 2

*Failed Build #23:
OS: SUSE12
Target: x86_64-native-linuxapp-gcc
  AR librte_ring.a
In file included from /tmp/SUSE12_K3.7.10_GCC4.7.2/x86_64-native-linuxapp-gcc/3d927d246f6b44ddb51da6c7375d545f/dpdk/lib/librte_stack/rte_stack_lf.h:11:0,
                 from /tmp/SUSE12_K3.7.10_GCC4.7.2/x86_64-native-linuxapp-gcc/3d927d246f6b44ddb51da6c7375d545f/dpdk/lib/librte_stack/rte_stack.h:95,
                 from /tmp/SUSE12_K3.7.10_GCC4.7.2/x86_64-native-linuxapp-gcc/3d927d246f6b44ddb51da6c7375d545f/dpdk/lib/librte_stack/rte_stack.c:16:
/tmp/SUSE12_K3.7.10_GCC4.7.2/x86_64-native-linuxapp-gcc/3d927d246f6b44ddb51da6c7375d545f/dpdk/lib/librte_stack/rte_stack_lf_generic.h: In function ‘__rte_stack_lf_push_elems’:
/tmp/SUSE12_K3.7.10_GCC4.7.2/x86_64-native-linuxapp-gcc/3d927d246f6b44ddb51da6c7375d545f/dpdk/lib/librte_stack/rte_stack_lf_generic.h:68:13: warning: implicit declaration of function ‘rte_atomic128_cmp_exchange’; did you mean ‘rte_atomic32_exchange’? [-Wimplicit-function-declaration]
   success = rte_atomic128_cmp_exchange(
             ^~~~~~~~~~~~~~~~~~~~~~~~~~
             rte_atomic32_exchange
/tmp/SUSE12_K3.7.10_GCC4.7.2/x86_64-native-linuxapp-gcc/3d927d246f6b44ddb51da6c7375d545f/dpdk/lib/librte_stack/rte_stack_lf_generic.h:68:13: warning: nested extern declaration of ‘rte_atomic128_cmp_exchange’ [-Wnested-externs]
/tmp/SUSE12_K3.7.10_GCC4.7.2/x86_64-native-linuxapp-gcc/3d927d246f6b44ddb51da6c7375d545f/dpdk/lib/librte_stack/rte_stack_lf_generic.h:69:6: error: ‘rte_int128_t’ undeclared (first use in this function); did you mean ‘__int128_t’?
     (rte_int128_t *)&list->head,
      ^~~~~~~~~~~~
      __int128_t
/tmp/SUSE12_K3.7.10_GCC4.7.2/x86_64-native-linuxapp-gcc/3d927d246f6b44ddb51da6c7375d545f/dpdk/lib/librte_stack/rte_stack_lf_generic.h:69:6: note: each undeclared identifier is reported only once for each function it appears in
/tmp/SUSE12_K3.7.10_GCC4.7.2/x86_64-native-linuxapp-gcc/3d927d246f6b44ddb51da6c7375d545f/dpdk/lib/librte_stack/rte_stack_lf_generic.h:69:20: error: expected expression before ‘)’ token
     (rte_int128_t *)&list->head,
                    ^
/tmp/SUSE12_K3.7.10_GCC4.7.2/x86_64-native-linuxapp-gcc/3d927d246f6b44ddb51da6c7375d545f/dpdk/lib/librte_stack/rte_stack_lf_generic.h:50:28: warning: variable ‘new_head’ set but not used [-Wunused-but-set-variable]
   struct rte_stack_lf_head new_head;
                            ^~~~~~~~
/tmp/SUSE12_K3.7.10_GCC4.7.2/x86_64-native-linuxapp-gcc/3d927d246f6b44ddb51da6c7375d545f/dpdk/lib/librte_stack/rte_stack_lf_generic.h: In function ‘__rte_stack_lf_pop_elems’:
/tmp/SUSE12_K3.7.10_GCC4.7.2/x86_64-native-linuxapp-gcc/3d927d246f6b44ddb51da6c7375d545f/dpdk/lib/librte_stack/rte_stack_lf_generic.h:153:6: error: ‘rte_int128_t’ undeclared (first use in this function); did you mean ‘__int128_t’?
     (rte_int128_t *)&list->head,
      ^~~~~~~~~~~~
      __int128_t
/tmp/SUSE12_K3.7.10_GCC4.7.2/x86_64-native-linuxapp-gcc/3d927d246f6b44ddb51da6c7375d545f/dpdk/lib/librte_stack/rte_stack_lf_generic.h:153:20: error: expected expression before ‘)’ token
     (rte_int128_t *)&list->head,
                    ^
/tmp/SUSE12_K3.7.10_GCC4.7.2/x86_64-native-linuxapp-gcc/3d927d246f6b44ddb51da6c7375d545f/dpdk/lib/librte_stack/rte_stack_lf_generic.h:114:28: warning: variable ‘new_head’ set but not used [-Wunused-but-set-variable]
   struct rte_stack_lf_head new_head;
                            ^~~~~~~~
  INSTALL-LIB librte_metrics.a
/tmp/SUSE12_K3.7.10_GCC4.7.2/x86_64-native-linuxapp-gcc/3d927d246f6b44ddb51da6c7375d545f/dpdk/mk/internal/rte.compile-pre.mk:114: recipe for target 'rte_stack.o' failed
make[5]: *** [rte_stack.o] Error 1
/tmp/SUSE12_K3.7.10_GCC4.7.2/x86_64-native-linuxapp-gcc/3d927d246f6b44ddb51da6c7375d545f/dpdk/mk/rte.subdir.mk:35: recipe for target 'librte_stack' failed
make[4]: *** [librte_stack] Error 2
make[4]: *** Waiting for unfinished jobs....
  INSTALL-LIB librte_ring.a
  AR librte_pci.a
  SYMLINK-FILE include/cmdline_rdline.h
--
  CC cmdline_parse_portlist.o
  AR librte_cmdline.a
  INSTALL-LIB librte_cmdline.a
  AR librte_acl.a
  INSTALL-LIB librte_acl.a
/tmp/SUSE12_K3.7.10_GCC4.7.2/x86_64-native-linuxapp-gcc/3d927d246f6b44ddb51da6c7375d545f/dpdk/mk/rte.sdkbuild.mk:46: recipe for target 'lib' failed
make[3]: *** [lib] Error 2
/tmp/SUSE12_K3.7.10_GCC4.7.2/x86_64-native-linuxapp-gcc/3d927d246f6b44ddb51da6c7375d545f/dpdk/mk/rte.sdkroot.mk:98: recipe for target 'all' failed
make[2]: *** [all] Error 2
/tmp/SUSE12_K3.7.10_GCC4.7.2/x86_64-native-linuxapp-gcc/3d927d246f6b44ddb51da6c7375d545f/dpdk/mk/rte.sdkinstall.mk:60: recipe for target 'pre_install' failed
make[1]: *** [pre_install] Error 2
/tmp/SUSE12_K3.7.10_GCC4.7.2/x86_64-native-linuxapp-gcc/3d927d246f6b44ddb51da6c7375d545f/dpdk/mk/rte.sdkroot.mk:77: recipe for target 'install' failed
make: *** [install] Error 2

*Failed Build #24:
OS: CENTOS76
Target: x86_64-native-linuxapp-gcc
  INSTALL-LIB librte_metrics.a
In file included from /tmp/CENTOS76_K3.10.0_GCC4.8.5/x86_64-native-linuxapp-gcc/3d927d246f6b44ddb51da6c7375d545f/dpdk/lib/librte_stack/rte_stack_lf.h:11:0,
                 from /tmp/CENTOS76_K3.10.0_GCC4.8.5/x86_64-native-linuxapp-gcc/3d927d246f6b44ddb51da6c7375d545f/dpdk/lib/librte_stack/rte_stack.h:95,
                 from /tmp/CENTOS76_K3.10.0_GCC4.8.5/x86_64-native-linuxapp-gcc/3d927d246f6b44ddb51da6c7375d545f/dpdk/lib/librte_stack/rte_stack.c:16:
/tmp/CENTOS76_K3.10.0_GCC4.8.5/x86_64-native-linuxapp-gcc/3d927d246f6b44ddb51da6c7375d545f/dpdk/lib/librte_stack/rte_stack_lf_generic.h: In function ‘__rte_stack_lf_push_elems’:
/tmp/CENTOS76_K3.10.0_GCC4.8.5/x86_64-native-linuxapp-gcc/3d927d246f6b44ddb51da6c7375d545f/dpdk/lib/librte_stack/rte_stack_lf_generic.h:68:3: warning: implicit declaration of function ‘rte_atomic128_cmp_exchange’ [-Wimplicit-function-declaration]
   success = rte_atomic128_cmp_exchange(
   ^
/tmp/CENTOS76_K3.10.0_GCC4.8.5/x86_64-native-linuxapp-gcc/3d927d246f6b44ddb51da6c7375d545f/dpdk/lib/librte_stack/rte_stack_lf_generic.h:68:3: warning: nested extern declaration of ‘rte_atomic128_cmp_exchange’ [-Wnested-externs]
/tmp/CENTOS76_K3.10.0_GCC4.8.5/x86_64-native-linuxapp-gcc/3d927d246f6b44ddb51da6c7375d545f/dpdk/lib/librte_stack/rte_stack_lf_generic.h:69:6: error: ‘rte_int128_t’ undeclared (first use in this function)
     (rte_int128_t *)&list->head,
      ^
/tmp/CENTOS76_K3.10.0_GCC4.8.5/x86_64-native-linuxapp-gcc/3d927d246f6b44ddb51da6c7375d545f/dpdk/lib/librte_stack/rte_stack_lf_generic.h:69:6: note: each undeclared identifier is reported only once for each function it appears in
/tmp/CENTOS76_K3.10.0_GCC4.8.5/x86_64-native-linuxapp-gcc/3d927d246f6b44ddb51da6c7375d545f/dpdk/lib/librte_stack/rte_stack_lf_generic.h:69:20: error: expected expression before ‘)’ token
     (rte_int128_t *)&list->head,
                    ^
/tmp/CENTOS76_K3.10.0_GCC4.8.5/x86_64-native-linuxapp-gcc/3d927d246f6b44ddb51da6c7375d545f/dpdk/lib/librte_stack/rte_stack_lf_generic.h:50:28: warning: variable ‘new_head’ set but not used [-Wunused-but-set-variable]
   struct rte_stack_lf_head new_head;
                            ^
/tmp/CENTOS76_K3.10.0_GCC4.8.5/x86_64-native-linuxapp-gcc/3d927d246f6b44ddb51da6c7375d545f/dpdk/lib/librte_stack/rte_stack_lf_generic.h: In function ‘__rte_stack_lf_pop_elems’:
/tmp/CENTOS76_K3.10.0_GCC4.8.5/x86_64-native-linuxapp-gcc/3d927d246f6b44ddb51da6c7375d545f/dpdk/lib/librte_stack/rte_stack_lf_generic.h:153:6: error: ‘rte_int128_t’ undeclared (first use in this function)
     (rte_int128_t *)&list->head,
      ^
/tmp/CENTOS76_K3.10.0_GCC4.8.5/x86_64-native-linuxapp-gcc/3d927d246f6b44ddb51da6c7375d545f/dpdk/lib/librte_stack/rte_stack_lf_generic.h:153:20: error: expected expression before ‘)’ token
     (rte_int128_t *)&list->head,
                    ^
/tmp/CENTOS76_K3.10.0_GCC4.8.5/x86_64-native-linuxapp-gcc/3d927d246f6b44ddb51da6c7375d545f/dpdk/lib/librte_stack/rte_stack_lf_generic.h:114:28: warning: variable ‘new_head’ set but not used [-Wunused-but-set-variable]
   struct rte_stack_lf_head new_head;
                            ^
  CC acl_run_scalar.o
make[5]: *** [rte_stack.o] Error 1
make[4]: *** [librte_stack] Error 2

DPDK STV team


More information about the test-report mailing list