[dpdk-test-report] |FAILURE| pw52972[v4] kni: add IOVA va support for kni

sys_stv at intel.com sys_stv at intel.com
Mon Apr 22 07:04:37 CEST 2019


Test-Label: Intel-compilation
Test-Status: FAILURE
http://dpdk.org/patch/52972

_Compilation issues_

Submitter: Kiran Kumar Kokkilagadda <kirankumark at marvell.com>
Date: 2019-04-22 04:39:12
Reply_mail: 20190422043912.18060-1-kirankumark at marvell.com
DPDK git baseline: Repo:dpdk-next-net, CommitID: b1231d9574aa6fd4413a7b069a4c146b74f97914

Build Summary: 17 Builds Done, 16 Successful, 1 Failures

Test environment and configuration as below:

OS: SUSE15
	Kernel Version: 4.12.14-lp150.11-default
	CPU info: Intel(R) Xeon(R) CPU E5-2699 v3 @ 2.30GHz
	GCC Version: gcc (SUSE Linux) 7.3.1 20180323 [gcc-7-branch revision 258812]
	Clang Version: 5.0.1 (tags/RELEASE_501/final 312548)
	x86_64-native-linuxapp-gcc

OS: SUSE12
	Kernel Version: 4.4.73-5-default
	CPU info: Intel(R) Xeon(R) CPU E5-2699 v4 @ 2.20GHz
	GCC Version: gcc (SUSE Linux) 7.1.1 20170607 [gcc-7-branch revision 248970]
	Clang Version: 3.8.0 (tags/RELEASE_380/final 262553)
	x86_64-native-linuxapp-gcc

OS: UBT164-32
	Kernel Version: 4.4.0-131-generic
	CPU info: Intel(R) Xeon(R) CPU E5-2699 v3 @ 2.30GHz
	GCC Version: gcc (Ubuntu 5.4.0-6ubuntu1~16.04.10) 5.4.0 20160609
	Clang Version: NA
	i686-native-linuxapp-gcc

OS: FreeBSD12.0
	Kernel Version: 12.0-RC3
	CPU info: Intel(R) Xeon(R) CPU E5-2699 v3 @ 2.30GHz (2294.74-MHz K8-class CPU)
	GCC Version: gcc (FreeBSD Ports Collection) 7.3.0
	Clang Version: 6.0.1 (tags/RELEASE_601/final 335540) (based on LLVM 6.0.1)
	x86_64-native-bsdapp-gcc
	x86_64-native-bsdapp-clang

OS: UBT1804
	Kernel Version: 4.15.0-29-generic
	CPU info: Intel(R) Xeon(R) Platinum 8180M CPU @ 2.50GHz
	GCC Version: gcc (Ubuntu 7.3.0-27ubuntu1~18.04) 7.3.0
	Clang Version: 6.0.0-1ubuntu2 (tags/RELEASE_600/final)
	x86_64-native-linuxapp-clang
	x86_64-native-linuxapp-icc
	x86_64-native-linuxapp-gcc

OS: UBT1810
	Kernel Version: 4.18.0-10-generic
	CPU info: Intel(R) Xeon(R) CPU E5-2699 v3 @ 2.30GHz
	GCC Version: gcc (Ubuntu 8.2.0-7ubuntu1) 8.2.0
	Clang Version: 7.0.0-3 (tags/RELEASE_700/final)
	x86_64-native-linuxapp-gcc

OS: CENTOS75
	Kernel Version: 3.10.0-957.5.1.el7.x86_64
	CPU info: Intel(R) Xeon(R) CPU E5-2699 v4 @ 2.20GHz
	GCC Version: gcc (GCC) 4.8.5 20150623 (Red Hat 4.8.5-36)
	Clang Version: 3.4.2 (tags/RELEASE_34/dot2-final)
	x86_64-native-linuxapp-gcc

OS: UBT164-64
	Kernel Version: 4.4.0-47-generic
	CPU info: Intel(R) Xeon(R) CPU E5-2699 v3 @ 2.30GHz
	GCC Version: gcc (Ubuntu 5.4.0-6ubuntu1~16.04.10) 5.4.0 20160609
	Clang Version: 3.8.0-2ubuntu4 (tags/RELEASE_380/final)
	x86_64-native-linuxapp-gcc

OS: CENTOS76
	Kernel Version: 3.10.0-957.5.1.el7.x86_64
	CPU info: Intel(R) Xeon(R) CPU E5-2699 v4 @ 2.20GHz
	GCC Version: gcc (GCC) 4.8.5 20150623 (Red Hat 4.8.5-36)
	Clang Version: 3.4.2 (tags/RELEASE_34/dot2-final)
	x86_64-native-linuxapp-gcc

OS: RHEL76
	Kernel Version: 3.10.0-957.el7.x86_64
	CPU info: Intel(R) Xeon(R) CPU E5-2699 v4 @ 2.20GHz
	GCC Version: gcc (GCC) 4.8.5 20150623 (Red Hat 4.8.5-36)
	Clang Version: NA
	x86_64-native-linuxapp-gcc

OS: FC29
	Kernel Version: 4.18.16-300.fc29.x86_64
	CPU info: Intel(R) Xeon(R) CPU E5-2699 v4 @ 2.20GHz
	GCC Version: gcc (GCC) 8.2.1 20181215 (Red Hat 8.2.1-6)
	Clang Version: 7.0.1 (Fedora 7.0.1-6.fc29)
	x86_64-native-linuxapp-gcc
	x86_64-native-linuxapp-clang
	x86_64-native-linuxapp-icc

OS: RHEL75
	Kernel Version: 3.10.0-862.el7.x86_64
	CPU info: Intel(R) Xeon(R) CPU E5-2699 v4 @ 2.20GHz
	GCC Version: gcc (GCC) 4.8.5 20150623 (Red Hat 4.8.5-28)
	Clang Version: NA
	x86_64-native-linuxapp-gcc

*Failed Build #1:
OS: UBT164-32
Target: i686-native-linuxapp-gcc
  CC rte_hypervisor.o
  CC rte_spinlock.o
  CC rte_cycles.o
  AR librte_eal.a
  INSTALL-LIB librte_eal.a
make[7]: warning:  Clock skew detected.  Your build may be incomplete.
== Build lib/librte_pci
== Build lib/librte_metrics
== Build lib/librte_acl
== Build lib/librte_meter
== Build lib/librte_jobstats
--
  CC qbman/qbman_debug.o
  CC ifpga_bus.o
  SYMLINK-FILE include/rte_bus_pci.h
  SYMLINK-FILE include/rte_bus_vmbus.h
/tmp/UBT164-32_K4.4.0_GCC5.4.0/i686-native-linuxapp-gcc/d82eade6d0eb4b02b56eabaafe41d185/dpdk/i686-native-linuxapp-gcc/build/kernel/linux/kni/kni_net.c: In function ‘iova2kva’:
/tmp/UBT164-32_K4.4.0_GCC5.4.0/i686-native-linuxapp-gcc/d82eade6d0eb4b02b56eabaafe41d185/dpdk/i686-native-linuxapp-gcc/build/kernel/linux/kni/kni_net.c:43:5: error: cast from pointer to integer of different size [-Werror=pointer-to-int-cast]
     (dma_addr_t)pa));
     ^
  SYMLINK-FILE include/rte_vmbus_reg.h
  CC linux/pci.o
  CC mc/dpmng.o
--
  CC linux/vmbus_bus.o
  CC mc/dpbp.o
  CC ifpga_common.o
  CC linux/vmbus_uio.o
  CC vdev_params.o
cc1: all warnings being treated as errors
/usr/src/linux-headers-4.4.0-131-generic/scripts/Makefile.build:277: recipe for target '/tmp/UBT164-32_K4.4.0_GCC5.4.0/i686-native-linuxapp-gcc/d82eade6d0eb4b02b56eabaafe41d185/dpdk/i686-native-linuxapp-gcc/build/kernel/linux/kni/kni_net.o' failed
make[9]: *** [/tmp/UBT164-32_K4.4.0_GCC5.4.0/i686-native-linuxapp-gcc/d82eade6d0eb4b02b56eabaafe41d185/dpdk/i686-native-linuxapp-gcc/build/kernel/linux/kni/kni_net.o] Error 1
make[9]: *** Waiting for unfinished jobs....
  CC vmbus_common.o
  CC mc/dpio.o
  AR librte_bus_vdev.a
  INSTALL-LIB librte_bus_vdev.a
  CC mc/mc_sys.o
/usr/src/linux-headers-4.4.0-131-generic/Makefile:1437: recipe for target '_module_/tmp/UBT164-32_K4.4.0_GCC5.4.0/i686-native-linuxapp-gcc/d82eade6d0eb4b02b56eabaafe41d185/dpdk/i686-native-linuxapp-gcc/build/kernel/linux/kni' failed
make[8]: *** [_module_/tmp/UBT164-32_K4.4.0_GCC5.4.0/i686-native-linuxapp-gcc/d82eade6d0eb4b02b56eabaafe41d185/dpdk/i686-native-linuxapp-gcc/build/kernel/linux/kni] Error 2
Makefile:152: recipe for target 'sub-make' failed
make[7]: *** [sub-make] Error 2
/tmp/UBT164-32_K4.4.0_GCC5.4.0/i686-native-linuxapp-gcc/d82eade6d0eb4b02b56eabaafe41d185/dpdk/mk/rte.module.mk:50: recipe for target 'rte_kni.ko' failed
make[6]: *** [rte_kni.ko] Error 2
/tmp/UBT164-32_K4.4.0_GCC5.4.0/i686-native-linuxapp-gcc/d82eade6d0eb4b02b56eabaafe41d185/dpdk/mk/rte.subdir.mk:35: recipe for target 'kni' failed
make[5]: *** [kni] Error 2
make[5]: *** Waiting for unfinished jobs....
  CC mc/dpcon.o
  CC vmbus_channel.o
  AR librte_bus_ifpga.a
--
  CC portal/dpaa2_hw_dpbp.o.pmd.o
  LD portal/dpaa2_hw_dpbp.o
  LD [M]  /tmp/UBT164-32_K4.4.0_GCC5.4.0/i686-native-linuxapp-gcc/d82eade6d0eb4b02b56eabaafe41d185/dpdk/i686-native-linuxapp-gcc/build/kernel/linux/igb_uio/igb_uio.ko
  CC base/fman/of.o
INSTALL-MODULE igb_uio.ko
/tmp/UBT164-32_K4.4.0_GCC5.4.0/i686-native-linuxapp-gcc/d82eade6d0eb4b02b56eabaafe41d185/dpdk/mk/rte.subdir.mk:35: recipe for target 'linux' failed
make[4]: *** [linux] Error 2
/tmp/UBT164-32_K4.4.0_GCC5.4.0/i686-native-linuxapp-gcc/d82eade6d0eb4b02b56eabaafe41d185/dpdk/mk/rte.sdkbuild.mk:46: recipe for target 'kernel' failed
make[3]: *** [kernel] Error 2
make[3]: *** Waiting for unfinished jobs....
  CC base/fman/netcfg_layer.o
  CC base/qbman/process.o
  AR librte_bus_pci.a
--
  CC ifpga_api.o
  SYMLINK-FILE include/rte_pmd_dpaa2_qdma.h
  SYMLINK-FILE include/rte_pmd_dpaa2_cmdif.h
  CC dpaa2_qdma.o
  CC dpaa2_cmdif.o
  CC ifpga_fme_error.o
  PMDINFO dpaa2_cmdif.o.pmd.c
  CC dpaa2_cmdif.o.pmd.o
  LD dpaa2_cmdif.o
  AR librte_pmd_dpaa2_cmdif.a
  PMDINFO skeleton_rawdev.o.pmd.c
  INSTALL-LIB librte_pmd_dpaa2_cmdif.a
  CC skeleton_rawdev.o.pmd.o
  CC ifpga_port.o
  CC ifpga_port_error.o
  LD skeleton_rawdev.o
  CC opae_hw_api.o
  CC opae_ifpga_hw_api.o
  CC opae_debug.o
  AR librte_pmd_skeleton_rawdev.a
--
  PMDINFO ifpga_rawdev.o.pmd.c
  CC ifpga_rawdev.o.pmd.o
  LD ifpga_rawdev.o
  AR librte_pmd_ifpga_rawdev.a
  INSTALL-LIB librte_pmd_ifpga_rawdev.a
/tmp/UBT164-32_K4.4.0_GCC5.4.0/i686-native-linuxapp-gcc/d82eade6d0eb4b02b56eabaafe41d185/dpdk/mk/rte.sdkroot.mk:98: recipe for target 'all' failed
make[2]: *** [all] Error 2
/tmp/UBT164-32_K4.4.0_GCC5.4.0/i686-native-linuxapp-gcc/d82eade6d0eb4b02b56eabaafe41d185/dpdk/mk/rte.sdkinstall.mk:60: recipe for target 'pre_install' failed
make[1]: *** [pre_install] Error 2
/tmp/UBT164-32_K4.4.0_GCC5.4.0/i686-native-linuxapp-gcc/d82eade6d0eb4b02b56eabaafe41d185/dpdk/mk/rte.sdkroot.mk:77: recipe for target 'install' failed
make: *** [install] Error 2

DPDK STV team


More information about the test-report mailing list