[dpdk-test-report] |FAILURE| pw57377[v5, 2/4] examples/multi_process/client_server_mp - fix crash in mp_client with sparse ports

sys_stv at intel.com sys_stv at intel.com
Fri Aug 2 05:41:57 CEST 2019


Test-Label: Intel-compilation
Test-Status: FAILURE
http://dpdk.org/patch/57377

_Compilation issues_

Submitter: Stephen Hemminger <stephen at networkplumber.org>
Date: 2019-08-02 02:58:24
Reply_mail: 20190802025826.1174-3-stephen at networkplumber.org
DPDK git baseline: Repo:dpdk, CommitID: 0bbc72e599ed8b2593efccfae5692f1c6a15d2e8

Makefile build Summary: 22 Builds Done, 22 Successful, 0 Failures

meson build Summary: 8 Builds Done, 2 Successful, 6 Failures



Test environment and configuration as below:


** Makefile build **


OS: RHEL76-64
	Kernel Version: 3.10.0-957.el7.x86_64
	CPU info: Intel(R) Xeon(R) CPU E5-2699 v4 @ 2.20GHz
	GCC Version: gcc (GCC) 4.8.5 20150623 (Red Hat 4.8.5-36)
	Clang Version: NA
	x86_64-native-linuxapp-gcc


OS: CENTOS76-64
	Kernel Version: 3.10.0-957.10.1.el7.x86_64
	CPU info: Intel(R) Xeon(R) CPU E5-2699 v4 @ 2.20GHz
	GCC Version: gcc (GCC) 4.8.5 20150623 (Red Hat 4.8.5-36)
	Clang Version: 3.4.2 (tags/RELEASE_34/dot2-final)
	x86_64-native-linuxapp-gcc


OS: UB1804-64
	Kernel Version: 4.15.0-20-generic
	CPU info: Intel(R) Xeon(R) CPU E5-2699 v3 @ 2.30GHz
	GCC Version: gcc (Ubuntu 7.3.0-27ubuntu1~18.04) 7.3.0
	Clang Version: 6.0.0-1ubuntu2 (tags/RELEASE_600/final)
	x86_64-native-linuxapp-icc
	x86_64-native-linuxapp-clang
	x86_64-native-linuxapp-gcc


OS: UB1904-64
	Kernel Version: 5.0.0-13-generic
	CPU info: Intel(R) Xeon(R) CPU E5-2699 v3 @ 2.30GHz
	GCC Version: gcc (Ubuntu 8.3.0-6ubuntu1) 8.3.0
	Clang Version: 8.0.0-3 (tags/RELEASE_800/final)
	x86_64-native-linuxapp-gcc


OS: UB1604-32
	Kernel Version: 4.4.0-131-generic
	CPU info: Intel(R) Xeon(R) CPU E5-2699 v3 @ 2.30GHz
	GCC Version: gcc (Ubuntu 5.4.0-6ubuntu1~16.04.11) 5.4.0 20160609
	Clang Version: 3.8.0-2ubuntu4 (tags/RELEASE_380/final)
	i686-native-linuxapp-gcc


OS: UB1604-64
	Kernel Version: 4.4.0-47-generic
	CPU info: Intel(R) Xeon(R) CPU E5-2699 v3 @ 2.30GHz
	GCC Version: gcc (Ubuntu 5.4.0-6ubuntu1~16.04.10) 5.4.0 20160609
	Clang Version: 3.8.0-2ubuntu4 (tags/RELEASE_380/final)
	x86_64-native-linuxapp-clang
	x86_64-native-linuxapp-gcc


OS: FC30-64
	Kernel Version: 5.1.7-300.fc30.x86_64
	CPU info: Intel(R) Xeon(R) CPU E5-2699 v4 @ 2.20GHz
	GCC Version: gcc (GCC) 9.1.1 20190503 (Red Hat 9.1.1-1)
	Clang Version: 8.0.0 (Fedora 8.0.0-1.fc30)
	x86_64-native-linuxapp-clang
	x86_64-native-linuxapp-gcc


OS: FreeBSD12-64
	Kernel Version: 12.0-RC3
	CPU info: Intel(R) Xeon(R) CPU E5-2699 v4 @ 2.20GHz (2194.97-MHz K8-class CPU)
	GCC Version: gcc (FreeBSD Ports Collection) 7.3.0
	Clang Version: 6.0.1 (tags/RELEASE_601/final 335540) (based on LLVM 6.0.1)
	x86_64-native-bsdapp-gcc+shared
	x86_64-native-bsdapp-gcc+debug
	x86_64-native-bsdapp-clang
	x86_64-native-bsdapp-gcc


OS: RHEL80-64
	Kernel Version: 4.18.0-80.el8.x86_64
	CPU info: Intel(R) Xeon(R) CPU E5-2699 v4 @ 2.20GHz
	GCC Version: gcc (GCC) 8.2.1 20180905 (Red Hat 8.2.1-3)
	Clang Version: NA
	x86_64-native-linuxapp-gcc+debug
	x86_64-native-linuxapp-icc
	x86_64-native-linuxapp-clang
	x86_64-native-linuxapp-gcc+shared
	x86_64-native-linuxapp-gcc


OS: SUSE15-64
	Kernel Version: 4.12.14-lp150.11-default
	CPU info: Intel(R) Xeon(R) CPU E5-2699 v4 @ 2.20GHz
	GCC Version: gcc (SUSE Linux) 7.3.1 20180323 [gcc-7-branch revision 258812]
	Clang Version: 5.0.1 (tags/RELEASE_501/final 312548)
	x86_64-native-linuxapp-gcc
	x86_64-native-linuxapp-clang


** meson build **


OS: UB1804-64
	Kernel Version: 4.15.0-20-generic
	CPU info: Intel(R) Xeon(R) CPU E5-2699 v4 @ 2.20GHz
	GCC Version: gcc (Ubuntu 7.3.0-27ubuntu1~18.04) 7.3.0
	Clang Version: 6.0.0-1ubuntu2 (tags/RELEASE_600/final)
	x86_64-native-linuxapp-doc
	build-gcc-static
	build-gcc-shared
	build-clang-static
	build-clang-shared
	build-x86-default


OS: UB1604-32
	Kernel Version: 4.4.0-131-generic
	CPU info: Intel(R) Xeon(R) CPU E5-2699 v4 @ 2.20GHz
	GCC Version: gcc (Ubuntu 5.4.0-6ubuntu1~16.04.11) 5.4.0 20160609
	Clang Version: 3.8.0-2ubuntu4 (tags/RELEASE_380/final)
	build-gcc-static
	build-gcc-shared
	build-clang-static
	build-clang-shared
	build-x86-default


OS: FC30-64
	Kernel Version: 5.0.9-301.fc30.x86_64
	CPU info: Intel(R) Xeon(R) CPU E5-2699 v4 @ 2.20GHz
	GCC Version: gcc (GCC) 9.1.1 20190503 (Red Hat 9.1.1-1)
	Clang Version: 8.0.0 (Fedora 8.0.0-1.fc30)
	build-gcc-static
	build-gcc-shared
	build-clang-static
	build-clang-shared
	build-x86-default


OS: WIN10-64
	Kernel Version: N/A
	CPU info: N/A
	GCC Version: N/A
	Clang Version: Clang 8.0.0
	x86_64-windows-clang


OS: FreeBSD12-64
	Kernel Version: 12.0-RC3
	CPU info: Intel(R) Xeon(R) CPU E5-2699 v4 @ 2.20GHz (2194.99-MHz K8-class CPU)
	GCC Version: gcc (FreeBSD Ports Collection) 7.3.0
	Clang Version: 6.0.1 (tags/RELEASE_601/final 335540) (based on LLVM 6.0.1)
	build-gcc-static
	build-gcc-shared
	build-clang-static
	build-clang-shared
	build-x86-default


OS: RHEL80-64
	Kernel Version: 4.18.0-80.el8.x86_64
	CPU info: Intel(R) Xeon(R) CPU E5-2699 v4 @ 2.20GHz
	GCC Version: gcc (GCC) 8.2.1 20180905 (Red Hat 8.2.1-3)
	Clang Version: NA
	build-gcc-static
	build-gcc-shared
	build-x86-default


OS: SUSE15-64
	Kernel Version: 4.12.14-lp150.11-default
	CPU info: Intel(R) Xeon(R) CPU E5-2699 v4 @ 2.20GHz
	GCC Version: gcc (SUSE Linux) 7.3.1 20180323 [gcc-7-branch revision 258812]
	Clang Version: 5.0.1 (tags/RELEASE_501/final 312548)
	build-gcc-static
	build-gcc-shared
	build-clang-static
	build-clang-shared
	build-x86-default


*Meson Build Failed #1:
OS: RHEL80-64
Target:build-gcc-static
FAILED: examples/c590b3c@@dpdk-mp_server at exe/multi_process_client_server_mp_mp_server_init.c.o 
gcc -Iexamples/c590b3c@@dpdk-mp_server at exe -Iexamples -I../examples -Iexamples/multi_process/client_server_mp/mp_server -I../examples/multi_process/client_server_mp/mp_server -I../examples/multi_process/client_server_mp/mp_server/../shared -I. -I../ -Iconfig -I../config -Ilib/librte_eal/common/include -I../lib/librte_eal/common/include -I../lib/librte_eal/linux/eal/include -Ilib/librte_eal/common -I../lib/librte_eal/common -Ilib/librte_eal/common/include/arch/x86 -I../lib/librte_eal/common/include/arch/x86 -Ilib/librte_eal -I../lib/librte_eal -Ilib/librte_kvargs -I../lib/librte_kvargs -Ilib/librte_mempool -I../lib/librte_mempool -Ilib/librte_ring -I../lib/librte_ring -Ilib/librte_net -I../lib/librte_net -Ilib/librte_mbuf -I../lib/librte_mbuf -Ilib/librte_ethdev -I../lib/librte_ethdev -Ilib/librte_meter -I../lib/librte_meter -Ilib/librte_cmdline -I../lib/librte_cmdline -fdiagnostics-color=always -pipe -D_FILE_OFFSET_BITS=64 -Wall -Winvalid-pch -Werror -O3 -include rte_config.h -Wunused-parameter -Wsign-compare -Wcast-qual -D_GNU_SOURCE -march=native -mno-avx512f -Wno-format-truncation -MD -MQ 'examples/c590b3c@@dpdk-mp_server at exe/multi_process_client_server_mp_mp_server_init.c.o' -MF 'examples/c590b3c@@dpdk-mp_server at exe/multi_process_client_server_mp_mp_server_init.c.o.d' -o 'examples/c590b3c@@dpdk-mp_server at exe/multi_process_client_server_mp_mp_server_init.c.o' -c ../examples/multi_process/client_server_mp/mp_server/init.c
../examples/multi_process/client_server_mp/mp_server/init.c:185:19: error: unknown type name ‘uint16’; did you mean ‘uint’?
 print_link_status(uint16 id, const struct rte_eth_link *link)
                   ^~~~~~
                   uint
../examples/multi_process/client_server_mp/mp_server/init.c: In function ‘check_all_ports_link_status’:
../examples/multi_process/client_server_mp/mp_server/init.c:218:5: error: implicit declaration of function ‘print_link_status’ [-Werror=implicit-function-declaration]
     print_link_status(&link);
     ^~~~~~~~~~~~~~~~~
cc1: all warnings being treated as errors
[1755/1824] Linking target examples/dpdk-l2fwd-keepalive.
[1756/1824] Compiling C object 'examples/c590b3c@@dpdk-mp_client at exe/multi_process_client_server_mp_mp_client_client.c.o'.
[1757/1824] Compiling C object 'examples/c590b3c@@dpdk-link_status_interrupt at exe/link_status_interrupt_main.c.o'.
[1758/1824] Compiling C object 'examples/c590b3c@@dpdk-l3fwd-acl at exe/l3fwd-acl_main.c.o'.
[1759/1824] Linking target examples/dpdk-l3fwd.
ninja: build stopped: subcommand failed




*Meson Build Failed #2:
OS: FC30-64
Target:build-gcc-static
FAILED: examples/c590b3c@@dpdk-mp_server at exe/multi_process_client_server_mp_mp_server_init.c.o 
gcc -Iexamples/c590b3c@@dpdk-mp_server at exe -Iexamples -I../examples -Iexamples/multi_process/client_server_mp/mp_server -I../examples/multi_process/client_server_mp/mp_server -I../examples/multi_process/client_server_mp/mp_server/../shared -I. -I../ -Iconfig -I../config -Ilib/librte_eal/common/include -I../lib/librte_eal/common/include -I../lib/librte_eal/linux/eal/include -Ilib/librte_eal/common -I../lib/librte_eal/common -Ilib/librte_eal/common/include/arch/x86 -I../lib/librte_eal/common/include/arch/x86 -Ilib/librte_eal -I../lib/librte_eal -Ilib/librte_kvargs -I../lib/librte_kvargs -Ilib/librte_mempool -I../lib/librte_mempool -Ilib/librte_ring -I../lib/librte_ring -Ilib/librte_net -I../lib/librte_net -Ilib/librte_mbuf -I../lib/librte_mbuf -Ilib/librte_ethdev -I../lib/librte_ethdev -Ilib/librte_meter -I../lib/librte_meter -Ilib/librte_cmdline -I../lib/librte_cmdline -fdiagnostics-color=always -pipe -D_FILE_OFFSET_BITS=64 -Wall -Winvalid-pch -Werror -O3 -include rte_config.h -Wunused-parameter -Wsign-compare -Wcast-qual -Wno-address-of-packed-member -D_GNU_SOURCE -march=native -mno-avx512f -Wno-format-truncation -MD -MQ 'examples/c590b3c@@dpdk-mp_server at exe/multi_process_client_server_mp_mp_server_init.c.o' -MF 'examples/c590b3c@@dpdk-mp_server at exe/multi_process_client_server_mp_mp_server_init.c.o.d' -o 'examples/c590b3c@@dpdk-mp_server at exe/multi_process_client_server_mp_mp_server_init.c.o' -c ../examples/multi_process/client_server_mp/mp_server/init.c
../examples/multi_process/client_server_mp/mp_server/init.c:185:19: error: unknown type name ‘uint16’; did you mean ‘uint’?
  185 | print_link_status(uint16 id, const struct rte_eth_link *link)
      |                   ^~~~~~
      |                   uint
../examples/multi_process/client_server_mp/mp_server/init.c: In function ‘check_all_ports_link_status’:
../examples/multi_process/client_server_mp/mp_server/init.c:218:5: error: implicit declaration of function ‘print_link_status’ [-Werror=implicit-function-declaration]
  218 |     print_link_status(&link);
      |     ^~~~~~~~~~~~~~~~~
cc1: all warnings being treated as errors
[1732/1784] Compiling C object 'examples/c590b3c@@dpdk-load_balancer at exe/load_balancer_config.c.o'.
[1733/1784] Compiling C object 'examples/c590b3c@@dpdk-mp_server at exe/multi_process_client_server_mp_mp_server_args.c.o'.
[1734/1784] Linking target examples/dpdk-l3fwd-acl.
[1735/1784] Compiling C object 'examples/c590b3c@@dpdk-simple_mp at exe/multi_process_simple_mp_mp_commands.c.o'.
[1736/1784] Linking target examples/dpdk-link_status_interrupt.
[1737/1784] Compiling C object 'examples/c590b3c@@dpdk-hotplug_mp at exe/multi_process_hotplug_mp_commands.c.o'.
[1738/1784] Linking target examples/dpdk-symmetric_mp.
ninja: build stopped: subcommand failed




*Meson Build Failed #3:
OS: SUSE15-64
Target:build-gcc-static
FAILED: examples/c590b3c@@dpdk-mp_server at exe/multi_process_client_server_mp_mp_server_init.c.o 
gcc -Iexamples/c590b3c@@dpdk-mp_server at exe -Iexamples -I../examples -Iexamples/multi_process/client_server_mp/mp_server -I../examples/multi_process/client_server_mp/mp_server -I../examples/multi_process/client_server_mp/mp_server/../shared -I. -I../ -Iconfig -I../config -Ilib/librte_eal/common/include -I../lib/librte_eal/common/include -I../lib/librte_eal/linux/eal/include -Ilib/librte_eal/common -I../lib/librte_eal/common -Ilib/librte_eal/common/include/arch/x86 -I../lib/librte_eal/common/include/arch/x86 -Ilib/librte_eal -I../lib/librte_eal -Ilib/librte_kvargs -I../lib/librte_kvargs -Ilib/librte_mempool -I../lib/librte_mempool -Ilib/librte_ring -I../lib/librte_ring -Ilib/librte_net -I../lib/librte_net -Ilib/librte_mbuf -I../lib/librte_mbuf -Ilib/librte_ethdev -I../lib/librte_ethdev -Ilib/librte_meter -I../lib/librte_meter -Ilib/librte_cmdline -I../lib/librte_cmdline -fdiagnostics-color=always -pipe -D_FILE_OFFSET_BITS=64 -Wall -Winvalid-pch -Werror -O3 -include rte_config.h -Wunused-parameter -Wsign-compare -Wcast-qual -D_GNU_SOURCE -march=native -Wno-format-truncation -MD -MQ 'examples/c590b3c@@dpdk-mp_server at exe/multi_process_client_server_mp_mp_server_init.c.o' -MF 'examples/c590b3c@@dpdk-mp_server at exe/multi_process_client_server_mp_mp_server_init.c.o.d' -o 'examples/c590b3c@@dpdk-mp_server at exe/multi_process_client_server_mp_mp_server_init.c.o' -c ../examples/multi_process/client_server_mp/mp_server/init.c
../examples/multi_process/client_server_mp/mp_server/init.c:185:19: error: unknown type name ‘uint16’; did you mean ‘uint’?
 print_link_status(uint16 id, const struct rte_eth_link *link)
                   ^~~~~~
                   uint
../examples/multi_process/client_server_mp/mp_server/init.c: In function ‘check_all_ports_link_status’:
../examples/multi_process/client_server_mp/mp_server/init.c:218:5: error: implicit declaration of function ‘print_link_status’ [-Werror=implicit-function-declaration]
     print_link_status(&link);
     ^~~~~~~~~~~~~~~~~
cc1: all warnings being treated as errors
[1770/1831] Linking target examples/dpdk-l3fwd-acl.
[1771/1831] Linking target examples/dpdk-l2fwd-crypto.
[1772/1831] Compiling C object 'examples/c590b3c@@dpdk-load_balancer at exe/load_balancer_init.c.o'.
[1773/1831] Linking target examples/dpdk-l2fwd-jobstats.
[1774/1831] Linking target examples/dpdk-l2fwd-keepalive.
[1775/1831] Compiling C object 'examples/c590b3c@@dpdk-l3fwd at exe/l3fwd_l3fwd_lpm.c.o'.
[1776/1831] Compiling C object 'examples/c590b3c@@dpdk-load_balancer at exe/load_balancer_runtime.c.o'.
ninja: build stopped: subcommand failed




*Meson Build Failed #4:
OS: UB1604-32
Target:build-gcc-static
FAILED: examples/c590b3c@@dpdk-mp_server at exe/multi_process_client_server_mp_mp_server_init.c.o 
gcc -Iexamples/c590b3c@@dpdk-mp_server at exe -Iexamples -I../examples -Iexamples/multi_process/client_server_mp/mp_server -I../examples/multi_process/client_server_mp/mp_server -I../examples/multi_process/client_server_mp/mp_server/../shared -I. -I../ -Iconfig -I../config -Ilib/librte_eal/common/include -I../lib/librte_eal/common/include -I../lib/librte_eal/linux/eal/include -Ilib/librte_eal/common -I../lib/librte_eal/common -Ilib/librte_eal/common/include/arch/x86 -I../lib/librte_eal/common/include/arch/x86 -Ilib/librte_eal -I../lib/librte_eal -Ilib/librte_kvargs -I../lib/librte_kvargs -Ilib/librte_mempool -I../lib/librte_mempool -Ilib/librte_ring -I../lib/librte_ring -Ilib/librte_net -I../lib/librte_net -Ilib/librte_mbuf -I../lib/librte_mbuf -Ilib/librte_ethdev -I../lib/librte_ethdev -Ilib/librte_meter -I../lib/librte_meter -Ilib/librte_cmdline -I../lib/librte_cmdline -fdiagnostics-color=always -pipe -D_FILE_OFFSET_BITS=64 -Wall -Winvalid-pch -Werror -O3 -include rte_config.h -Wunused-parameter -Wsign-compare -Wcast-qual -Wno-pointer-to-int-cast -D_GNU_SOURCE -march=native -MD -MQ 'examples/c590b3c@@dpdk-mp_server at exe/multi_process_client_server_mp_mp_server_init.c.o' -MF 'examples/c590b3c@@dpdk-mp_server at exe/multi_process_client_server_mp_mp_server_init.c.o.d' -o 'examples/c590b3c@@dpdk-mp_server at exe/multi_process_client_server_mp_mp_server_init.c.o' -c ../examples/multi_process/client_server_mp/mp_server/init.c
../examples/multi_process/client_server_mp/mp_server/init.c:185:19: error: unknown type name ‘uint16’
 print_link_status(uint16 id, const struct rte_eth_link *link)
                   ^
../examples/multi_process/client_server_mp/mp_server/init.c: In function ‘check_all_ports_link_status’:
../examples/multi_process/client_server_mp/mp_server/init.c:218:5: error: implicit declaration of function ‘print_link_status’ [-Werror=implicit-function-declaration]
     print_link_status(&link);
     ^
cc1: all warnings being treated as errors
[1590/1656] Linking target examples/dpdk-l2fwd-keepalive.
[1591/1656] Compiling C object 'examples/c590b3c@@dpdk-load_balancer at exe/load_balancer_main.c.o'.
[1592/1656] Linking target examples/dpdk-link_status_interrupt.
[1593/1656] Linking target examples/dpdk-l3fwd-acl.
[1594/1656] Compiling C object 'examples/c590b3c@@dpdk-l3fwd-vf at exe/l3fwd-vf_main.c.o'.
ninja: build stopped: subcommand failed




*Meson Build Failed #5:
OS: UB1804-64
Target:build-gcc-static
FAILED: examples/c590b3c@@dpdk-mp_server at exe/multi_process_client_server_mp_mp_server_init.c.o 
gcc -Iexamples/c590b3c@@dpdk-mp_server at exe -Iexamples -I../examples -Iexamples/multi_process/client_server_mp/mp_server -I../examples/multi_process/client_server_mp/mp_server -I../examples/multi_process/client_server_mp/mp_server/../shared -I. -I../ -Iconfig -I../config -Ilib/librte_eal/common/include -I../lib/librte_eal/common/include -I../lib/librte_eal/linux/eal/include -Ilib/librte_eal/common -I../lib/librte_eal/common -Ilib/librte_eal/common/include/arch/x86 -I../lib/librte_eal/common/include/arch/x86 -Ilib/librte_eal -I../lib/librte_eal -Ilib/librte_kvargs -I../lib/librte_kvargs -Ilib/librte_mempool -I../lib/librte_mempool -Ilib/librte_ring -I../lib/librte_ring -Ilib/librte_net -I../lib/librte_net -Ilib/librte_mbuf -I../lib/librte_mbuf -Ilib/librte_ethdev -I../lib/librte_ethdev -Ilib/librte_meter -I../lib/librte_meter -Ilib/librte_cmdline -I../lib/librte_cmdline -fdiagnostics-color=always -pipe -D_FILE_OFFSET_BITS=64 -Wall -Winvalid-pch -Werror -O3 -include rte_config.h -Wunused-parameter -Wsign-compare -Wcast-qual -D_GNU_SOURCE -march=native -mno-avx512f -Wno-format-truncation -MD -MQ 'examples/c590b3c@@dpdk-mp_server at exe/multi_process_client_server_mp_mp_server_init.c.o' -MF 'examples/c590b3c@@dpdk-mp_server at exe/multi_process_client_server_mp_mp_server_init.c.o.d' -o 'examples/c590b3c@@dpdk-mp_server at exe/multi_process_client_server_mp_mp_server_init.c.o' -c ../examples/multi_process/client_server_mp/mp_server/init.c
../examples/multi_process/client_server_mp/mp_server/init.c:185:19: error: unknown type name ‘uint16’; did you mean ‘uint’?
 print_link_status(uint16 id, const struct rte_eth_link *link)
                   ^~~~~~
                   uint
../examples/multi_process/client_server_mp/mp_server/init.c: In function ‘check_all_ports_link_status’:
../examples/multi_process/client_server_mp/mp_server/init.c:218:5: error: implicit declaration of function ‘print_link_status’ [-Werror=implicit-function-declaration]
     print_link_status(&link);
     ^~~~~~~~~~~~~~~~~
cc1: all warnings being treated as errors
[1737/1791] Compiling C object 'examples/c590b3c@@dpdk-load_balancer at exe/load_balancer_config.c.o'.
[1738/1791] Compiling C object 'examples/c590b3c@@dpdk-qos_sched at exe/qos_sched_cmdline.c.o'.
[1739/1791] Compiling C object 'examples/c590b3c@@dpdk-l3fwd-power at exe/l3fwd-power_main.c.o'.
[1740/1791] Compiling C object 'examples/c590b3c@@dpdk-simple_mp at exe/multi_process_simple_mp_mp_commands.c.o'.
[1741/1791] Compiling C object 'examples/c590b3c@@dpdk-hotplug_mp at exe/multi_process_hotplug_mp_commands.c.o'.
ninja: build stopped: subcommand failed




*Meson Build Failed #6:
OS: FreeBSD12-64
Target:build-gcc-static
FAILED: examples/c590b3c@@dpdk-mp_server at exe/multi_process_client_server_mp_mp_server_init.c.o 
ccache gcc -Iexamples/c590b3c@@dpdk-mp_server at exe -Iexamples -I../examples -Iexamples/multi_process/client_server_mp/mp_server -I../examples/multi_process/client_server_mp/mp_server -I../examples/multi_process/client_server_mp/mp_server/../shared -I. -I../ -Iconfig -I../config -Ilib/librte_eal/common/include -I../lib/librte_eal/common/include -I../lib/librte_eal/freebsd/eal/include -Ilib/librte_eal/common -I../lib/librte_eal/common -Ilib/librte_eal/common/include/arch/x86 -I../lib/librte_eal/common/include/arch/x86 -Ilib/librte_eal -I../lib/librte_eal -Ilib/librte_kvargs -I../lib/librte_kvargs -Ilib/librte_mempool -I../lib/librte_mempool -Ilib/librte_ring -I../lib/librte_ring -Ilib/librte_net -I../lib/librte_net -Ilib/librte_mbuf -I../lib/librte_mbuf -Ilib/librte_ethdev -I../lib/librte_ethdev -Ilib/librte_meter -I../lib/librte_meter -Ilib/librte_cmdline -I../lib/librte_cmdline -fdiagnostics-color=always -pipe -D_FILE_OFFSET_BITS=64 -Wall -Winvalid-pch -Werror -O3 -include rte_config.h -Wunused-parameter -Wsign-compare -Wcast-qual -D_GNU_SOURCE -D__BSD_VISIBLE -march=native -Wno-format-truncation -MD -MQ 'examples/c590b3c@@dpdk-mp_server at exe/multi_process_client_server_mp_mp_server_init.c.o' -MF 'examples/c590b3c@@dpdk-mp_server at exe/multi_process_client_server_mp_mp_server_init.c.o.d' -o 'examples/c590b3c@@dpdk-mp_server at exe/multi_process_client_server_mp_mp_server_init.c.o' -c ../examples/multi_process/client_server_mp/mp_server/init.c
../examples/multi_process/client_server_mp/mp_server/init.c:185:19: error: unknown type name 'uint16'; did you mean 'uint'?
 print_link_status(uint16 id, const struct rte_eth_link *link)
                   ^~~~~~
                   uint
../examples/multi_process/client_server_mp/mp_server/init.c: In function 'check_all_ports_link_status':
../examples/multi_process/client_server_mp/mp_server/init.c:218:5: error: implicit declaration of function 'print_link_status' [-Werror=implicit-function-declaration]
     print_link_status(&link);
     ^~~~~~~~~~~~~~~~~
cc1: all warnings being treated as errors
[1380/1413] Compiling C object 'examples/c590b3c@@dpdk-packet_ordering at exe/packet_ordering_main.c.o'.
[1381/1413] Compiling C object 'examples/c590b3c@@dpdk-mp_server at exe/multi_process_client_server_mp_mp_server_args.c.o'.
[1382/1413] Linking target examples/dpdk-mp_client.
[1383/1413] Linking target examples/dpdk-symmetric_mp.
[1384/1413] Compiling C object 'examples/c590b3c@@dpdk-mp_server at exe/multi_process_client_server_mp_mp_server_main.c.o'.
ninja: build stopped: subcommand failed



DPDK STV team


More information about the test-report mailing list