[dpdk-test-report] |FAILURE| pw57826[v2, 1/2] app/test: add abi version testing functionality

sys_stv at intel.com sys_stv at intel.com
Thu Aug 22 18:37:47 CEST 2019


Test-Label: Intel-compilation
Test-Status: FAILURE
http://dpdk.org/patch/57826

_Compilation issues_

Submitter: Ray Kinsella <mdr at ashroe.eu>
Date: 2019-08-22 16:07:16
Reply_mail: 20190822160717.13584-2-mdr at ashroe.eu
DPDK git baseline: Repo:dpdk, CommitID: e7fd5a3bbe5636e93a66fd5086f182756624c97a

Makefile build Summary: 22 Builds Done, 22 Successful, 0 Failures

meson build Summary: 7 Builds Done, 6 Successful, 1 Failures

               +==============================================+===========+==========+
               |                   Makefile                   |   Meson   | Document |
+--------------+------+-------+------+------------+-----------+-----------+----------+
| os           | gcc  | clang | icc  | gcc+shared | gcc+debug | gcc/clang | pdf/html |
+--------------+------+-------+------+------------+-----------+-----------+----------+
| RHEL76-64    | pass |       |      |            |           |           |          |
| CENTOS76-64  | pass | pass  | pass | pass       | pass      | fail      |          |
| UB1804-64    | pass | pass  | pass |            |           | pass      | pass     |
| UB1604-32    | pass |       |      |            |           | pass      |          |
| UB1904-64    | pass |       |      |            |           |           |          |
| UB1604-64    | pass | pass  |      |            |           |           |          |
| FC30-64      | pass | pass  |      |            |           | pass      |          |
| FreeBSD12-64 | pass | pass  |      | pass       | pass      | pass      |          |
| RHEL80-64    | pass |       |      |            |           |           |          |
| SUSE15-64    | pass | pass  |      |            |           | pass      |          |
+--------------+------+-------+------+------------+-----------+-----------+----------+

Test environment and configuration as below:

** Makefile build **


OS: RHEL76-64
	Kernel Version: 3.10.0-957.el7.x86_64
	CPU info: Intel(R) Xeon(R) CPU E5-2699 v4 @ 2.20GHz
	GCC Version: gcc (GCC) 4.8.5 20150623 (Red Hat 4.8.5-36)
	Clang Version: NA
	x86_64-native-linuxapp-gcc


OS: CENTOS76-64
	Kernel Version: 3.10.0-957.10.1.el7.x86_64
	CPU info: Intel(R) Xeon(R) CPU E5-2699 v4 @ 2.20GHz
	GCC Version: gcc (GCC) 4.8.5 20150623 (Red Hat 4.8.5-36)
	Clang Version: 3.4.2 (tags/RELEASE_34/dot2-final)
	x86_64-native-linuxapp-gcc+debug
	x86_64-native-linuxapp-clang
	x86_64-native-linuxapp-gcc
	x86_64-native-linuxapp-gcc+shared
	x86_64-native-linuxapp-icc


OS: UB1804-64
	Kernel Version: 4.15.0-20-generic
	CPU info: Intel(R) Xeon(R) CPU E5-2699 v3 @ 2.30GHz
	GCC Version: gcc (Ubuntu 7.3.0-27ubuntu1~18.04) 7.3.0
	Clang Version: 6.0.0-1ubuntu2 (tags/RELEASE_600/final)
	x86_64-native-linuxapp-icc
	x86_64-native-linuxapp-clang
	x86_64-native-linuxapp-gcc


OS: UB1904-64
	Kernel Version: 5.0.0-13-generic
	CPU info: Intel(R) Xeon(R) CPU E5-2699 v3 @ 2.30GHz
	GCC Version: gcc (Ubuntu 8.3.0-6ubuntu1) 8.3.0
	Clang Version: 8.0.0-3 (tags/RELEASE_800/final)
	x86_64-native-linuxapp-gcc


OS: UB1604-32
	Kernel Version: 4.4.0-131-generic
	CPU info: Intel(R) Xeon(R) CPU E5-2699 v3 @ 2.30GHz
	GCC Version: gcc (Ubuntu 5.4.0-6ubuntu1~16.04.11) 5.4.0 20160609
	Clang Version: 3.8.0-2ubuntu4 (tags/RELEASE_380/final)
	i686-native-linuxapp-gcc


OS: UB1604-64
	Kernel Version: 4.4.0-47-generic
	CPU info: Intel(R) Xeon(R) CPU E5-2699 v3 @ 2.30GHz
	GCC Version: gcc (Ubuntu 5.4.0-6ubuntu1~16.04.10) 5.4.0 20160609
	Clang Version: 3.8.0-2ubuntu4 (tags/RELEASE_380/final)
	x86_64-native-linuxapp-clang
	x86_64-native-linuxapp-gcc


OS: FC30-64
	Kernel Version: 5.1.7-300.fc30.x86_64
	CPU info: Intel(R) Xeon(R) CPU E5-2699 v4 @ 2.20GHz
	GCC Version: gcc (GCC) 9.1.1 20190503 (Red Hat 9.1.1-1)
	Clang Version: 8.0.0 (Fedora 8.0.0-1.fc30)
	x86_64-native-linuxapp-gcc
	x86_64-native-linuxapp-clang


OS: FreeBSD12-64
	Kernel Version: 12.0-RC3
	CPU info: Intel(R) Xeon(R) CPU E5-2699 v4 @ 2.20GHz (2194.97-MHz K8-class CPU)
	GCC Version: gcc (FreeBSD Ports Collection) 7.3.0
	Clang Version: 6.0.1 (tags/RELEASE_601/final 335540) (based on LLVM 6.0.1)
	x86_64-native-bsdapp-gcc+shared
	x86_64-native-bsdapp-clang
	x86_64-native-bsdapp-gcc+debug
	x86_64-native-bsdapp-gcc


OS: RHEL80-64
	Kernel Version: 4.18.0-80.el8.x86_64
	CPU info: Intel(R) Xeon(R) CPU E5-2699 v4 @ 2.20GHz
	GCC Version: gcc (GCC) 8.2.1 20180905 (Red Hat 8.2.1-3)
	Clang Version: NA
	x86_64-native-linuxapp-gcc


OS: SUSE15-64
	Kernel Version: 4.12.14-lp150.11-default
	CPU info: Intel(R) Xeon(R) CPU E5-2699 v4 @ 2.20GHz
	GCC Version: gcc (SUSE Linux) 7.3.1 20180323 [gcc-7-branch revision 258812]
	Clang Version: 5.0.1 (tags/RELEASE_501/final 312548)
	x86_64-native-linuxapp-gcc
	x86_64-native-linuxapp-clang


** meson build **


OS: CENTOS76-64
	Kernel Version: 3.10.0-957.10.1.el7.x86_64
	CPU info: Intel(R) Xeon(R) CPU E5-2699 v4 @ 2.20GHz
	GCC Version: gcc (GCC) 4.8.5 20150623 (Red Hat 4.8.5-36)
	Clang Version: 3.4.2 (tags/RELEASE_34/dot2-final)
	build-gcc-static
	build-gcc-shared
	build-clang-static
	build-clang-shared
	build-x86-default


OS: UB1804-64
	Kernel Version: 4.15.0-20-generic
	CPU info: Intel(R) Xeon(R) CPU E5-2699 v4 @ 2.20GHz
	GCC Version: gcc (Ubuntu 7.3.0-27ubuntu1~18.04) 7.3.0
	Clang Version: 6.0.0-1ubuntu2 (tags/RELEASE_600/final)
	x86_64-native-linuxapp-doc
	build-gcc-static
	build-gcc-shared
	build-clang-static
	build-clang-shared
	build-x86-default


OS: UB1604-32
	Kernel Version: 4.4.0-131-generic
	CPU info: Intel(R) Xeon(R) CPU E5-2699 v4 @ 2.20GHz
	GCC Version: gcc (Ubuntu 5.4.0-6ubuntu1~16.04.11) 5.4.0 20160609
	Clang Version: 3.8.0-2ubuntu4 (tags/RELEASE_380/final)
	build-gcc-static
	build-gcc-shared
	build-clang-static
	build-clang-shared
	build-x86-default


OS: FC30-64
	Kernel Version: 5.0.9-301.fc30.x86_64
	CPU info: Intel(R) Xeon(R) CPU E5-2699 v4 @ 2.20GHz
	GCC Version: gcc (GCC) 9.1.1 20190503 (Red Hat 9.1.1-1)
	Clang Version: 8.0.0 (Fedora 8.0.0-1.fc30)
	build-gcc-static
	build-gcc-shared
	build-clang-static
	build-clang-shared
	build-x86-default


OS: FreeBSD12-64
	Kernel Version: 12.0-RC3
	CPU info: Intel(R) Xeon(R) CPU E5-2699 v4 @ 2.20GHz (2194.97-MHz K8-class CPU)
	GCC Version: gcc (FreeBSD Ports Collection) 7.3.0
	Clang Version: 6.0.1 (tags/RELEASE_601/final 335540) (based on LLVM 6.0.1)
	build-gcc-static
	build-gcc-shared
	build-clang-static
	build-clang-shared
	build-x86-default


OS: SUSE15-64
	Kernel Version: 4.12.14-lp150.11-default
	CPU info: Intel(R) Xeon(R) CPU E5-2699 v4 @ 2.20GHz
	GCC Version: gcc (SUSE Linux) 7.3.1 20180323 [gcc-7-branch revision 258812]
	Clang Version: 5.0.1 (tags/RELEASE_501/final 312548)
	build-gcc-static
	build-gcc-shared
	build-clang-static
	build-clang-shared
	build-x86-default


*Meson Build Failed #1:
OS: CENTOS76-64
Target:build-gcc-static
Compiler for C supports arguments -Wsign-compare: YES
Compiler for C supports arguments -Wcast-qual: YES
Compiler for C supports arguments -Wno-address-of-packed-member: NO
Fetching value of define "__SSE4_2__" : 

config/x86/meson.build:22:1: ERROR: Problem encountered: SSE4.2 instruction set is required for DPDK.
Please set the machine type to "nehalem" or "corei7" or higher value

A full log can be found at /tmp/CENTOS76-64_K3.10.0_GCC4.8.5/x86_64-native-linuxapp-gcc/f27d5a6f2f6148e0912cf2ec616367b4/dpdk/build-clang-static/meson-logs/meson-log.txt
ninja -C build-clang-static
ninja: Entering directory `build-clang-static'
--
Compiler for C supports arguments -Wsign-compare: YES
Compiler for C supports arguments -Wcast-qual: YES
Compiler for C supports arguments -Wno-address-of-packed-member: NO
Fetching value of define "__SSE4_2__" : 

config/x86/meson.build:22:1: ERROR: Problem encountered: SSE4.2 instruction set is required for DPDK.
Please set the machine type to "nehalem" or "corei7" or higher value

A full log can be found at /tmp/CENTOS76-64_K3.10.0_GCC4.8.5/x86_64-native-linuxapp-gcc/f27d5a6f2f6148e0912cf2ec616367b4/dpdk/build-clang-shared/meson-logs/meson-log.txt
ninja -C build-clang-shared
ninja: Entering directory `build-clang-shared'
--
rm -f build/cmdline build/cmdline-static build/cmdline-shared
test -d build && rmdir -p build || true
Unknown option --define-prefix
Unknown option --define-prefix
cc -O3  main.c commands.c parse_obj_list.c -o build/cmdline-shared  
main.c:14:28: fatal error: cmdline_rdline.h: No such file or directory
 #include <cmdline_rdline.h>
                            ^
compilation terminated.
commands.c:23:28: fatal error: cmdline_rdline.h: No such file or directory
 #include <cmdline_rdline.h>
                            ^
compilation terminated.
parse_obj_list.c:15:27: fatal error: cmdline_parse.h: No such file or directory
 #include <cmdline_parse.h>
                           ^
compilation terminated.
gmake: *** [build/cmdline-shared] Error 1
gmake: Leaving directory `/tmp/CENTOS76-64_K3.10.0_GCC4.8.5/x86_64-native-linuxapp-gcc/f27d5a6f2f6148e0912cf2ec616367b4/dpdk/build-x86-default/install-root/usr/local/share/dpdk/examples/cmdline'
## Building helloworld
Unknown option --define-prefix
gmake: Entering directory `/tmp/CENTOS76-64_K3.10.0_GCC4.8.5/x86_64-native-linuxapp-gcc/f27d5a6f2f6148e0912cf2ec616367b4/dpdk/build-x86-default/install-root/usr/local/share/dpdk/examples/helloworld'
rm -f build/helloworld build/helloworld-static build/helloworld-shared
test -d build && rmdir -p build || true
Unknown option --define-prefix
Unknown option --define-prefix
cc -O3  main.c -o build/helloworld-shared  
main.c:11:24: fatal error: rte_memory.h: No such file or directory
 #include <rte_memory.h>
                        ^
compilation terminated.
gmake: *** [build/helloworld-shared] Error 1
gmake: Leaving directory `/tmp/CENTOS76-64_K3.10.0_GCC4.8.5/x86_64-native-linuxapp-gcc/f27d5a6f2f6148e0912cf2ec616367b4/dpdk/build-x86-default/install-root/usr/local/share/dpdk/examples/helloworld'
## Building l2fwd
Unknown option --define-prefix
gmake: Entering directory `/tmp/CENTOS76-64_K3.10.0_GCC4.8.5/x86_64-native-linuxapp-gcc/f27d5a6f2f6148e0912cf2ec616367b4/dpdk/build-x86-default/install-root/usr/local/share/dpdk/examples/l2fwd'
rm -f build/l2fwd build/l2fwd-static build/l2fwd-shared
test -d build && rmdir -p build || true
Unknown option --define-prefix
Unknown option --define-prefix
cc -O3  main.c -o build/l2fwd-shared  
main.c:21:24: fatal error: rte_common.h: No such file or directory
 #include <rte_common.h>
                        ^
compilation terminated.
gmake: *** [build/l2fwd-shared] Error 1
gmake: Leaving directory `/tmp/CENTOS76-64_K3.10.0_GCC4.8.5/x86_64-native-linuxapp-gcc/f27d5a6f2f6148e0912cf2ec616367b4/dpdk/build-x86-default/install-root/usr/local/share/dpdk/examples/l2fwd'
## Building l3fwd
Unknown option --define-prefix
gmake: Entering directory `/tmp/CENTOS76-64_K3.10.0_GCC4.8.5/x86_64-native-linuxapp-gcc/f27d5a6f2f6148e0912cf2ec616367b4/dpdk/build-x86-default/install-root/usr/local/share/dpdk/examples/l3fwd'
rm -f build/l3fwd build/l3fwd-static build/l3fwd-shared
test -d build && rmdir -p build || true
Unknown option --define-prefix
Unknown option --define-prefix
cc -O3  main.c l3fwd_lpm.c l3fwd_em.c -o build/l3fwd-shared  
main.c:18:24: fatal error: rte_common.h: No such file or directory
 #include <rte_common.h>
                        ^
compilation terminated.
l3fwd_lpm.c:19:23: fatal error: rte_debug.h: No such file or directory
 #include <rte_debug.h>
                       ^
compilation terminated.
l3fwd_em.c:18:23: fatal error: rte_debug.h: No such file or directory
 #include <rte_debug.h>
                       ^
compilation terminated.
gmake: *** [build/l3fwd-shared] Error 1
gmake: Leaving directory `/tmp/CENTOS76-64_K3.10.0_GCC4.8.5/x86_64-native-linuxapp-gcc/f27d5a6f2f6148e0912cf2ec616367b4/dpdk/build-x86-default/install-root/usr/local/share/dpdk/examples/l3fwd'
## Building skeleton
Unknown option --define-prefix
gmake: Entering directory `/tmp/CENTOS76-64_K3.10.0_GCC4.8.5/x86_64-native-linuxapp-gcc/f27d5a6f2f6148e0912cf2ec616367b4/dpdk/build-x86-default/install-root/usr/local/share/dpdk/examples/skeleton'
rm -f build/basicfwd build/basicfwd-static build/basicfwd-shared
test -d build && rmdir -p build || true
Unknown option --define-prefix
Unknown option --define-prefix
cc -O3  basicfwd.c -o build/basicfwd-shared  
basicfwd.c:7:21: fatal error: rte_eal.h: No such file or directory
 #include <rte_eal.h>
                     ^
compilation terminated.
gmake: *** [build/basicfwd-shared] Error 1
gmake: Leaving directory `/tmp/CENTOS76-64_K3.10.0_GCC4.8.5/x86_64-native-linuxapp-gcc/f27d5a6f2f6148e0912cf2ec616367b4/dpdk/build-x86-default/install-root/usr/local/share/dpdk/examples/skeleton'
## Building timer
Unknown option --define-prefix
gmake: Entering directory `/tmp/CENTOS76-64_K3.10.0_GCC4.8.5/x86_64-native-linuxapp-gcc/f27d5a6f2f6148e0912cf2ec616367b4/dpdk/build-x86-default/install-root/usr/local/share/dpdk/examples/timer'
rm -f build/timer build/timer-static build/timer-shared
test -d build && rmdir -p build || true
Unknown option --define-prefix
Unknown option --define-prefix
cc -O3  main.c -o build/timer-shared  
main.c:11:24: fatal error: rte_common.h: No such file or directory
 #include <rte_common.h>
                        ^
compilation terminated.
gmake: *** [build/timer-shared] Error 1
gmake: Leaving directory `/tmp/CENTOS76-64_K3.10.0_GCC4.8.5/x86_64-native-linuxapp-gcc/f27d5a6f2f6148e0912cf2ec616367b4/dpdk/build-x86-default/install-root/usr/local/share/dpdk/examples/timer'

DPDK STV team


More information about the test-report mailing list