[dpdk-test-report] |FAILURE| pw58020[v1, 27/30] bus/fslmc: support multi vfio group

sys_stv at intel.com sys_stv at intel.com
Tue Aug 27 14:33:43 CEST 2019


Test-Label: Intel-compilation
Test-Status: FAILURE
http://dpdk.org/patch/58020

_Compilation issues_

Submitter: Sachin Saxena <sachin.saxena at nxp.com>
Date: 2019-08-27 07:07:27
Reply_mail: 20190827070730.11206-28-sachin.saxena at nxp.com
DPDK git baseline: Repo:dpdk, CommitID: e7fd5a3bbe5636e93a66fd5086f182756624c97a

Makefile build Summary: 22 Builds Done, 18 Successful, 4 Failures

Meson build Summary: 7 Builds Done, 7 Successful, 0 Failures

               +==============================================+===========+==========+
               |                   Makefile                   |   Meson   | Document |
+--------------+------+-------+------+------------+-----------+-----------+----------+
| os           | gcc  | clang | icc  | gcc+shared | gcc+debug | gcc/clang | pdf/html |
+--------------+------+-------+------+------------+-----------+-----------+----------+
| RHEL76-64    | FAIL |       |      |            |           |           |          |
| CENTOS76-64  | FAIL | pass  | pass | FAIL       | FAIL      |           |          |
| UB1804-64    | pass | pass  | pass |            |           | pass      | pass     |
| UB1604-32    | pass |       |      |            |           | pass      |          |
| UB1904-64    | pass |       |      |            |           |           |          |
| UB1604-64    | pass | pass  |      |            |           |           |          |
| FC30-64      | pass | pass  |      |            |           | pass      |          |
| WIN10-64     |      |       |      |            |           | pass      |          |
| FreeBSD12-64 | pass | pass  |      | pass       | pass      | pass      |          |
| RHEL80-64    | pass |       |      |            |           |           |          |
| SUSE15-64    | pass | pass  |      |            |           | pass      |          |
+--------------+------+-------+------+------------+-----------+-----------+----------+

Test environment and configuration as below:

** Makefile build **


OS: RHEL76-64
	Kernel Version: 3.10.0-957.el7.x86_64
	CPU info: Intel(R) Xeon(R) CPU E5-2699 v4 @ 2.20GHz
	GCC Version: gcc (GCC) 4.8.5 20150623 (Red Hat 4.8.5-36)
	Clang Version: NA
	x86_64-native-linuxapp-gcc


OS: CENTOS76-64
	Kernel Version: 3.10.0-957.10.1.el7.x86_64
	CPU info: Intel(R) Xeon(R) CPU E5-2699 v4 @ 2.20GHz
	GCC Version: gcc (GCC) 4.8.5 20150623 (Red Hat 4.8.5-36)
	Clang Version: 3.4.2 (tags/RELEASE_34/dot2-final)
	x86_64-native-linuxapp-clang
	x86_64-native-linuxapp-gcc
	x86_64-native-linuxapp-gcc+debug
	x86_64-native-linuxapp-gcc+shared
	x86_64-native-linuxapp-icc


OS: UB1804-64
	Kernel Version: 4.15.0-20-generic
	CPU info: Intel(R) Xeon(R) CPU E5-2699 v3 @ 2.30GHz
	GCC Version: gcc (Ubuntu 7.3.0-27ubuntu1~18.04) 7.3.0
	Clang Version: 6.0.0-1ubuntu2 (tags/RELEASE_600/final)
	x86_64-native-linuxapp-icc
	x86_64-native-linuxapp-clang
	x86_64-native-linuxapp-gcc


OS: UB1904-64
	Kernel Version: 5.0.0-13-generic
	CPU info: Intel(R) Xeon(R) CPU E5-2699 v3 @ 2.30GHz
	GCC Version: gcc (Ubuntu 8.3.0-6ubuntu1) 8.3.0
	Clang Version: 8.0.0-3 (tags/RELEASE_800/final)
	x86_64-native-linuxapp-gcc


OS: UB1604-32
	Kernel Version: 4.4.0-131-generic
	CPU info: Intel(R) Xeon(R) CPU E5-2699 v3 @ 2.30GHz
	GCC Version: gcc (Ubuntu 5.4.0-6ubuntu1~16.04.11) 5.4.0 20160609
	Clang Version: 3.8.0-2ubuntu4 (tags/RELEASE_380/final)
	i686-native-linuxapp-gcc


OS: UB1604-64
	Kernel Version: 4.4.0-47-generic
	CPU info: Intel(R) Xeon(R) CPU E5-2699 v3 @ 2.30GHz
	GCC Version: gcc (Ubuntu 5.4.0-6ubuntu1~16.04.10) 5.4.0 20160609
	Clang Version: 3.8.0-2ubuntu4 (tags/RELEASE_380/final)
	x86_64-native-linuxapp-clang
	x86_64-native-linuxapp-gcc


OS: FC30-64
	Kernel Version: 5.1.7-300.fc30.x86_64
	CPU info: Intel(R) Xeon(R) CPU E5-2699 v4 @ 2.20GHz
	GCC Version: gcc (GCC) 9.1.1 20190503 (Red Hat 9.1.1-1)
	Clang Version: 8.0.0 (Fedora 8.0.0-1.fc30)
	x86_64-native-linuxapp-gcc
	x86_64-native-linuxapp-clang


OS: FreeBSD12-64
	Kernel Version: 12.0-RC3
	CPU info: Intel(R) Xeon(R) CPU E5-2699 v4 @ 2.20GHz (2194.97-MHz K8-class CPU)
	GCC Version: gcc (FreeBSD Ports Collection) 7.3.0
	Clang Version: 6.0.1 (tags/RELEASE_601/final 335540) (based on LLVM 6.0.1)
	x86_64-native-bsdapp-gcc+debug
	x86_64-native-bsdapp-clang
	x86_64-native-bsdapp-gcc+shared
	x86_64-native-bsdapp-gcc


OS: RHEL80-64
	Kernel Version: 4.18.0-80.el8.x86_64
	CPU info: Intel(R) Xeon(R) CPU E5-2699 v4 @ 2.20GHz
	GCC Version: gcc (GCC) 8.2.1 20180905 (Red Hat 8.2.1-3)
	Clang Version: 6.0.1 (tags/RELEASE_601/final)
	x86_64-native-linuxapp-gcc


OS: SUSE15-64
	Kernel Version: 4.12.14-lp150.11-default
	CPU info: Intel(R) Xeon(R) CPU E5-2699 v4 @ 2.20GHz
	GCC Version: gcc (SUSE Linux) 7.3.1 20180323 [gcc-7-branch revision 258812]
	Clang Version: 5.0.1 (tags/RELEASE_501/final 312548)
	x86_64-native-linuxapp-gcc
	x86_64-native-linuxapp-clang


** Meson build **


OS: UB1804-64
	Kernel Version: 4.15.0-20-generic
	CPU info: Intel(R) Xeon(R) CPU E5-2699 v4 @ 2.20GHz
	GCC Version: gcc (Ubuntu 7.3.0-27ubuntu1~18.04) 7.3.0
	Clang Version: 6.0.0-1ubuntu2 (tags/RELEASE_600/final)
	x86_64-native-linuxapp-doc
	build-gcc-static
	build-gcc-shared
	build-clang-static
	build-clang-shared
	build-x86-default


OS: UB1604-32
	Kernel Version: 4.4.0-131-generic
	CPU info: Intel(R) Xeon(R) CPU E5-2699 v4 @ 2.20GHz
	GCC Version: gcc (Ubuntu 5.4.0-6ubuntu1~16.04.11) 5.4.0 20160609
	Clang Version: 3.8.0-2ubuntu4 (tags/RELEASE_380/final)
	build-gcc-static
	build-gcc-shared
	build-clang-static
	build-clang-shared
	build-x86-default


OS: FC30-64
	Kernel Version: 5.0.9-301.fc30.x86_64
	CPU info: Intel(R) Xeon(R) CPU E5-2699 v4 @ 2.20GHz
	GCC Version: gcc (GCC) 9.1.1 20190503 (Red Hat 9.1.1-1)
	Clang Version: 8.0.0 (Fedora 8.0.0-1.fc30)
	build-gcc-static
	build-gcc-shared
	build-clang-static
	build-clang-shared
	build-x86-default


OS: WIN10-64
	Kernel Version: N/A
	CPU info: N/A
	GCC Version: N/A
	Clang Version: Clang 8.0.0
	x86_64-windows-clang


OS: FreeBSD12-64
	Kernel Version: 12.0-RC3
	CPU info: Intel(R) Xeon(R) CPU E5-2699 v4 @ 2.20GHz (2194.97-MHz K8-class CPU)
	GCC Version: gcc (FreeBSD Ports Collection) 7.3.0
	Clang Version: 6.0.1 (tags/RELEASE_601/final 335540) (based on LLVM 6.0.1)
	build-gcc-static
	build-gcc-shared
	build-clang-static
	build-clang-shared
	build-x86-default


OS: SUSE15-64
	Kernel Version: 4.12.14-lp150.11-default
	CPU info: Intel(R) Xeon(R) CPU E5-2699 v4 @ 2.20GHz
	GCC Version: gcc (SUSE Linux) 7.3.1 20180323 [gcc-7-branch revision 258812]
	Clang Version: 5.0.1 (tags/RELEASE_501/final 312548)
	build-gcc-static
	build-gcc-shared
	build-clang-static
	build-clang-shared
	build-x86-default


*Make Build Failed #1:
OS: RHEL76-64
Target: x86_64-native-linuxapp-gcc
  } destination;
    ^
/tmp/RHEL76-64_K3.10.0_GCC4.8.5/x86_64-native-linuxapp-gcc/edd16ff22df04c86946bacfa5fdd3105/dpdk/drivers/net/dpaa2/dpaa2_ethdev.c: At top level:
cc1: error: unrecognized command line option "-Wno-address-of-packed-member" [-Werror]
cc1: all warnings being treated as errors
make[6]: *** [dpaa2_ethdev.o] Error 1
make[5]: *** [dpaa2] Error 2
make[5]: *** Waiting for unfinished jobs....
  CC e1000_api.o
  CC e1000_ich8lan.o
  AR librte_pmd_bond.a
  INSTALL-LIB librte_pmd_bond.a
--
  INSTALL-LIB librte_pmd_failsafe.a
  AR librte_pmd_enic.a
  INSTALL-LIB librte_pmd_enic.a
  AR librte_pmd_e1000.a
  INSTALL-LIB librte_pmd_e1000.a
make[4]: *** [net] Error 2
make[3]: *** [drivers] Error 2
make[2]: *** [all] Error 2
make[1]: *** [pre_install] Error 2
make: *** [install] Error 2


*Make Build Failed #2:
OS: CENTOS76-64
Target: x86_64-native-linuxapp-gcc
  } destination;
    ^
/tmp/CENTOS76-64_K3.10.0_GCC4.8.5/x86_64-native-linuxapp-gcc/edd16ff22df04c86946bacfa5fdd3105/dpdk/drivers/net/dpaa2/dpaa2_ethdev.c: At top level:
cc1: error: unrecognized command line option "-Wno-address-of-packed-member" [-Werror]
cc1: all warnings being treated as errors
make[6]: *** [dpaa2_ethdev.o] Error 1
make[6]: *** Waiting for unfinished jobs....
  CC t4_hw.o
  CC e1000_82540.o
  AR librte_pmd_dpaa.a
  INSTALL-LIB librte_pmd_dpaa.a
--
  CC e1000_82542.o
  CC rte_cryptodev_scheduler.o
  CC scheduler_roundrobin.o
  CC e1000_82543.o
  CC e1000_82571.o
make[5]: *** [dpaa2] Error 2
make[5]: *** Waiting for unfinished jobs....
  CC e1000_82575.o
  CC scheduler_pkt_size_distr.o
== Build drivers/crypto/null
  CC e1000_i210.o
--
  PMDINFO em_ethdev.o.pmd.c
  CC em_ethdev.o.pmd.o
  LD em_ethdev.o
  AR librte_pmd_e1000.a
  INSTALL-LIB librte_pmd_e1000.a
make[4]: *** [net] Error 2
make[4]: *** Waiting for unfinished jobs....
  CC virtqueue.o
  CC virtio_pci.o
  CC virtio_rxtx.o
  CC virtio_cryptodev.o
--
  PMDINFO dpaa2_sec_dpseci.o.pmd.c
  CC dpaa2_sec_dpseci.o.pmd.o
  LD dpaa2_sec_dpseci.o
  AR librte_pmd_dpaa2_sec.a
  INSTALL-LIB librte_pmd_dpaa2_sec.a
make[3]: *** [drivers] Error 2
make[2]: *** [all] Error 2
make[1]: *** [pre_install] Error 2
make: *** [install] Error 2


*Make Build Failed #3:
OS: CENTOS76-64
Target: x86_64-native-linuxapp-gcc+debug
    ^
== Build drivers/net/enic
/tmp/CENTOS76-64_K3.10.0_GCC4.8.5/x86_64-native-linuxapp-gcc+debug/edd16ff22df04c86946bacfa5fdd3105/dpdk/drivers/net/dpaa2/dpaa2_ethdev.c: At top level:
cc1: error: unrecognized command line option "-Wno-address-of-packed-member" [-Werror]
cc1: all warnings being treated as errors
make[6]: *** [dpaa2_ethdev.o] Error 1
make[5]: *** [dpaa2] Error 2
make[5]: *** Waiting for unfinished jobs....
  CC e1000_api.o
  CC mps_tcam.o
  CC null_crypto_pmd_ops.o
  CC l2t.o
--
  LD dpaa2_sec_dpseci.o
  AR librte_pmd_dpaa2_sec.a
  INSTALL-LIB librte_pmd_dpaa2_sec.a
  AR librte_pmd_enic.a
  INSTALL-LIB librte_pmd_enic.a
make[4]: *** [net] Error 2
make[3]: *** [drivers] Error 2
make[2]: *** [all] Error 2
make[1]: *** [pre_install] Error 2
make: *** [install] Error 2


*Make Build Failed #4:
OS: CENTOS76-64
Target: x86_64-native-linuxapp-gcc+shared
  } destination;
    ^
/tmp/CENTOS76-64_K3.10.0_GCC4.8.5/x86_64-native-linuxapp-gcc+shared/edd16ff22df04c86946bacfa5fdd3105/dpdk/drivers/net/dpaa2/dpaa2_ethdev.c: At top level:
cc1: error: unrecognized command line option "-Wno-address-of-packed-member" [-Werror]
cc1: all warnings being treated as errors
make[6]: *** [dpaa2_ethdev.o] Error 1
make[6]: *** Waiting for unfinished jobs....
  LD librte_pmd_dpaa.so.1.1
== Build drivers/net/enetc
  CC cxgbevf_main.o
  CC rte_eth_bond_args.o
--
  INSTALL-LIB librte_pmd_bond.so.2.1
== Build drivers/net/fm10k
  CC enetc_ethdev.o
  CC ena_ethdev.o
  CC bnx2x_stats.o
make[5]: *** [dpaa2] Error 2
make[5]: *** Waiting for unfinished jobs....
  CC e1000_82540.o
  CC enic_ethdev.o
  CC e1000_82541.o
  CC bnx2x_ethdev.o
--
  PMDINFO igb_ethdev.o.pmd.c
  CC igb_ethdev.o.pmd.o
  LD igb_ethdev.o
  LD librte_pmd_e1000.so.1.1
  INSTALL-LIB librte_pmd_e1000.so.1.1
make[4]: *** [net] Error 2
make[3]: *** [drivers] Error 2
make[2]: *** [all] Error 2
make[1]: *** [pre_install] Error 2
make: *** [install] Error 2

DPDK STV team


More information about the test-report mailing list