[dpdk-test-report] |FAILURE| pw58192[1/6] net/ice: add Rx flex descriptor definition

sys_stv at intel.com sys_stv at intel.com
Thu Aug 29 14:48:31 CEST 2019


Test-Label: Intel-compilation
Test-Status: FAILURE
http://dpdk.org/patch/58192

_Compilation issues_

Submitter: Leyi Rong <leyi.rong at intel.com>
Date: 2019-08-29 02:34:16
Reply_mail: 20190829023421.112551-2-leyi.rong at intel.com
DPDK git baseline: Repo:dpdk-next-net-intel, CommitID: 02b7430f4dcb05f2c0999de2f3759d0bdd906300

Makefile build Summary: 22 Builds Done, 0 Successful, 22 Failures

Meson build Summary: 7 Builds Done, 2 Successful, 5 Failures

               +==============================================+===========+==========+
               |                   Makefile                   |   Meson   | Document |
+--------------+------+-------+------+------------+-----------+-----------+----------+
| os           | gcc  | clang | icc  | gcc+shared | gcc+debug | gcc/clang | pdf/html |
+--------------+------+-------+------+------------+-----------+-----------+----------+
| RHEL76-64    | FAIL |       |      |            |           |           |          |
| CENTOS76-64  | FAIL | FAIL  | FAIL | FAIL       | FAIL      |           |          |
| UB1804-64    | FAIL | FAIL  | FAIL |            |           | FAIL      | pass     |
| UB1604-32    | FAIL |       |      |            |           | FAIL      |          |
| UB1904-64    | FAIL |       |      |            |           |           |          |
| UB1604-64    | FAIL | FAIL  |      |            |           |           |          |
| FC30-64      | FAIL | FAIL  |      |            |           | FAIL      |          |
| WIN10-64     |      |       |      |            |           | pass      |          |
| FreeBSD12-64 | FAIL | FAIL  |      | FAIL       | FAIL      | FAIL      |          |
| RHEL80-64    | FAIL |       |      |            |           |           |          |
| SUSE15-64    | FAIL | FAIL  |      |            |           | FAIL      |          |
+--------------+------+-------+------+------------+-----------+-----------+----------+

Test environment and configuration as below:

** Makefile build **


OS: RHEL76-64
	Kernel Version: 3.10.0-957.el7.x86_64
	CPU info: Intel(R) Xeon(R) CPU E5-2699 v4 @ 2.20GHz
	GCC Version: gcc (GCC) 4.8.5 20150623 (Red Hat 4.8.5-36)
	Clang Version: NA
	x86_64-native-linuxapp-gcc


OS: CENTOS76-64
	Kernel Version: 3.10.0-957.10.1.el7.x86_64
	CPU info: Intel(R) Xeon(R) CPU E5-2699 v4 @ 2.20GHz
	GCC Version: gcc (GCC) 4.8.5 20150623 (Red Hat 4.8.5-36)
	Clang Version: 3.4.2 (tags/RELEASE_34/dot2-final)
	x86_64-native-linuxapp-gcc+debug
	x86_64-native-linuxapp-clang
	x86_64-native-linuxapp-gcc+shared
	x86_64-native-linuxapp-gcc
	x86_64-native-linuxapp-icc


OS: UB1804-64
	Kernel Version: 4.15.0-20-generic
	CPU info: Intel(R) Xeon(R) CPU E5-2699 v3 @ 2.30GHz
	GCC Version: gcc (Ubuntu 7.3.0-27ubuntu1~18.04) 7.3.0
	Clang Version: 6.0.0-1ubuntu2 (tags/RELEASE_600/final)
	x86_64-native-linuxapp-icc
	x86_64-native-linuxapp-clang
	x86_64-native-linuxapp-gcc


OS: UB1904-64
	Kernel Version: 5.0.0-13-generic
	CPU info: Intel(R) Xeon(R) CPU E5-2699 v3 @ 2.30GHz
	GCC Version: gcc (Ubuntu 8.3.0-6ubuntu1) 8.3.0
	Clang Version: 8.0.0-3 (tags/RELEASE_800/final)
	x86_64-native-linuxapp-gcc


OS: UB1604-32
	Kernel Version: 4.4.0-131-generic
	CPU info: Intel(R) Xeon(R) CPU E5-2699 v3 @ 2.30GHz
	GCC Version: gcc (Ubuntu 5.4.0-6ubuntu1~16.04.11) 5.4.0 20160609
	Clang Version: 3.8.0-2ubuntu4 (tags/RELEASE_380/final)
	i686-native-linuxapp-gcc


OS: UB1604-64
	Kernel Version: 4.4.0-47-generic
	CPU info: Intel(R) Xeon(R) CPU E5-2699 v3 @ 2.30GHz
	GCC Version: gcc (Ubuntu 5.4.0-6ubuntu1~16.04.10) 5.4.0 20160609
	Clang Version: 3.8.0-2ubuntu4 (tags/RELEASE_380/final)
	x86_64-native-linuxapp-clang
	x86_64-native-linuxapp-gcc


OS: FC30-64
	Kernel Version: 5.1.7-300.fc30.x86_64
	CPU info: Intel(R) Xeon(R) CPU E5-2699 v4 @ 2.20GHz
	GCC Version: gcc (GCC) 9.1.1 20190503 (Red Hat 9.1.1-1)
	Clang Version: 8.0.0 (Fedora 8.0.0-1.fc30)
	x86_64-native-linuxapp-clang
	x86_64-native-linuxapp-gcc


OS: FreeBSD12-64
	Kernel Version: 12.0-RC3
	CPU info: Intel(R) Xeon(R) CPU E5-2699 v4 @ 2.20GHz (2194.97-MHz K8-class CPU)
	GCC Version: gcc (FreeBSD Ports Collection) 7.3.0
	Clang Version: 6.0.1 (tags/RELEASE_601/final 335540) (based on LLVM 6.0.1)
	x86_64-native-bsdapp-gcc+shared
	x86_64-native-bsdapp-gcc+debug
	x86_64-native-bsdapp-gcc
	x86_64-native-bsdapp-clang


OS: RHEL80-64
	Kernel Version: 4.18.0-80.el8.x86_64
	CPU info: Intel(R) Xeon(R) CPU E5-2699 v4 @ 2.20GHz
	GCC Version: gcc (GCC) 8.2.1 20180905 (Red Hat 8.2.1-3)
	Clang Version: 6.0.1 (tags/RELEASE_601/final)
	x86_64-native-linuxapp-gcc


OS: SUSE15-64
	Kernel Version: 4.12.14-lp150.11-default
	CPU info: Intel(R) Xeon(R) CPU E5-2699 v4 @ 2.20GHz
	GCC Version: gcc (SUSE Linux) 7.3.1 20180323 [gcc-7-branch revision 258812]
	Clang Version: 5.0.1 (tags/RELEASE_501/final 312548)
	x86_64-native-linuxapp-gcc
	x86_64-native-linuxapp-clang


** Meson build **


OS: UB1804-64
	Kernel Version: 4.15.0-20-generic
	CPU info: Intel(R) Xeon(R) CPU E5-2699 v4 @ 2.20GHz
	GCC Version: gcc (Ubuntu 7.3.0-27ubuntu1~18.04) 7.3.0
	Clang Version: 6.0.0-1ubuntu2 (tags/RELEASE_600/final)
	x86_64-native-linuxapp-doc
	build-gcc-static
	build-gcc-shared
	build-clang-static
	build-clang-shared
	build-x86-default


OS: UB1604-32
	Kernel Version: 4.4.0-131-generic
	CPU info: Intel(R) Xeon(R) CPU E5-2699 v4 @ 2.20GHz
	GCC Version: gcc (Ubuntu 5.4.0-6ubuntu1~16.04.11) 5.4.0 20160609
	Clang Version: 3.8.0-2ubuntu4 (tags/RELEASE_380/final)
	build-gcc-static
	build-gcc-shared
	build-clang-static
	build-clang-shared
	build-x86-default


OS: FC30-64
	Kernel Version: 5.0.9-301.fc30.x86_64
	CPU info: Intel(R) Xeon(R) CPU E5-2699 v4 @ 2.20GHz
	GCC Version: gcc (GCC) 9.1.1 20190503 (Red Hat 9.1.1-1)
	Clang Version: 8.0.0 (Fedora 8.0.0-1.fc30)
	build-gcc-static
	build-gcc-shared
	build-clang-static
	build-clang-shared
	build-x86-default


OS: WIN10-64
	Kernel Version: N/A
	CPU info: N/A
	GCC Version: N/A
	Clang Version: Clang 8.0.0
	x86_64-windows-clang


OS: FreeBSD12-64
	Kernel Version: 12.0-RC3
	CPU info: Intel(R) Xeon(R) CPU E5-2699 v4 @ 2.20GHz (2194.97-MHz K8-class CPU)
	GCC Version: gcc (FreeBSD Ports Collection) 7.3.0
	Clang Version: 6.0.1 (tags/RELEASE_601/final 335540) (based on LLVM 6.0.1)
	build-gcc-static
	build-gcc-shared
	build-clang-static
	build-clang-shared
	build-x86-default


OS: SUSE15-64
	Kernel Version: 4.12.14-lp150.11-default
	CPU info: Intel(R) Xeon(R) CPU E5-2699 v4 @ 2.20GHz
	GCC Version: gcc (SUSE Linux) 7.3.1 20180323 [gcc-7-branch revision 258812]
	Clang Version: 5.0.1 (tags/RELEASE_501/final 312548)
	build-gcc-static
	build-gcc-shared
	build-clang-static
	build-clang-shared
	build-x86-default


*Make Build Failed #1:
OS: UB1604-64
Target: x86_64-native-linuxapp-clang
                        ^~~~~~~~~~~~~~~~~
/tmp/UB1604-64_K4.4.0_Clang3.8.0/x86_64-native-linuxapp-clang/29e674b1a6904bb3802ca0db9b6e1417/dpdk/x86_64-native-linuxapp-clang/include/rte_common.h:651:28: note: expanded from macro 'RTE_DIM'
#define RTE_DIM(a)      (sizeof (a) / sizeof ((a)[0]))
                                ^~~
6 errors generated.
/tmp/UB1604-64_K4.4.0_Clang3.8.0/x86_64-native-linuxapp-clang/29e674b1a6904bb3802ca0db9b6e1417/dpdk/mk/internal/rte.compile-pre.mk:114: recipe for target 'ice_ethdev.o' failed
make[6]: *** [ice_ethdev.o] Error 1
/tmp/UB1604-64_K4.4.0_Clang3.8.0/x86_64-native-linuxapp-clang/29e674b1a6904bb3802ca0db9b6e1417/dpdk/mk/rte.subdir.mk:35: recipe for target 'ice' failed
make[5]: *** [ice] Error 2
make[5]: *** Waiting for unfinished jobs....
  CC sfc.o
  CC sfc_mcdi.o
  PMDINFO i40e_ethdev_vf.o.pmd.c
  CC i40e_ethdev_vf.o.pmd.o
--
  CC hunt_nic.o
  CC medford_nic.o
  CC medford2_nic.o
  AR librte_pmd_sfc_efx.a
  INSTALL-LIB librte_pmd_sfc_efx.a
/tmp/UB1604-64_K4.4.0_Clang3.8.0/x86_64-native-linuxapp-clang/29e674b1a6904bb3802ca0db9b6e1417/dpdk/mk/rte.subdir.mk:35: recipe for target 'net' failed
make[4]: *** [net] Error 2
/tmp/UB1604-64_K4.4.0_Clang3.8.0/x86_64-native-linuxapp-clang/29e674b1a6904bb3802ca0db9b6e1417/dpdk/mk/rte.sdkbuild.mk:46: recipe for target 'drivers' failed
make[3]: *** [drivers] Error 2
/tmp/UB1604-64_K4.4.0_Clang3.8.0/x86_64-native-linuxapp-clang/29e674b1a6904bb3802ca0db9b6e1417/dpdk/mk/rte.sdkroot.mk:98: recipe for target 'all' failed
make[2]: *** [all] Error 2
/tmp/UB1604-64_K4.4.0_Clang3.8.0/x86_64-native-linuxapp-clang/29e674b1a6904bb3802ca0db9b6e1417/dpdk/mk/rte.sdkinstall.mk:60: recipe for target 'pre_install' failed
make[1]: *** [pre_install] Error 2
/tmp/UB1604-64_K4.4.0_Clang3.8.0/x86_64-native-linuxapp-clang/29e674b1a6904bb3802ca0db9b6e1417/dpdk/mk/rte.sdkroot.mk:77: recipe for target 'install' failed
make: *** [install] Error 2


*Make Build Failed #2:
OS: UB1604-32
Target: i686-native-linuxapp-gcc
 ice_rxdid_to_proto_xtr_type(uint8_t rxdid)
 ^
/tmp/UB1604-32_K4.4.0_GCC5.4.0/i686-native-linuxapp-gcc/29e674b1a6904bb3802ca0db9b6e1417/dpdk/drivers/net/ice/ice_rxtx.c: At top level:
cc1: error: unrecognized command line option ‘-Wno-address-of-packed-member’ [-Werror]
cc1: all warnings being treated as errors
/tmp/UB1604-32_K4.4.0_GCC5.4.0/i686-native-linuxapp-gcc/29e674b1a6904bb3802ca0db9b6e1417/dpdk/mk/internal/rte.compile-pre.mk:114: recipe for target 'ice_rxtx.o' failed
make[6]: *** [ice_rxtx.o] Error 1
make[6]: *** Waiting for unfinished jobs....
  CC nicvf_mbox.o
  CC tap_netlink.o
/tmp/UB1604-32_K4.4.0_GCC5.4.0/i686-native-linuxapp-gcc/29e674b1a6904bb3802ca0db9b6e1417/dpdk/drivers/net/ice/ice_ethdev.c: In function ‘ice_proto_xtr_support’:
/tmp/UB1604-32_K4.4.0_GCC5.4.0/i686-native-linuxapp-gcc/29e674b1a6904bb3802ca0db9b6e1417/dpdk/drivers/net/ice/ice_ethdev.c:528:5: error: ‘ICE_RXDID_COMMS_AUX_VLAN’ undeclared (first use in this function)
--
  CC tap_tcmsgs.o
/tmp/UB1604-32_K4.4.0_GCC5.4.0/i686-native-linuxapp-gcc/29e674b1a6904bb3802ca0db9b6e1417/dpdk/drivers/net/ice/ice_ethdev.c: At top level:
  CC ecore_int.o
cc1: error: unrecognized command line option ‘-Wno-address-of-packed-member’ [-Werror]
cc1: all warnings being treated as errors
/tmp/UB1604-32_K4.4.0_GCC5.4.0/i686-native-linuxapp-gcc/29e674b1a6904bb3802ca0db9b6e1417/dpdk/mk/internal/rte.compile-pre.mk:114: recipe for target 'ice_ethdev.o' failed
make[6]: *** [ice_ethdev.o] Error 1
/tmp/UB1604-32_K4.4.0_GCC5.4.0/i686-native-linuxapp-gcc/29e674b1a6904bb3802ca0db9b6e1417/dpdk/mk/rte.subdir.mk:35: recipe for target 'ice' failed
make[5]: *** [ice] Error 2
make[5]: *** Waiting for unfinished jobs....
  CC ecore_dcbx.o
  CC nicvf_ethdev.o
  CC ixgbe_ethdev.o
  CC nicvf_bsvf.o
--
  AR librte_pmd_qede.a
  INSTALL-LIB librte_pmd_qede.a
  AR librte_pmd_ixgbe.a
  INSTALL-LIB librte_pmd_ixgbe.a
make[6]: warning:  Clock skew detected.  Your build may be incomplete.
/tmp/UB1604-32_K4.4.0_GCC5.4.0/i686-native-linuxapp-gcc/29e674b1a6904bb3802ca0db9b6e1417/dpdk/mk/rte.subdir.mk:35: recipe for target 'net' failed
make[4]: *** [net] Error 2
/tmp/UB1604-32_K4.4.0_GCC5.4.0/i686-native-linuxapp-gcc/29e674b1a6904bb3802ca0db9b6e1417/dpdk/mk/rte.sdkbuild.mk:46: recipe for target 'drivers' failed
make[3]: *** [drivers] Error 2
/tmp/UB1604-32_K4.4.0_GCC5.4.0/i686-native-linuxapp-gcc/29e674b1a6904bb3802ca0db9b6e1417/dpdk/mk/rte.sdkroot.mk:98: recipe for target 'all' failed
make[2]: *** [all] Error 2
/tmp/UB1604-32_K4.4.0_GCC5.4.0/i686-native-linuxapp-gcc/29e674b1a6904bb3802ca0db9b6e1417/dpdk/mk/rte.sdkinstall.mk:60: recipe for target 'pre_install' failed
make[1]: *** [pre_install] Error 2
/tmp/UB1604-32_K4.4.0_GCC5.4.0/i686-native-linuxapp-gcc/29e674b1a6904bb3802ca0db9b6e1417/dpdk/mk/rte.sdkroot.mk:77: recipe for target 'install' failed
make: *** [install] Error 2


*Make Build Failed #3:
OS: UB1904-64
Target: x86_64-native-linuxapp-gcc
     ^~~~~~~~~~~~~~~~~~~~~~~
     ICE_RXDID_LAST
/tmp/UB1904-64_K4.18.0_GCC8.3.0/x86_64-native-linuxapp-gcc/29e674b1a6904bb3802ca0db9b6e1417/dpdk/drivers/net/ice/ice_ethdev.c: At top level:
cc1: error: unrecognized command line option ‘-Wno-address-of-packed-member’ [-Werror]
cc1: all warnings being treated as errors
make[6]: *** [/tmp/UB1904-64_K4.18.0_GCC8.3.0/x86_64-native-linuxapp-gcc/29e674b1a6904bb3802ca0db9b6e1417/dpdk/mk/internal/rte.compile-pre.mk:114: ice_ethdev.o] Error 1
make[5]: *** [/tmp/UB1904-64_K4.18.0_GCC8.3.0/x86_64-native-linuxapp-gcc/29e674b1a6904bb3802ca0db9b6e1417/dpdk/mk/rte.subdir.mk:37: ice] Error 2
make[5]: *** Waiting for unfinished jobs....
  CC ixgbe_dcb.o
  CC i40e_pf.o
  PMDINFO i40e_ethdev.o.pmd.c
  CC i40e_ethdev.o.pmd.o
--
  CC ixgbe_ethdev.o.pmd.o
  LD ixgbe_ethdev.o
  AR librte_pmd_ixgbe.a
  INSTALL-LIB librte_pmd_ixgbe.a
make[6]: warning:  Clock skew detected.  Your build may be incomplete.
make[4]: *** [/tmp/UB1904-64_K4.18.0_GCC8.3.0/x86_64-native-linuxapp-gcc/29e674b1a6904bb3802ca0db9b6e1417/dpdk/mk/rte.subdir.mk:35: net] Error 2
make[3]: *** [/tmp/UB1904-64_K4.18.0_GCC8.3.0/x86_64-native-linuxapp-gcc/29e674b1a6904bb3802ca0db9b6e1417/dpdk/mk/rte.sdkbuild.mk:46: drivers] Error 2
make[2]: *** [/tmp/UB1904-64_K4.18.0_GCC8.3.0/x86_64-native-linuxapp-gcc/29e674b1a6904bb3802ca0db9b6e1417/dpdk/mk/rte.sdkroot.mk:99: all] Error 2
make[1]: *** [/tmp/UB1904-64_K4.18.0_GCC8.3.0/x86_64-native-linuxapp-gcc/29e674b1a6904bb3802ca0db9b6e1417/dpdk/mk/rte.sdkinstall.mk:61: pre_install] Error 2
make: *** [/tmp/UB1904-64_K4.18.0_GCC8.3.0/x86_64-native-linuxapp-gcc/29e674b1a6904bb3802ca0db9b6e1417/dpdk/mk/rte.sdkroot.mk:77: install] Error 2


*Make Build Failed #4:
OS: UB1804-64
Target: x86_64-native-linuxapp-icc
/tmp/UB1804-64_K4.15.0_ICC19.0.0/x86_64-native-linuxapp-icc/29e674b1a6904bb3802ca0db9b6e1417/dpdk/drivers/net/ice/ice_ethdev.c(535): error: identifier "ICE_RXDID_COMMS_AUX_TCP" is undefined
  		{ ICE_RXDID_COMMS_AUX_TCP, ICE_PROT_TCP_IL, ICE_PROT_ID_INVAL },
  		  ^

compilation aborted for /tmp/UB1804-64_K4.15.0_ICC19.0.0/x86_64-native-linuxapp-icc/29e674b1a6904bb3802ca0db9b6e1417/dpdk/drivers/net/ice/ice_ethdev.c (code 2)
/tmp/UB1804-64_K4.15.0_ICC19.0.0/x86_64-native-linuxapp-icc/29e674b1a6904bb3802ca0db9b6e1417/dpdk/mk/internal/rte.compile-pre.mk:114: recipe for target 'ice_ethdev.o' failed
make[6]: *** [ice_ethdev.o] Error 2
make[6]: *** Waiting for unfinished jobs....
  CC ixgbe_vf.o
  CC ixgbe_hv_vf.o
  CC nfp_cpp_pcie_ops.o
  AR librte_pmd_netvsc.a
  INSTALL-LIB librte_pmd_netvsc.a
  CC nfp_mutex.o
  CC octeontx_rxtx.o
/tmp/UB1804-64_K4.15.0_ICC19.0.0/x86_64-native-linuxapp-icc/29e674b1a6904bb3802ca0db9b6e1417/dpdk/mk/rte.subdir.mk:35: recipe for target 'ice' failed
make[5]: *** [ice] Error 2
make[5]: *** Waiting for unfinished jobs....
  CC octeontx_pkovf.o
  PMDINFO rte_eth_null.o.pmd.c
  CC rte_eth_null.o.pmd.o
  PMDINFO bnxt_ethdev.o.pmd.c
--
  PMDINFO otx2_ethdev.o.pmd.c
  CC otx2_ethdev.o.pmd.o
  LD otx2_ethdev.o
  AR librte_pmd_octeontx2.a
  INSTALL-LIB librte_pmd_octeontx2.a
/tmp/UB1804-64_K4.15.0_ICC19.0.0/x86_64-native-linuxapp-icc/29e674b1a6904bb3802ca0db9b6e1417/dpdk/mk/rte.subdir.mk:35: recipe for target 'net' failed
make[4]: *** [net] Error 2
/tmp/UB1804-64_K4.15.0_ICC19.0.0/x86_64-native-linuxapp-icc/29e674b1a6904bb3802ca0db9b6e1417/dpdk/mk/rte.sdkbuild.mk:46: recipe for target 'drivers' failed
make[3]: *** [drivers] Error 2
/tmp/UB1804-64_K4.15.0_ICC19.0.0/x86_64-native-linuxapp-icc/29e674b1a6904bb3802ca0db9b6e1417/dpdk/mk/rte.sdkroot.mk:98: recipe for target 'all' failed
make[2]: *** [all] Error 2
/tmp/UB1804-64_K4.15.0_ICC19.0.0/x86_64-native-linuxapp-icc/29e674b1a6904bb3802ca0db9b6e1417/dpdk/mk/rte.sdkinstall.mk:60: recipe for target 'pre_install' failed
make[1]: *** [pre_install] Error 2
/tmp/UB1804-64_K4.15.0_ICC19.0.0/x86_64-native-linuxapp-icc/29e674b1a6904bb3802ca0db9b6e1417/dpdk/mk/rte.sdkroot.mk:77: recipe for target 'install' failed
make: *** [install] Error 2


*Make Build Failed #5:
OS: UB1804-64
Target: x86_64-native-linuxapp-clang
                        ^~~~~~~~~~~~~~~~~
/tmp/UB1804-64_K4.15.0_Clang6.0.0/x86_64-native-linuxapp-clang/29e674b1a6904bb3802ca0db9b6e1417/dpdk/x86_64-native-linuxapp-clang/include/rte_common.h:651:28: note: expanded from macro 'RTE_DIM'
#define RTE_DIM(a)      (sizeof (a) / sizeof ((a)[0]))
                                ^~~
6 errors generated.
/tmp/UB1804-64_K4.15.0_Clang6.0.0/x86_64-native-linuxapp-clang/29e674b1a6904bb3802ca0db9b6e1417/dpdk/mk/internal/rte.compile-pre.mk:114: recipe for target 'ice_ethdev.o' failed
make[6]: *** [ice_ethdev.o] Error 1
make[6]: *** Waiting for unfinished jobs....
  CC ixgbe_dcb.o
  AR librte_pmd_nfp.a
  INSTALL-LIB librte_pmd_nfp.a
/tmp/UB1804-64_K4.15.0_Clang6.0.0/x86_64-native-linuxapp-clang/29e674b1a6904bb3802ca0db9b6e1417/dpdk/drivers/net/ice/ice_rxtx.c:22:4: error: use of undeclared identifier 'ICE_RXDID_COMMS_AUX_VLAN'
--
#define rte_le_to_cpu_16(x) (x)
                             ^
/tmp/UB1804-64_K4.15.0_Clang6.0.0/x86_64-native-linuxapp-clang/29e674b1a6904bb3802ca0db9b6e1417/dpdk/drivers/net/ice/ice_rxtx.c:1118:18: note: forward declaration of 'struct ice_32b_rx_flex_desc_comms'
        volatile struct ice_32b_rx_flex_desc_comms *desc =
                        ^
fatal error: too many errors emitted, stopping now [-ferror-limit=]
20 errors generated.
/tmp/UB1804-64_K4.15.0_Clang6.0.0/x86_64-native-linuxapp-clang/29e674b1a6904bb3802ca0db9b6e1417/dpdk/mk/internal/rte.compile-pre.mk:114: recipe for target 'ice_rxtx.o' failed
make[6]: *** [ice_rxtx.o] Error 1
/tmp/UB1804-64_K4.15.0_Clang6.0.0/x86_64-native-linuxapp-clang/29e674b1a6904bb3802ca0db9b6e1417/dpdk/mk/rte.subdir.mk:35: recipe for target 'ice' failed
make[5]: *** [ice] Error 2
make[5]: *** Waiting for unfinished jobs....
  CC bnxt_txr.o
  CC ixgbe_dcb_82599.o
  PMDINFO i40e_ethdev_vf.o.pmd.c
  CC i40e_ethdev_vf.o.pmd.o
--
  PMDINFO otx2_ethdev.o.pmd.c
  CC otx2_ethdev.o.pmd.o
  LD otx2_ethdev.o
  AR librte_pmd_octeontx2.a
  INSTALL-LIB librte_pmd_octeontx2.a
/tmp/UB1804-64_K4.15.0_Clang6.0.0/x86_64-native-linuxapp-clang/29e674b1a6904bb3802ca0db9b6e1417/dpdk/mk/rte.subdir.mk:35: recipe for target 'net' failed
make[4]: *** [net] Error 2
/tmp/UB1804-64_K4.15.0_Clang6.0.0/x86_64-native-linuxapp-clang/29e674b1a6904bb3802ca0db9b6e1417/dpdk/mk/rte.sdkbuild.mk:46: recipe for target 'drivers' failed
make[3]: *** [drivers] Error 2
/tmp/UB1804-64_K4.15.0_Clang6.0.0/x86_64-native-linuxapp-clang/29e674b1a6904bb3802ca0db9b6e1417/dpdk/mk/rte.sdkroot.mk:98: recipe for target 'all' failed
make[2]: *** [all] Error 2
/tmp/UB1804-64_K4.15.0_Clang6.0.0/x86_64-native-linuxapp-clang/29e674b1a6904bb3802ca0db9b6e1417/dpdk/mk/rte.sdkinstall.mk:60: recipe for target 'pre_install' failed
make[1]: *** [pre_install] Error 2
/tmp/UB1804-64_K4.15.0_Clang6.0.0/x86_64-native-linuxapp-clang/29e674b1a6904bb3802ca0db9b6e1417/dpdk/mk/rte.sdkroot.mk:77: recipe for target 'install' failed
make: *** [install] Error 2


*Make Build Failed #6:
OS: SUSE15-64
Target: x86_64-native-linuxapp-gcc
     ^~~~~~~~~~~~~~~~~~~~~~~
     ICE_RXDID_COMMS_AUX_IPV6
/tmp/SUSE15-64_K4.12.14_GCC7.3.1/x86_64-native-linuxapp-gcc/29e674b1a6904bb3802ca0db9b6e1417/dpdk/drivers/net/ice/ice_ethdev.c: At top level:
cc1: error: unrecognized command line option ‘-Wno-address-of-packed-member’ [-Werror]
cc1: all warnings being treated as errors
make[6]: *** [/tmp/SUSE15-64_K4.12.14_GCC7.3.1/x86_64-native-linuxapp-gcc/29e674b1a6904bb3802ca0db9b6e1417/dpdk/mk/internal/rte.compile-pre.mk:114: ice_ethdev.o] Error 1
  CC hn_ethdev.o
make[5]: *** [/tmp/SUSE15-64_K4.12.14_GCC7.3.1/x86_64-native-linuxapp-gcc/29e674b1a6904bb3802ca0db9b6e1417/dpdk/mk/rte.subdir.mk:37: ice] Error 2
make[5]: *** Waiting for unfinished jobs....
== Build drivers/net/null
  CC hn_rxtx.o
  AR librte_pmd_hinic.a
  INSTALL-LIB librte_pmd_hinic.a
--
  LD ixgbe_ethdev.o
  AR librte_pmd_ixgbe.a
  INSTALL-LIB librte_pmd_ixgbe.a
  AR librte_pmd_i40e.a
  INSTALL-LIB librte_pmd_i40e.a
make[4]: *** [/tmp/SUSE15-64_K4.12.14_GCC7.3.1/x86_64-native-linuxapp-gcc/29e674b1a6904bb3802ca0db9b6e1417/dpdk/mk/rte.subdir.mk:35: net] Error 2
make[3]: *** [/tmp/SUSE15-64_K4.12.14_GCC7.3.1/x86_64-native-linuxapp-gcc/29e674b1a6904bb3802ca0db9b6e1417/dpdk/mk/rte.sdkbuild.mk:46: drivers] Error 2
make[2]: *** [/tmp/SUSE15-64_K4.12.14_GCC7.3.1/x86_64-native-linuxapp-gcc/29e674b1a6904bb3802ca0db9b6e1417/dpdk/mk/rte.sdkroot.mk:99: all] Error 2
make[1]: *** [/tmp/SUSE15-64_K4.12.14_GCC7.3.1/x86_64-native-linuxapp-gcc/29e674b1a6904bb3802ca0db9b6e1417/dpdk/mk/rte.sdkinstall.mk:61: pre_install] Error 2
make: *** [/tmp/SUSE15-64_K4.12.14_GCC7.3.1/x86_64-native-linuxapp-gcc/29e674b1a6904bb3802ca0db9b6e1417/dpdk/mk/rte.sdkroot.mk:77: install] Error 2


*Make Build Failed #7:
OS: FC30-64
Target: x86_64-native-linuxapp-clang
/tmp/FC30-64_K4.20_Clang8.0.0/x86_64-native-linuxapp-clang/29e674b1a6904bb3802ca0db9b6e1417/dpdk/x86_64-native-linuxapp-clang/include/rte_common.h:651:28: note: expanded from macro 'RTE_DIM'
#define RTE_DIM(a)      (sizeof (a) / sizeof ((a)[0]))
                                ^~~
  CC ice_rxtx_vec_sse.o
6 errors generated.
make[6]: *** [/tmp/FC30-64_K4.20_Clang8.0.0/x86_64-native-linuxapp-clang/29e674b1a6904bb3802ca0db9b6e1417/dpdk/mk/internal/rte.compile-pre.mk:116: ice_ethdev.o] Error 1
make[6]: *** Waiting for unfinished jobs....
  CC ixgbe_api.o
  CC i40e_flow.o
  CC ixgbe_vf.o
  CC lio_ethdev.o
--
#define rte_le_to_cpu_16(x) (x)
                             ^
/tmp/FC30-64_K4.20_Clang8.0.0/x86_64-native-linuxapp-clang/29e674b1a6904bb3802ca0db9b6e1417/dpdk/drivers/net/ice/ice_rxtx.c:1118:18: note: forward declaration of 'struct ice_32b_rx_flex_desc_comms'
        volatile struct ice_32b_rx_flex_desc_comms *desc =
                        ^
fatal error: too many errors emitted, stopping now [-ferror-limit=]
20 errors generated.
make[6]: *** [/tmp/FC30-64_K4.20_Clang8.0.0/x86_64-native-linuxapp-clang/29e674b1a6904bb3802ca0db9b6e1417/dpdk/mk/internal/rte.compile-pre.mk:116: ice_rxtx.o] Error 1
  CC ixgbe_dcb_82599.o
  CC i40e_rxtx_vec_avx2.o
  CC lio_rxtx.o
  CC ixgbe_dcb_82598.o
  PMDINFO lio_ethdev.o.pmd.c
  CC lio_ethdev.o.pmd.o
  CC lio_23xx_vf.o
  LD lio_ethdev.o
  CC ixgbe_mbx.o
make[5]: *** [/tmp/FC30-64_K4.20_Clang8.0.0/x86_64-native-linuxapp-clang/29e674b1a6904bb3802ca0db9b6e1417/dpdk/mk/rte.subdir.mk:37: ice] Error 2
make[5]: *** Waiting for unfinished jobs....
== Build drivers/net/memif
  CC lio_mbox.o
  CC ixgbe_rxtx.o
  CC ixgbe_ethdev.o
--
  PMDINFO ixgbe_ethdev.o.pmd.c
  CC ixgbe_ethdev.o.pmd.o
  LD ixgbe_ethdev.o
  AR librte_pmd_ixgbe.a
  INSTALL-LIB librte_pmd_ixgbe.a
make[4]: *** [/tmp/FC30-64_K4.20_Clang8.0.0/x86_64-native-linuxapp-clang/29e674b1a6904bb3802ca0db9b6e1417/dpdk/mk/rte.subdir.mk:35: net] Error 2
make[3]: *** [/tmp/FC30-64_K4.20_Clang8.0.0/x86_64-native-linuxapp-clang/29e674b1a6904bb3802ca0db9b6e1417/dpdk/mk/rte.sdkbuild.mk:46: drivers] Error 2
make[2]: *** [/tmp/FC30-64_K4.20_Clang8.0.0/x86_64-native-linuxapp-clang/29e674b1a6904bb3802ca0db9b6e1417/dpdk/mk/rte.sdkroot.mk:99: all] Error 2
make[1]: *** [/tmp/FC30-64_K4.20_Clang8.0.0/x86_64-native-linuxapp-clang/29e674b1a6904bb3802ca0db9b6e1417/dpdk/mk/rte.sdkinstall.mk:61: pre_install] Error 2
make: *** [/tmp/FC30-64_K4.20_Clang8.0.0/x86_64-native-linuxapp-clang/29e674b1a6904bb3802ca0db9b6e1417/dpdk/mk/rte.sdkroot.mk:77: install] Error 2


*Make Build Failed #8:
OS: RHEL76-64
Target: x86_64-native-linuxapp-gcc
     ^
/tmp/RHEL76-64_K3.10.0_GCC4.8.5/x86_64-native-linuxapp-gcc/29e674b1a6904bb3802ca0db9b6e1417/dpdk/drivers/net/ice/ice_ethdev.c: At top level:
cc1: error: unrecognized command line option "-Wno-address-of-packed-member" [-Werror]
cc1: all warnings being treated as errors
  CC otx2_rx.o
make[6]: *** [ice_ethdev.o] Error 1
make[5]: *** [ice] Error 2
make[5]: *** Waiting for unfinished jobs....
  CC bnxt_filter.o
  CC ixgbe_x550.o
  CC ixgbe_phy.o
  CC rte_eth_null.o
--
  LD ixgbe_ethdev.o
  AR librte_pmd_octeontx2.a
  INSTALL-LIB librte_pmd_octeontx2.a
  AR librte_pmd_ixgbe.a
  INSTALL-LIB librte_pmd_ixgbe.a
make[4]: *** [net] Error 2
make[3]: *** [drivers] Error 2
make[2]: *** [all] Error 2
make[1]: *** [pre_install] Error 2
make: *** [install] Error 2


*Make Build Failed #9:
OS: FC30-64
Target: x86_64-native-linuxapp-gcc
  533 |   { ICE_RXDID_COMMS_AUX_IPV6_FLOW, ICE_PROT_IPV6_OF_OR_S,
      |     ^~~~~~~~~~~~~~~~~~~~~~~~~~~~~
/tmp/FC30-64_K4.20_GCC9.1.1/x86_64-native-linuxapp-gcc/29e674b1a6904bb3802ca0db9b6e1417/dpdk/drivers/net/ice/ice_ethdev.c:535:5: error: ‘ICE_RXDID_COMMS_AUX_TCP’ undeclared (first use in this function)
  535 |   { ICE_RXDID_COMMS_AUX_TCP, ICE_PROT_TCP_IL, ICE_PROT_ID_INVAL },
      |     ^~~~~~~~~~~~~~~~~~~~~~~
make[6]: *** [/tmp/FC30-64_K4.20_GCC9.1.1/x86_64-native-linuxapp-gcc/29e674b1a6904bb3802ca0db9b6e1417/dpdk/mk/internal/rte.compile-pre.mk:116: ice_ethdev.o] Error 1
make[5]: *** [/tmp/FC30-64_K4.20_GCC9.1.1/x86_64-native-linuxapp-gcc/29e674b1a6904bb3802ca0db9b6e1417/dpdk/mk/rte.subdir.mk:37: ice] Error 2
make[5]: *** Waiting for unfinished jobs....
  CC ixgbe_vf.o
  CC hinic_pmd_rx.o
  CC enic_rxtx_vec_avx2.o
  PMDINFO rte_eth_pcap.o.pmd.c
--
  PMDINFO ixgbe_ethdev.o.pmd.c
  CC ixgbe_ethdev.o.pmd.o
  LD ixgbe_ethdev.o
  AR librte_pmd_ixgbe.a
  INSTALL-LIB librte_pmd_ixgbe.a
make[4]: *** [/tmp/FC30-64_K4.20_GCC9.1.1/x86_64-native-linuxapp-gcc/29e674b1a6904bb3802ca0db9b6e1417/dpdk/mk/rte.subdir.mk:35: net] Error 2
make[3]: *** [/tmp/FC30-64_K4.20_GCC9.1.1/x86_64-native-linuxapp-gcc/29e674b1a6904bb3802ca0db9b6e1417/dpdk/mk/rte.sdkbuild.mk:46: drivers] Error 2
make[2]: *** [/tmp/FC30-64_K4.20_GCC9.1.1/x86_64-native-linuxapp-gcc/29e674b1a6904bb3802ca0db9b6e1417/dpdk/mk/rte.sdkroot.mk:99: all] Error 2
make[1]: *** [/tmp/FC30-64_K4.20_GCC9.1.1/x86_64-native-linuxapp-gcc/29e674b1a6904bb3802ca0db9b6e1417/dpdk/mk/rte.sdkinstall.mk:61: pre_install] Error 2
make: *** [/tmp/FC30-64_K4.20_GCC9.1.1/x86_64-native-linuxapp-gcc/29e674b1a6904bb3802ca0db9b6e1417/dpdk/mk/rte.sdkroot.mk:77: install] Error 2


*Make Build Failed #10:
OS: RHEL80-64
Target: x86_64-native-linuxapp-gcc
   [ICE_RXDID_COMMS_AUX_IPV4]      = PROTO_XTR_IPV4,
    ^~~~~~~~~~~~~~~~~~~~~~~~
    ICE_TX_CTX_EIPT_IPV4
/tmp/RHEL80-64_K3.10.0_GCC8.2.1/x86_64-native-linuxapp-gcc/29e674b1a6904bb3802ca0db9b6e1417/dpdk/drivers/net/ice/ice_rxtx.c:23:4: error: array index in initializer not of integer type
/tmp/RHEL80-64_K3.10.0_GCC8.2.1/x86_64-native-linuxapp-gcc/29e674b1a6904bb3802ca0db9b6e1417/dpdk/drivers/net/ice/ice_rxtx.c:23:4: note: (near initialization for ‘xtr_map’)
make[6]: *** [/tmp/RHEL80-64_K3.10.0_GCC8.2.1/x86_64-native-linuxapp-gcc/29e674b1a6904bb3802ca0db9b6e1417/dpdk/mk/internal/rte.compile-pre.mk:114: ice_ethdev.o] Error 1
make[6]: *** Waiting for unfinished jobs....
  CC ixgbe_hv_vf.o
  CC i40e_ethdev_vf.o
/tmp/RHEL80-64_K3.10.0_GCC8.2.1/x86_64-native-linuxapp-gcc/29e674b1a6904bb3802ca0db9b6e1417/dpdk/drivers/net/ice/ice_rxtx.c:24:4: error: ‘ICE_RXDID_COMMS_AUX_IPV6’ undeclared (first use in this function); did you mean ‘ICE_TX_CTX_EIPT_IPV6’?
   [ICE_RXDID_COMMS_AUX_IPV6]      = PROTO_XTR_IPV6,
--
 ice_rxdid_to_proto_xtr_type(uint8_t rxdid)
                             ~~~~~~~~^~~~~
/tmp/RHEL80-64_K3.10.0_GCC8.2.1/x86_64-native-linuxapp-gcc/29e674b1a6904bb3802ca0db9b6e1417/dpdk/drivers/net/ice/ice_rxtx.c: At top level:
cc1: error: unrecognized command line option ‘-Wno-address-of-packed-member’ [-Werror]
cc1: all warnings being treated as errors
make[6]: *** [/tmp/RHEL80-64_K3.10.0_GCC8.2.1/x86_64-native-linuxapp-gcc/29e674b1a6904bb3802ca0db9b6e1417/dpdk/mk/internal/rte.compile-pre.mk:114: ice_rxtx.o] Error 1
  CC i40e_fdir.o
== Build drivers/net/nfp
  CC hn_ethdev.o
  PMDINFO rte_eth_memif.o.pmd.c
  CC rte_eth_memif.o.pmd.o
--
  CC i40e_ethdev_vf.o.pmd.o
  CC hn_rxtx.o
  LD i40e_ethdev_vf.o
  CC rte_pmd_i40e.o
  CC lio_23xx_vf.o
make[5]: *** [/tmp/RHEL80-64_K3.10.0_GCC8.2.1/x86_64-native-linuxapp-gcc/29e674b1a6904bb3802ca0db9b6e1417/dpdk/mk/rte.subdir.mk:37: ice] Error 2
make[5]: *** Waiting for unfinished jobs....
  CC lio_mbox.o
  CC ixgbe_dcb_82599.o
  AR librte_pmd_memif.a
  INSTALL-LIB librte_pmd_memif.a
--
  PMDINFO nfp_net.o.pmd.c
  CC nfp_net.o.pmd.o
  LD nfp_net.o
  AR librte_pmd_nfp.a
  INSTALL-LIB librte_pmd_nfp.a
make[4]: *** [/tmp/RHEL80-64_K3.10.0_GCC8.2.1/x86_64-native-linuxapp-gcc/29e674b1a6904bb3802ca0db9b6e1417/dpdk/mk/rte.subdir.mk:35: net] Error 2
make[3]: *** [/tmp/RHEL80-64_K3.10.0_GCC8.2.1/x86_64-native-linuxapp-gcc/29e674b1a6904bb3802ca0db9b6e1417/dpdk/mk/rte.sdkbuild.mk:46: drivers] Error 2
make[2]: *** [/tmp/RHEL80-64_K3.10.0_GCC8.2.1/x86_64-native-linuxapp-gcc/29e674b1a6904bb3802ca0db9b6e1417/dpdk/mk/rte.sdkroot.mk:99: all] Error 2
make[1]: *** [/tmp/RHEL80-64_K3.10.0_GCC8.2.1/x86_64-native-linuxapp-gcc/29e674b1a6904bb3802ca0db9b6e1417/dpdk/mk/rte.sdkinstall.mk:61: pre_install] Error 2
make: *** [/tmp/RHEL80-64_K3.10.0_GCC8.2.1/x86_64-native-linuxapp-gcc/29e674b1a6904bb3802ca0db9b6e1417/dpdk/mk/rte.sdkroot.mk:77: install] Error 2


*Make Build Failed #11:
OS: SUSE15-64
Target: x86_64-native-linuxapp-clang
                                ^~~
  CC hinic_pmd_wq.o
  CC iavf_rxtx_vec_sse.o
6 errors generated.
  CC hinic_pmd_ethdev.o
make[6]: *** [/tmp/SUSE15-64_K4.12.14_Clang5.0.1/x86_64-native-linuxapp-clang/29e674b1a6904bb3802ca0db9b6e1417/dpdk/mk/internal/rte.compile-pre.mk:114: ice_ethdev.o] Error 1
make[6]: *** Waiting for unfinished jobs....
  CC ice_rxtx.o
  CC hinic_pmd_rx.o
  CC ixgbe_api.o
== Build drivers/net/liquidio
--
#define rte_le_to_cpu_16(x) (x)
                             ^
/tmp/SUSE15-64_K4.12.14_Clang5.0.1/x86_64-native-linuxapp-clang/29e674b1a6904bb3802ca0db9b6e1417/dpdk/drivers/net/ice/ice_rxtx.c:1118:18: note: forward declaration of 'struct ice_32b_rx_flex_desc_comms'
        volatile struct ice_32b_rx_flex_desc_comms *desc =
                        ^
fatal error: too many errors emitted, stopping now [-ferror-limit=]
20 errors generated.
make[6]: *** [/tmp/SUSE15-64_K4.12.14_Clang5.0.1/x86_64-native-linuxapp-clang/29e674b1a6904bb3802ca0db9b6e1417/dpdk/mk/internal/rte.compile-pre.mk:116: ice_rxtx.o] Error 1
make[5]: *** [/tmp/SUSE15-64_K4.12.14_Clang5.0.1/x86_64-native-linuxapp-clang/29e674b1a6904bb3802ca0db9b6e1417/dpdk/mk/rte.subdir.mk:37: ice] Error 2
make[5]: *** Waiting for unfinished jobs....
  CC base/vnic_dev.o
  PMDINFO rte_eth_memif.o.pmd.c
  CC rte_eth_memif.o.pmd.o
  LD rte_eth_memif.o
--
  INSTALL-LIB librte_pmd_i40e.a
  CC ixgbe_ethdev.o.pmd.o
  LD ixgbe_ethdev.o
  AR librte_pmd_ixgbe.a
  INSTALL-LIB librte_pmd_ixgbe.a
make[4]: *** [/tmp/SUSE15-64_K4.12.14_Clang5.0.1/x86_64-native-linuxapp-clang/29e674b1a6904bb3802ca0db9b6e1417/dpdk/mk/rte.subdir.mk:35: net] Error 2
make[3]: *** [/tmp/SUSE15-64_K4.12.14_Clang5.0.1/x86_64-native-linuxapp-clang/29e674b1a6904bb3802ca0db9b6e1417/dpdk/mk/rte.sdkbuild.mk:46: drivers] Error 2
make[2]: *** [/tmp/SUSE15-64_K4.12.14_Clang5.0.1/x86_64-native-linuxapp-clang/29e674b1a6904bb3802ca0db9b6e1417/dpdk/mk/rte.sdkroot.mk:99: all] Error 2
make[1]: *** [/tmp/SUSE15-64_K4.12.14_Clang5.0.1/x86_64-native-linuxapp-clang/29e674b1a6904bb3802ca0db9b6e1417/dpdk/mk/rte.sdkinstall.mk:61: pre_install] Error 2
make: *** [/tmp/SUSE15-64_K4.12.14_Clang5.0.1/x86_64-native-linuxapp-clang/29e674b1a6904bb3802ca0db9b6e1417/dpdk/mk/rte.sdkroot.mk:77: install] Error 2


*Make Build Failed #12:
OS: UB1604-64
Target: x86_64-native-linuxapp-gcc
   { ICE_RXDID_COMMS_AUX_TCP, ICE_PROT_TCP_IL, ICE_PROT_ID_INVAL },
     ^
/tmp/UB1604-64_K4.4.0_GCC5.4.0/x86_64-native-linuxapp-gcc/29e674b1a6904bb3802ca0db9b6e1417/dpdk/drivers/net/ice/ice_ethdev.c: At top level:
cc1: error: unrecognized command line option ‘-Wno-address-of-packed-member’ [-Werror]
cc1: all warnings being treated as errors
/tmp/UB1604-64_K4.4.0_GCC5.4.0/x86_64-native-linuxapp-gcc/29e674b1a6904bb3802ca0db9b6e1417/dpdk/mk/internal/rte.compile-pre.mk:114: recipe for target 'ice_ethdev.o' failed
make[6]: *** [ice_ethdev.o] Error 1
/tmp/UB1604-64_K4.4.0_GCC5.4.0/x86_64-native-linuxapp-gcc/29e674b1a6904bb3802ca0db9b6e1417/dpdk/mk/rte.subdir.mk:35: recipe for target 'ice' failed
make[5]: *** [ice] Error 2
make[5]: *** Waiting for unfinished jobs....
  CC nfp_nffw.o
  CC ixgbe_phy.o
  CC nfp_hwinfo.o
  CC octeontx_rxtx.o
--
  AR librte_pmd_ixgbe.a
  INSTALL-LIB librte_pmd_ixgbe.a
make[6]: warning:  Clock skew detected.  Your build may be incomplete.
  AR librte_pmd_octeontx2.a
  INSTALL-LIB librte_pmd_octeontx2.a
/tmp/UB1604-64_K4.4.0_GCC5.4.0/x86_64-native-linuxapp-gcc/29e674b1a6904bb3802ca0db9b6e1417/dpdk/mk/rte.subdir.mk:35: recipe for target 'net' failed
make[4]: *** [net] Error 2
/tmp/UB1604-64_K4.4.0_GCC5.4.0/x86_64-native-linuxapp-gcc/29e674b1a6904bb3802ca0db9b6e1417/dpdk/mk/rte.sdkbuild.mk:46: recipe for target 'drivers' failed
make[3]: *** [drivers] Error 2
/tmp/UB1604-64_K4.4.0_GCC5.4.0/x86_64-native-linuxapp-gcc/29e674b1a6904bb3802ca0db9b6e1417/dpdk/mk/rte.sdkroot.mk:98: recipe for target 'all' failed
make[2]: *** [all] Error 2
/tmp/UB1604-64_K4.4.0_GCC5.4.0/x86_64-native-linuxapp-gcc/29e674b1a6904bb3802ca0db9b6e1417/dpdk/mk/rte.sdkinstall.mk:60: recipe for target 'pre_install' failed
make[1]: *** [pre_install] Error 2
/tmp/UB1604-64_K4.4.0_GCC5.4.0/x86_64-native-linuxapp-gcc/29e674b1a6904bb3802ca0db9b6e1417/dpdk/mk/rte.sdkroot.mk:77: recipe for target 'install' failed
make: *** [install] Error 2


*Make Build Failed #13:
OS: UB1804-64
Target: x86_64-native-linuxapp-gcc
     ICE_RXDID_COMMS_AUX_IPV6
  CC ice_rxtx_vec_sse.o
/tmp/UB1804-64_K4.15.0_GCC7.3.0/x86_64-native-linuxapp-gcc/29e674b1a6904bb3802ca0db9b6e1417/dpdk/drivers/net/ice/ice_ethdev.c: At top level:
cc1: error: unrecognized command line option ‘-Wno-address-of-packed-member’ [-Werror]
cc1: all warnings being treated as errors
/tmp/UB1804-64_K4.15.0_GCC7.3.0/x86_64-native-linuxapp-gcc/29e674b1a6904bb3802ca0db9b6e1417/dpdk/mk/internal/rte.compile-pre.mk:114: recipe for target 'ice_ethdev.o' failed
make[6]: *** [ice_ethdev.o] Error 1
make[6]: *** Waiting for unfinished jobs....
  CC ixgbe_rxtx.o
  CC ixgbe_ethdev.o
  CC i40e_ethdev_vf.o
  CC i40e_pf.o
--
 ice_rxdid_to_proto_xtr_type(uint8_t rxdid)
 ^~~~~~~~~~~~~~~~~~~~~~~~~~~
/tmp/UB1804-64_K4.15.0_GCC7.3.0/x86_64-native-linuxapp-gcc/29e674b1a6904bb3802ca0db9b6e1417/dpdk/drivers/net/ice/ice_rxtx.c: At top level:
cc1: error: unrecognized command line option ‘-Wno-address-of-packed-member’ [-Werror]
cc1: all warnings being treated as errors
/tmp/UB1804-64_K4.15.0_GCC7.3.0/x86_64-native-linuxapp-gcc/29e674b1a6904bb3802ca0db9b6e1417/dpdk/mk/internal/rte.compile-pre.mk:114: recipe for target 'ice_rxtx.o' failed
make[6]: *** [ice_rxtx.o] Error 1
  CC i40e_flow.o
  CC rte_pmd_i40e.o
  CC i40e_tm.o
make[6]: Warning: File 'ixgbe_pf.c' has modification time 2435 s in the future
  CC ixgbe_fdir.o
/tmp/UB1804-64_K4.15.0_GCC7.3.0/x86_64-native-linuxapp-gcc/29e674b1a6904bb3802ca0db9b6e1417/dpdk/mk/rte.subdir.mk:35: recipe for target 'ice' failed
make[5]: *** [ice] Error 2
make[5]: *** Waiting for unfinished jobs....
  CC ixgbe_pf.o
  PMDINFO i40e_ethdev_vf.o.pmd.c
  CC i40e_ethdev_vf.o.pmd.o
  LD i40e_ethdev_vf.o
--
  AR librte_pmd_ixgbe.a
  INSTALL-LIB librte_pmd_ixgbe.a
make[6]: warning:  Clock skew detected.  Your build may be incomplete.
  AR librte_pmd_i40e.a
  INSTALL-LIB librte_pmd_i40e.a
/tmp/UB1804-64_K4.15.0_GCC7.3.0/x86_64-native-linuxapp-gcc/29e674b1a6904bb3802ca0db9b6e1417/dpdk/mk/rte.subdir.mk:35: recipe for target 'net' failed
make[4]: *** [net] Error 2
/tmp/UB1804-64_K4.15.0_GCC7.3.0/x86_64-native-linuxapp-gcc/29e674b1a6904bb3802ca0db9b6e1417/dpdk/mk/rte.sdkbuild.mk:46: recipe for target 'drivers' failed
make[3]: *** [drivers] Error 2
/tmp/UB1804-64_K4.15.0_GCC7.3.0/x86_64-native-linuxapp-gcc/29e674b1a6904bb3802ca0db9b6e1417/dpdk/mk/rte.sdkroot.mk:98: recipe for target 'all' failed
make[2]: *** [all] Error 2
/tmp/UB1804-64_K4.15.0_GCC7.3.0/x86_64-native-linuxapp-gcc/29e674b1a6904bb3802ca0db9b6e1417/dpdk/mk/rte.sdkinstall.mk:60: recipe for target 'pre_install' failed
make[1]: *** [pre_install] Error 2
/tmp/UB1804-64_K4.15.0_GCC7.3.0/x86_64-native-linuxapp-gcc/29e674b1a6904bb3802ca0db9b6e1417/dpdk/mk/rte.sdkroot.mk:77: recipe for target 'install' failed
make: *** [install] Error 2


*Make Build Failed #14:
OS: FreeBSD12-64
Target: x86_64-native-bsdapp-gcc+shared
     ICE_RXDID_COMMS_AUX_IPV6
/tmp/FreeBSD12-64_K19.02_GCC7.3.0/x86_64-native-bsdapp-gcc+shared/29e674b1a6904bb3802ca0db9b6e1417/dpdk/drivers/net/ice/ice_ethdev.c: At top level:
cc1: error: unrecognized command line option '-Wno-address-of-packed-member' [-Werror]
cc1: all warnings being treated as errors
  LD librte_pmd_lio.so.1.1
gmake[6]: *** [/tmp/FreeBSD12-64_K19.02_GCC7.3.0/x86_64-native-bsdapp-gcc+shared/29e674b1a6904bb3802ca0db9b6e1417/dpdk/mk/internal/rte.compile-pre.mk:116: ice_ethdev.o] Error 1
gmake[5]: *** [/tmp/FreeBSD12-64_K19.02_GCC7.3.0/x86_64-native-bsdapp-gcc+shared/29e674b1a6904bb3802ca0db9b6e1417/dpdk/mk/rte.subdir.mk:37: ice] Error 2
gmake[5]: *** Waiting for unfinished jobs....
  CC bnxt_flow.o
  INSTALL-LIB librte_pmd_lio.so.1.1
  CC i40e_flow.o
  CC ixgbe_x540.o
--
  PMDINFO ixgbe_ethdev.o.pmd.c
  CC ixgbe_ethdev.o.pmd.o
  LD ixgbe_ethdev.o
  LD librte_pmd_ixgbe.so.2.1
  INSTALL-LIB librte_pmd_ixgbe.so.2.1
gmake[4]: *** [/tmp/FreeBSD12-64_K19.02_GCC7.3.0/x86_64-native-bsdapp-gcc+shared/29e674b1a6904bb3802ca0db9b6e1417/dpdk/mk/rte.subdir.mk:35: net] Error 2
gmake[3]: *** [/tmp/FreeBSD12-64_K19.02_GCC7.3.0/x86_64-native-bsdapp-gcc+shared/29e674b1a6904bb3802ca0db9b6e1417/dpdk/mk/rte.sdkbuild.mk:46: drivers] Error 2
gmake[2]: *** [/tmp/FreeBSD12-64_K19.02_GCC7.3.0/x86_64-native-bsdapp-gcc+shared/29e674b1a6904bb3802ca0db9b6e1417/dpdk/mk/rte.sdkroot.mk:99: all] Error 2
gmake[1]: *** [/tmp/FreeBSD12-64_K19.02_GCC7.3.0/x86_64-native-bsdapp-gcc+shared/29e674b1a6904bb3802ca0db9b6e1417/dpdk/mk/rte.sdkinstall.mk:61: pre_install] Error 2
gmake: *** [/tmp/FreeBSD12-64_K19.02_GCC7.3.0/x86_64-native-bsdapp-gcc+shared/29e674b1a6904bb3802ca0db9b6e1417/dpdk/mk/rte.sdkroot.mk:77: install] Error 2


*Make Build Failed #15:
OS: CENTOS76-64
Target: x86_64-native-linuxapp-gcc+debug
     ^
== Build drivers/net/null
/tmp/CENTOS76-64_K3.10.0_GCC4.8.5/x86_64-native-linuxapp-gcc+debug/29e674b1a6904bb3802ca0db9b6e1417/dpdk/drivers/net/ice/ice_ethdev.c: At top level:
cc1: error: unrecognized command line option "-Wno-address-of-packed-member" [-Werror]
cc1: all warnings being treated as errors
make[6]: *** [ice_ethdev.o] Error 1
make[5]: *** [ice] Error 2
make[5]: *** Waiting for unfinished jobs....
  CC ixgbe_phy.o
  CC hn_ethdev.o
  CC i40e_pf.o
  CC ixgbe_api.o
--
  PMDINFO ixgbe_ethdev.o.pmd.c
  CC ixgbe_ethdev.o.pmd.o
  LD ixgbe_ethdev.o
  AR librte_pmd_ixgbe.a
  INSTALL-LIB librte_pmd_ixgbe.a
make[4]: *** [net] Error 2
make[3]: *** [drivers] Error 2
make[2]: *** [all] Error 2
make[1]: *** [pre_install] Error 2
make: *** [install] Error 2


*Make Build Failed #16:
OS: CENTOS76-64
Target: x86_64-native-linuxapp-clang
  LD i40e_ethdev.o
/tmp/CENTOS76-64_K3.10.0_Clang3.4.2/x86_64-native-linuxapp-clang/29e674b1a6904bb3802ca0db9b6e1417/dpdk/drivers/net/ice/ice_rxtx.c:38:27: error: use of undeclared identifier 'ICE_RXDID_COMMS_AUX_IPV6'
                [PROTO_XTR_IPV6]      = ICE_RXDID_COMMS_AUX_IPV6,
                                        ^
6 errors generated.
make[6]: *** [ice_ethdev.o] Error 1
make[6]: *** Waiting for unfinished jobs....
/tmp/CENTOS76-64_K3.10.0_Clang3.4.2/x86_64-native-linuxapp-clang/29e674b1a6904bb3802ca0db9b6e1417/dpdk/drivers/net/ice/ice_rxtx.c:39:27: error: use of undeclared identifier 'ICE_RXDID_COMMS_AUX_IPV6_FLOW'
                [PROTO_XTR_IPV6_FLOW] = ICE_RXDID_COMMS_AUX_IPV6_FLOW,
                                        ^
/tmp/CENTOS76-64_K3.10.0_Clang3.4.2/x86_64-native-linuxapp-clang/29e674b1a6904bb3802ca0db9b6e1417/dpdk/drivers/net/ice/ice_rxtx.c:40:27: error: use of undeclared identifier 'ICE_RXDID_COMMS_AUX_TCP'
--
/tmp/CENTOS76-64_K3.10.0_Clang3.4.2/x86_64-native-linuxapp-clang/29e674b1a6904bb3802ca0db9b6e1417/dpdk/drivers/net/ice/ice_rxtx.c:1118:18: note: forward declaration of 'struct ice_32b_rx_flex_desc_comms'
        volatile struct ice_32b_rx_flex_desc_comms *desc =
                        ^
16 errors generated.
  CC i40e_ethdev_vf.o
make[6]: *** [ice_rxtx.o] Error 1
  AR librte_pmd_ipn3ke.a
  CC rte_eth_memif.o.pmd.o
  CC memif_socket.o
  LD rte_eth_memif.o
  INSTALL-LIB librte_pmd_ipn3ke.a
--
== Build drivers/net/nfp
  CC i40e_rxtx_vec_avx2.o
  CC hn_ethdev.o
  CC hn_rxtx.o
  CC ixgbe_x540.o
make[5]: *** [ice] Error 2
make[5]: *** Waiting for unfinished jobs....
  CC nfp_cppcore.o
  CC ixgbe_x550.o
  CC hn_rndis.o
  CC nfp_cpp_pcie_ops.o
--
  PMDINFO ixgbe_ethdev.o.pmd.c
  CC ixgbe_ethdev.o.pmd.o
  LD ixgbe_ethdev.o
  AR librte_pmd_ixgbe.a
  INSTALL-LIB librte_pmd_ixgbe.a
make[4]: *** [net] Error 2
make[3]: *** [drivers] Error 2
make[2]: *** [all] Error 2
make[1]: *** [pre_install] Error 2
make: *** [install] Error 2


*Make Build Failed #17:
OS: FreeBSD12-64
Target: x86_64-native-bsdapp-gcc+debug
     ^~~~~~~~~~~~~~~~~~~~~~~
     ICE_RXDID_COMMS_AUX_IPV6
/tmp/FreeBSD12-64_K19.02_GCC7.3.0/x86_64-native-bsdapp-gcc+debug/29e674b1a6904bb3802ca0db9b6e1417/dpdk/drivers/net/ice/ice_ethdev.c: At top level:
cc1: error: unrecognized command line option '-Wno-address-of-packed-member' [-Werror]
cc1: all warnings being treated as errors
gmake[6]: *** [/tmp/FreeBSD12-64_K19.02_GCC7.3.0/x86_64-native-bsdapp-gcc+debug/29e674b1a6904bb3802ca0db9b6e1417/dpdk/mk/internal/rte.compile-pre.mk:116: ice_ethdev.o] Error 1
gmake[5]: *** [/tmp/FreeBSD12-64_K19.02_GCC7.3.0/x86_64-native-bsdapp-gcc+debug/29e674b1a6904bb3802ca0db9b6e1417/dpdk/mk/rte.subdir.mk:37: ice] Error 2
gmake[5]: *** Waiting for unfinished jobs....
  CC lio_23xx_vf.o
  CC lio_mbox.o
  PMDINFO igb_ethdev.o.pmd.c
  CC igb_ethdev.o.pmd.o
--
  PMDINFO ixgbe_ethdev.o.pmd.c
  CC ixgbe_ethdev.o.pmd.o
  LD ixgbe_ethdev.o
  AR librte_pmd_ixgbe.a
  INSTALL-LIB librte_pmd_ixgbe.a
gmake[4]: *** [/tmp/FreeBSD12-64_K19.02_GCC7.3.0/x86_64-native-bsdapp-gcc+debug/29e674b1a6904bb3802ca0db9b6e1417/dpdk/mk/rte.subdir.mk:35: net] Error 2
gmake[3]: *** [/tmp/FreeBSD12-64_K19.02_GCC7.3.0/x86_64-native-bsdapp-gcc+debug/29e674b1a6904bb3802ca0db9b6e1417/dpdk/mk/rte.sdkbuild.mk:46: drivers] Error 2
gmake[2]: *** [/tmp/FreeBSD12-64_K19.02_GCC7.3.0/x86_64-native-bsdapp-gcc+debug/29e674b1a6904bb3802ca0db9b6e1417/dpdk/mk/rte.sdkroot.mk:99: all] Error 2
gmake[1]: *** [/tmp/FreeBSD12-64_K19.02_GCC7.3.0/x86_64-native-bsdapp-gcc+debug/29e674b1a6904bb3802ca0db9b6e1417/dpdk/mk/rte.sdkinstall.mk:61: pre_install] Error 2
gmake: *** [/tmp/FreeBSD12-64_K19.02_GCC7.3.0/x86_64-native-bsdapp-gcc+debug/29e674b1a6904bb3802ca0db9b6e1417/dpdk/mk/rte.sdkroot.mk:77: install] Error 2


*Make Build Failed #18:
OS: CENTOS76-64
Target: x86_64-native-linuxapp-gcc+shared
   { ICE_RXDID_COMMS_AUX_TCP, ICE_PROT_TCP_IL, ICE_PROT_ID_INVAL },
     ^
/tmp/CENTOS76-64_K3.10.0_GCC4.8.5/x86_64-native-linuxapp-gcc+shared/29e674b1a6904bb3802ca0db9b6e1417/dpdk/drivers/net/ice/ice_ethdev.c: At top level:
cc1: error: unrecognized command line option "-Wno-address-of-packed-member" [-Werror]
cc1: all warnings being treated as errors
make[6]: *** [ice_ethdev.o] Error 1
make[6]: *** Waiting for unfinished jobs....
  CC i40e_dcb.o
  PMDINFO ipn3ke_ethdev.o.pmd.c
  CC ipn3ke_ethdev.o.pmd.o
  CC hinic_pmd_ethdev.o
--
  SYMLINK-FILE include/rte_pmd_ixgbe.h
  LD ipn3ke_ethdev.o
  CC fm10k_vf.o
  CC ixgbe_common.o
  CC ipn3ke_representor.o
make[5]: *** [ice] Error 2
make[5]: *** Waiting for unfinished jobs....
  CC iavf_rxtx_vec_sse.o
  CC ipn3ke_tm.o
  CC ixgbe_82598.o
  CC i40e_ethdev.o
--
  PMDINFO ixgbe_ethdev.o.pmd.c
  CC ixgbe_ethdev.o.pmd.o
  LD ixgbe_ethdev.o
  LD librte_pmd_ixgbe.so.2.1
  INSTALL-LIB librte_pmd_ixgbe.so.2.1
make[4]: *** [net] Error 2
make[3]: *** [drivers] Error 2
make[2]: *** [all] Error 2
make[1]: *** [pre_install] Error 2
make: *** [install] Error 2


*Make Build Failed #19:
OS: FreeBSD12-64
Target: x86_64-native-bsdapp-gcc
     ^~~~~~~~~~~~~~~~~~~~~~~
     ICE_RXDID_COMMS_AUX_IPV6
/tmp/FreeBSD12-64_K19.02_GCC7.3.0/x86_64-native-bsdapp-gcc/29e674b1a6904bb3802ca0db9b6e1417/dpdk/drivers/net/ice/ice_ethdev.c: At top level:
cc1: error: unrecognized command line option '-Wno-address-of-packed-member' [-Werror]
cc1: all warnings being treated as errors
gmake[6]: *** [/tmp/FreeBSD12-64_K19.02_GCC7.3.0/x86_64-native-bsdapp-gcc/29e674b1a6904bb3802ca0db9b6e1417/dpdk/mk/internal/rte.compile-pre.mk:116: ice_ethdev.o] Error 1
gmake[5]: *** [/tmp/FreeBSD12-64_K19.02_GCC7.3.0/x86_64-native-bsdapp-gcc/29e674b1a6904bb3802ca0db9b6e1417/dpdk/mk/rte.subdir.mk:37: ice] Error 2
gmake[5]: *** Waiting for unfinished jobs....
  CC ixgbe_vf.o
  SYMLINK-FILE include/rte_pmd_bnxt.h
  CC lio_23xx_vf.o
  CC bnxt_cpr.o
--
  LD otx2_ethdev.o
  AR librte_pmd_ixgbe.a
  INSTALL-LIB librte_pmd_ixgbe.a
  AR librte_pmd_octeontx2.a
  INSTALL-LIB librte_pmd_octeontx2.a
gmake[4]: *** [/tmp/FreeBSD12-64_K19.02_GCC7.3.0/x86_64-native-bsdapp-gcc/29e674b1a6904bb3802ca0db9b6e1417/dpdk/mk/rte.subdir.mk:35: net] Error 2
gmake[3]: *** [/tmp/FreeBSD12-64_K19.02_GCC7.3.0/x86_64-native-bsdapp-gcc/29e674b1a6904bb3802ca0db9b6e1417/dpdk/mk/rte.sdkbuild.mk:46: drivers] Error 2
gmake[2]: *** [/tmp/FreeBSD12-64_K19.02_GCC7.3.0/x86_64-native-bsdapp-gcc/29e674b1a6904bb3802ca0db9b6e1417/dpdk/mk/rte.sdkroot.mk:99: all] Error 2
gmake[1]: *** [/tmp/FreeBSD12-64_K19.02_GCC7.3.0/x86_64-native-bsdapp-gcc/29e674b1a6904bb3802ca0db9b6e1417/dpdk/mk/rte.sdkinstall.mk:61: pre_install] Error 2
gmake: *** [/tmp/FreeBSD12-64_K19.02_GCC7.3.0/x86_64-native-bsdapp-gcc/29e674b1a6904bb3802ca0db9b6e1417/dpdk/mk/rte.sdkroot.mk:77: install] Error 2


*Make Build Failed #20:
OS: FreeBSD12-64
Target: x86_64-native-bsdapp-clang
                                ^~~
.
/tmp/FreeBSD12-64_K19.02_Clang6.0.1/x86_64-native-bsdapp-clang/29e674b1a6904bb3802ca0db9b6e1417/dpdk/drivers/net/ice/ice_rxtx.c:46:30: error: use of undeclared identifier 'ICE_RXDID_COMMS_GENERIC'
        return rxdid != 0 ? rxdid : ICE_RXDID_COMMS_GENERIC;
                                    ^
/tmp/FreeBSD12-64_K19.02_Clang6.0.1/x86_64-native-bsdapp-clang/29e674b1a6904bb3802ca0db9b6e1417/dpdk/drivers/net/ice/ice_rxtx.cgmake[6]: *** [/tmp/FreeBSD12-64_K19.02_Clang6.0.1/x86_64-native-bsdapp-clang/29e674b1a6904bb3802ca0db9b6e1417/dpdk/mk/internal/rte.compile-pre.mk:116: ice_ethdev.o] Error 1
gmake[6]: *** Waiting for unfinished jobs....
:61:19: error: use of undeclared identifier 'ICE_RXDID_COMMS_GENERIC'
        uint32_t rxdid = ICE_RXDID_COMMS_GENERIC;
                         ^
/tmp/FreeBSD12-64_K19.02_Clang6.0.1/x86_64-native-bsdapp-clang/29e674b1a6904bb3802ca0db9b6e1417/dpdk/drivers/net/ice/ice_rxtx.c:1122:34: error: incomplete definition of type 'struct ice_32b_rx_flex_desc_comms'
--
#define rte_le_to_cpu_16(x) (x)
                             ^
/tmp/FreeBSD12-64_K19.02_Clang6.0.1/x86_64-native-bsdapp-clang/29e674b1a6904bb3802ca0db9b6e1417/dpdk/drivers/net/ice/ice_rxtx.c:1118:18: note: forward declaration of 'struct ice_32b_rx_flex_desc_comms'
        volatile struct ice_32b_rx_flex_desc_comms *desc =
                        ^
fatal error  CC i40e_flow.o
: too many errors emitted, stopping now [-ferror-limit=]
20 errors generated.
gmake[6]: *** [/tmp/FreeBSD12-64_K19.02_Clang6.0.1/x86_64-native-bsdapp-clang/29e674b1a6904bb3802ca0db9b6e1417/dpdk/mk/internal/rte.compile-pre.mk:116: ice_rxtx.o] Error 1
  CC ixgbe_vf.o
  AR librte_pmd_octeontx.a
  INSTALL-LIB librte_pmd_octeontx.a
  CC rte_eth_pcap.o
  CC rte_pmd_i40e.o
  CC bnxt_rxq.o
gmake[5]: *** [/tmp/FreeBSD12-64_K19.02_Clang6.0.1/x86_64-native-bsdapp-clang/29e674b1a6904bb3802ca0db9b6e1417/dpdk/mk/rte.subdir.mk:35: ice] Error 2
gmake[5]: *** Waiting for unfinished jobs....
  CC i40e_tm.o
  CC bnxt_rxr.o
  CC otx2_tx.o
  PMDINFO rte_eth_pcap.o.pmd.c
--
  CC otx2_ethdev_devargs.o
  AR librte_pmd_ixgbe.a
  INSTALL-LIB librte_pmd_ixgbe.a
  AR librte_pmd_octeontx2.a
  INSTALL-LIB librte_pmd_octeontx2.a
gmake[4]: *** [/tmp/FreeBSD12-64_K19.02_Clang6.0.1/x86_64-native-bsdapp-clang/29e674b1a6904bb3802ca0db9b6e1417/dpdk/mk/rte.subdir.mk:35: net] Error 2
gmake[3]: *** [/tmp/FreeBSD12-64_K19.02_Clang6.0.1/x86_64-native-bsdapp-clang/29e674b1a6904bb3802ca0db9b6e1417/dpdk/mk/rte.sdkbuild.mk:46: drivers] Error 2
gmake[2]: *** [/tmp/FreeBSD12-64_K19.02_Clang6.0.1/x86_64-native-bsdapp-clang/29e674b1a6904bb3802ca0db9b6e1417/dpdk/mk/rte.sdkroot.mk:99: all] Error 2
gmake[1]: *** [/tmp/FreeBSD12-64_K19.02_Clang6.0.1/x86_64-native-bsdapp-clang/29e674b1a6904bb3802ca0db9b6e1417/dpdk/mk/rte.sdkinstall.mk:61: pre_install] Error 2
gmake: *** [/tmp/FreeBSD12-64_K19.02_Clang6.0.1/x86_64-native-bsdapp-clang/29e674b1a6904bb3802ca0db9b6e1417/dpdk/mk/rte.sdkroot.mk:77: install] Error 2


*Make Build Failed #21:
OS: CENTOS76-64
Target: x86_64-native-linuxapp-gcc
     ^
  CC nfp_nsp_cmds.o
/tmp/CENTOS76-64_K3.10.0_GCC4.8.5/x86_64-native-linuxapp-gcc/29e674b1a6904bb3802ca0db9b6e1417/dpdk/drivers/net/ice/ice_ethdev.c: At top level:
cc1: error: unrecognized command line option "-Wno-address-of-packed-member" [-Werror]
cc1: all warnings being treated as errors
make[6]: *** [ice_ethdev.o] Error 1
make[6]: *** Waiting for unfinished jobs....
  CC ice_rxtx.o
  CC i40e_flow.o
  PMDINFO i40e_ethdev.o.pmd.c
  CC i40e_ethdev.o.pmd.o
--
 ^
  CC nfp_nsp_eth.o
/tmp/CENTOS76-64_K3.10.0_GCC4.8.5/x86_64-native-linuxapp-gcc/29e674b1a6904bb3802ca0db9b6e1417/dpdk/drivers/net/ice/ice_rxtx.c: At top level:
cc1: error: unrecognized command line option "-Wno-address-of-packed-member" [-Werror]
cc1: all warnings being treated as errors
make[6]: *** [ice_rxtx.o] Error 1
make[5]: *** [ice] Error 2
make[5]: *** Waiting for unfinished jobs....
  CC nfp_net.o
  AR librte_pmd_null.a
  INSTALL-LIB librte_pmd_null.a
  CC octeontx_pkovf.o
--
  PMDINFO ixgbe_ethdev.o.pmd.c
  CC ixgbe_ethdev.o.pmd.o
  LD ixgbe_ethdev.o
  AR librte_pmd_ixgbe.a
  INSTALL-LIB librte_pmd_ixgbe.a
make[4]: *** [net] Error 2
make[3]: *** [drivers] Error 2
make[2]: *** [all] Error 2
make[1]: *** [pre_install] Error 2
make: *** [install] Error 2


*Make Build Failed #22:
OS: CENTOS76-64
Target: x86_64-native-linuxapp-icc
  		{ ICE_RXDID_COMMS_AUX_TCP, ICE_PROT_TCP_IL, ICE_PROT_ID_INVAL },
  		  ^

  CC nfp_nsp.o
compilation aborted for /tmp/CENTOS76-64_K3.10.0_ICC19.0.0/x86_64-native-linuxapp-icc/29e674b1a6904bb3802ca0db9b6e1417/dpdk/drivers/net/ice/ice_ethdev.c (code 2)
make[6]: *** [ice_ethdev.o] Error 2
make[6]: *** Waiting for unfinished jobs....
  CC ixgbe_vf.o
  PMDINFO bnxt_ethdev.o.pmd.c
  CC bnxt_ethdev.o.pmd.o
  CC i40e_vf_representor.o
  CC ixgbe_hv_vf.o
  CC nfp_nsp_cmds.o
make[5]: *** [ice] Error 2
make[5]: *** Waiting for unfinished jobs....
  CC nfp_nsp_eth.o
  LD bnxt_ethdev.o
  CC bnxt_filter.o
  CC ixgbe_dcb.o
--
  CC bnxt_rxtx_vec_sse.o
  AR librte_pmd_ixgbe.a
  INSTALL-LIB librte_pmd_ixgbe.a
  AR librte_pmd_bnxt.a
  INSTALL-LIB librte_pmd_bnxt.a
make[4]: *** [net] Error 2
make[3]: *** [drivers] Error 2
make[2]: *** [all] Error 2
make[1]: *** [pre_install] Error 2
make: *** [install] Error 2

*Meson Build Failed #1:
OS: SUSE15-64
Target:build-gcc-static
FAILED: drivers/a715181@@tmp_rte_pmd_ice at sta/net_ice_ice_rxtx.c.o 
gcc -Idrivers/a715181@@tmp_rte_pmd_ice at sta -Idrivers -I../drivers -Idrivers/net/ice -I../drivers/net/ice -Idrivers/net/ice/base -I../drivers/net/ice/base -Ilib/librte_ethdev -I../lib/librte_ethdev -I. -I../ -Iconfig -I../config -Ilib/librte_eal/common/include -I../lib/librte_eal/common/include -I../lib/librte_eal/linux/eal/include -Ilib/librte_eal/common -I../lib/librte_eal/common -Ilib/librte_eal/common/include/arch/x86 -I../lib/librte_eal/common/include/arch/x86 -Ilib/librte_eal -I../lib/librte_eal -Ilib/librte_kvargs -I../lib/librte_kvargs -Ilib/librte_net -I../lib/librte_net -Ilib/librte_mbuf -I../lib/librte_mbuf -Ilib/librte_mempool -I../lib/librte_mempool -Ilib/librte_ring -I../lib/librte_ring -Ilib/librte_meter -I../lib/librte_meter -Idrivers/bus/pci -I../drivers/bus/pci -I../drivers/bus/pci/linux -Ilib/librte_pci -I../lib/librte_pci -Idrivers/bus/vdev -I../drivers/bus/vdev -Ilib/librte_hash -I../lib/librte_hash -fdiagnostics-color=always -pipe -D_FILE_OFFSET_BITS=64 -Wall -Winvalid-pch -Werror -O3 -include rte_config.h -Wunused-parameter -Wsign-compare -Wcast-qual -D_GNU_SOURCE -fPIC -march=native -Wno-format-truncation -DALLOW_EXPERIMENTAL_API -MD -MQ 'drivers/a715181@@tmp_rte_pmd_ice at sta/net_ice_ice_rxtx.c.o' -MF 'drivers/a715181@@tmp_rte_pmd_ice at sta/net_ice_ice_rxtx.c.o.d' -o 'drivers/a715181@@tmp_rte_pmd_ice at sta/net_ice_ice_rxtx.c.o' -c ../drivers/net/ice/ice_rxtx.c
../drivers/net/ice/ice_rxtx.c: In function ‘ice_program_hw_rx_queue’:
../drivers/net/ice/ice_rxtx.c:61:19: error: ‘ICE_RXDID_COMMS_GENERIC’ undeclared (first use in this function); did you mean ‘ICE_RXDID_FLEX_NIC’?
  uint32_t rxdid = ICE_RXDID_COMMS_GENERIC;
                   ^~~~~~~~~~~~~~~~~~~~~~~
                   ICE_RXDID_FLEX_NIC
../drivers/net/ice/ice_rxtx.c:61:19: note: each undeclared identifier is reported only once for each function it appears in
In file included from ../lib/librte_mbuf/rte_mbuf.h:43:0,
                 from ../lib/librte_net/rte_ether.h:23,
                 from ../lib/librte_ethdev/rte_ethdev.h:160,
                 from ../lib/librte_ethdev/rte_ethdev_driver.h:18,
                 from ../drivers/net/ice/ice_rxtx.c:5:
../drivers/net/ice/ice_rxtx.c: In function ‘ice_rxd_to_pkt_fields’:
../drivers/net/ice/ice_rxtx.c:1122:34: error: dereferencing pointer to incomplete type ‘volatile struct ice_32b_rx_flex_desc_comms’
  stat_err = rte_le_to_cpu_16(desc->status_error0);
                                  ^
../lib/librte_eal/common/include/arch/x86/rte_byteorder.h:81:30: note: in definition of macro ‘rte_le_to_cpu_16’
 #define rte_le_to_cpu_16(x) (x)
                              ^
[849/1831] Compiling C object 'drivers/net/ice/base/39545a2@@ice_base at sta/ice_flow.c.o'.
[850/1831] Compiling C object 'drivers/net/ice/base/39545a2@@ice_base at sta/ice_sched.c.o'.
[851/1831] Compiling C object 'drivers/a715181@@tmp_rte_pmd_ice at sta/net_ice_ice_generic_flow.c.o'.
[852/1831] Compiling C object 'drivers/net/ice/base/39545a2@@ice_base at sta/ice_switch.c.o'.
[853/1831] Compiling C object 'drivers/a715181@@tmp_rte_pmd_ice at sta/net_ice_ice_switch_filter.c.o'.
[854/1831] Compiling C object 'drivers/net/ice/base/39545a2@@ice_base at sta/ice_flex_pipe.c.o'.
[855/1831] Compiling C object 'drivers/a715181@@tmp_rte_pmd_ice at sta/net_ice_ice_ethdev.c.o'.
ninja: build stopped: subcommand failed




*Meson Build Failed #2:
OS: UB1604-32
Target:build-gcc-static
FAILED: drivers/a715181@@tmp_rte_pmd_ice at sta/net_ice_ice_rxtx.c.o 
gcc -Idrivers/a715181@@tmp_rte_pmd_ice at sta -Idrivers -I../drivers -Idrivers/net/ice -I../drivers/net/ice -Idrivers/net/ice/base -I../drivers/net/ice/base -Ilib/librte_ethdev -I../lib/librte_ethdev -I. -I../ -Iconfig -I../config -Ilib/librte_eal/common/include -I../lib/librte_eal/common/include -I../lib/librte_eal/linux/eal/include -Ilib/librte_eal/common -I../lib/librte_eal/common -Ilib/librte_eal/common/include/arch/x86 -I../lib/librte_eal/common/include/arch/x86 -Ilib/librte_eal -I../lib/librte_eal -Ilib/librte_kvargs -I../lib/librte_kvargs -Ilib/librte_net -I../lib/librte_net -Ilib/librte_mbuf -I../lib/librte_mbuf -Ilib/librte_mempool -I../lib/librte_mempool -Ilib/librte_ring -I../lib/librte_ring -Ilib/librte_meter -I../lib/librte_meter -Idrivers/bus/pci -I../drivers/bus/pci -I../drivers/bus/pci/linux -Ilib/librte_pci -I../lib/librte_pci -Idrivers/bus/vdev -I../drivers/bus/vdev -Ilib/librte_hash -I../lib/librte_hash -fdiagnostics-color=always -pipe -D_FILE_OFFSET_BITS=64 -Wall -Winvalid-pch -Werror -O3 -include rte_config.h -Wunused-parameter -Wsign-compare -Wcast-qual -Wno-pointer-to-int-cast -D_GNU_SOURCE -fPIC -march=native -DALLOW_EXPERIMENTAL_API -MD -MQ 'drivers/a715181@@tmp_rte_pmd_ice at sta/net_ice_ice_rxtx.c.o' -MF 'drivers/a715181@@tmp_rte_pmd_ice at sta/net_ice_ice_rxtx.c.o.d' -o 'drivers/a715181@@tmp_rte_pmd_ice at sta/net_ice_ice_rxtx.c.o' -c ../drivers/net/ice/ice_rxtx.c
../drivers/net/ice/ice_rxtx.c: In function ‘ice_program_hw_rx_queue’:
../drivers/net/ice/ice_rxtx.c:61:19: error: ‘ICE_RXDID_COMMS_GENERIC’ undeclared (first use in this function)
  uint32_t rxdid = ICE_RXDID_COMMS_GENERIC;
                   ^
../drivers/net/ice/ice_rxtx.c:61:19: note: each undeclared identifier is reported only once for each function it appears in
In file included from ../lib/librte_mbuf/rte_mbuf.h:43:0,
                 from ../lib/librte_net/rte_ether.h:23,
                 from ../lib/librte_ethdev/rte_ethdev.h:160,
                 from ../lib/librte_ethdev/rte_ethdev_driver.h:18,
                 from ../drivers/net/ice/ice_rxtx.c:5:
../drivers/net/ice/ice_rxtx.c: In function ‘ice_rxd_to_pkt_fields’:
../drivers/net/ice/ice_rxtx.c:1122:34: error: dereferencing pointer to incomplete type ‘volatile struct ice_32b_rx_flex_desc_comms’
  stat_err = rte_le_to_cpu_16(desc->status_error0);
                                  ^
../lib/librte_eal/common/include/arch/x86/rte_byteorder.h:81:30: note: in definition of macro ‘rte_le_to_cpu_16’
 #define rte_le_to_cpu_16(x) (x)
                              ^
[834/1656] Compiling C object 'drivers/net/ice/base/39545a2@@ice_base at sta/ice_switch.c.o'.
[835/1656] Compiling C object 'drivers/net/ice/base/39545a2@@ice_base at sta/ice_flex_pipe.c.o'.
[836/1656] Compiling C object 'drivers/a715181@@tmp_rte_pmd_ice at sta/net_ice_ice_generic_flow.c.o'.
[837/1656] Compiling C object 'drivers/a715181@@tmp_rte_pmd_ice at sta/net_ice_ice_ethdev.c.o'.
[838/1656] Compiling C object 'drivers/a715181@@tmp_rte_pmd_ice at sta/net_ice_ice_rxtx_vec_sse.c.o'.
ninja: build stopped: subcommand failed




*Meson Build Failed #3:
OS: FC30-64
Target:build-gcc-static
FAILED: drivers/a715181@@tmp_rte_pmd_ice at sta/net_ice_ice_rxtx.c.o 
gcc -Idrivers/a715181@@tmp_rte_pmd_ice at sta -Idrivers -I../drivers -Idrivers/net/ice -I../drivers/net/ice -Idrivers/net/ice/base -I../drivers/net/ice/base -Ilib/librte_ethdev -I../lib/librte_ethdev -I. -I../ -Iconfig -I../config -Ilib/librte_eal/common/include -I../lib/librte_eal/common/include -I../lib/librte_eal/linux/eal/include -Ilib/librte_eal/common -I../lib/librte_eal/common -Ilib/librte_eal/common/include/arch/x86 -I../lib/librte_eal/common/include/arch/x86 -Ilib/librte_eal -I../lib/librte_eal -Ilib/librte_kvargs -I../lib/librte_kvargs -Ilib/librte_net -I../lib/librte_net -Ilib/librte_mbuf -I../lib/librte_mbuf -Ilib/librte_mempool -I../lib/librte_mempool -Ilib/librte_ring -I../lib/librte_ring -Ilib/librte_meter -I../lib/librte_meter -Idrivers/bus/pci -I../drivers/bus/pci -I../drivers/bus/pci/linux -Ilib/librte_pci -I../lib/librte_pci -Idrivers/bus/vdev -I../drivers/bus/vdev -Ilib/librte_hash -I../lib/librte_hash -fdiagnostics-color=always -pipe -D_FILE_OFFSET_BITS=64 -Wall -Winvalid-pch -Werror -O3 -include rte_config.h -Wunused-parameter -Wsign-compare -Wcast-qual -Wno-address-of-packed-member -D_GNU_SOURCE -fPIC -march=native -mno-avx512f -Wno-format-truncation -DALLOW_EXPERIMENTAL_API -MD -MQ 'drivers/a715181@@tmp_rte_pmd_ice at sta/net_ice_ice_rxtx.c.o' -MF 'drivers/a715181@@tmp_rte_pmd_ice at sta/net_ice_ice_rxtx.c.o.d' -o 'drivers/a715181@@tmp_rte_pmd_ice at sta/net_ice_ice_rxtx.c.o' -c ../drivers/net/ice/ice_rxtx.c
../drivers/net/ice/ice_rxtx.c: In function ‘ice_program_hw_rx_queue’:
../drivers/net/ice/ice_rxtx.c:61:19: error: ‘ICE_RXDID_COMMS_GENERIC’ undeclared (first use in this function)
   61 |  uint32_t rxdid = ICE_RXDID_COMMS_GENERIC;
      |                   ^~~~~~~~~~~~~~~~~~~~~~~
../drivers/net/ice/ice_rxtx.c:61:19: note: each undeclared identifier is reported only once for each function it appears in
In file included from ../lib/librte_mbuf/rte_mbuf.h:43,
                 from ../lib/librte_net/rte_ether.h:23,
                 from ../lib/librte_ethdev/rte_ethdev.h:160,
                 from ../lib/librte_ethdev/rte_ethdev_driver.h:18,
                 from ../drivers/net/ice/ice_rxtx.c:5:
../drivers/net/ice/ice_rxtx.c: In function ‘ice_rxd_to_pkt_fields’:
../drivers/net/ice/ice_rxtx.c:1122:34: error: dereferencing pointer to incomplete type ‘volatile struct ice_32b_rx_flex_desc_comms’
 1122 |  stat_err = rte_le_to_cpu_16(desc->status_error0);
      |                                  ^~
../lib/librte_eal/common/include/arch/x86/rte_byteorder.h:81:30: note: in definition of macro ‘rte_le_to_cpu_16’
   81 | #define rte_le_to_cpu_16(x) (x)
      |                              ^
[841/1784] Compiling C object 'drivers/net/ice/base/39545a2@@ice_base at sta/ice_flex_pipe.c.o'.
[842/1784] Compiling C object 'drivers/net/ice/base/39545a2@@ice_base at sta/ice_switch.c.o'.
[843/1784] Compiling C object 'drivers/a715181@@tmp_rte_pmd_ice at sta/net_ice_ice_generic_flow.c.o'.
[844/1784] Compiling C object 'drivers/a715181@@tmp_rte_pmd_ice at sta/net_ice_ice_switch_filter.c.o'.
[845/1784] Compiling C object 'drivers/a715181@@tmp_rte_pmd_ice at sta/net_ice_ice_ethdev.c.o'.
[846/1784] Compiling C object 'drivers/a715181@@tmp_rte_pmd_ice at sta/net_ice_ice_rxtx_vec_avx2.c.o'.
[847/1784] Compiling C object 'drivers/a715181@@tmp_rte_pmd_ice at sta/net_ice_ice_rxtx_vec_sse.c.o'.
ninja: build stopped: subcommand failed




*Meson Build Failed #4:
OS: UB1804-64
Target:build-gcc-static
FAILED: drivers/a715181@@tmp_rte_pmd_ice at sta/net_ice_ice_rxtx.c.o 
gcc -Idrivers/a715181@@tmp_rte_pmd_ice at sta -Idrivers -I../drivers -Idrivers/net/ice -I../drivers/net/ice -Idrivers/net/ice/base -I../drivers/net/ice/base -Ilib/librte_ethdev -I../lib/librte_ethdev -I. -I../ -Iconfig -I../config -Ilib/librte_eal/common/include -I../lib/librte_eal/common/include -I../lib/librte_eal/linux/eal/include -Ilib/librte_eal/common -I../lib/librte_eal/common -Ilib/librte_eal/common/include/arch/x86 -I../lib/librte_eal/common/include/arch/x86 -Ilib/librte_eal -I../lib/librte_eal -Ilib/librte_kvargs -I../lib/librte_kvargs -Ilib/librte_net -I../lib/librte_net -Ilib/librte_mbuf -I../lib/librte_mbuf -Ilib/librte_mempool -I../lib/librte_mempool -Ilib/librte_ring -I../lib/librte_ring -Ilib/librte_meter -I../lib/librte_meter -Idrivers/bus/pci -I../drivers/bus/pci -I../drivers/bus/pci/linux -Ilib/librte_pci -I../lib/librte_pci -Idrivers/bus/vdev -I../drivers/bus/vdev -Ilib/librte_hash -I../lib/librte_hash -fdiagnostics-color=always -pipe -D_FILE_OFFSET_BITS=64 -Wall -Winvalid-pch -Werror -O3 -include rte_config.h -Wunused-parameter -Wsign-compare -Wcast-qual -D_GNU_SOURCE -fPIC -march=native -mno-avx512f -Wno-format-truncation -DALLOW_EXPERIMENTAL_API -MD -MQ 'drivers/a715181@@tmp_rte_pmd_ice at sta/net_ice_ice_rxtx.c.o' -MF 'drivers/a715181@@tmp_rte_pmd_ice at sta/net_ice_ice_rxtx.c.o.d' -o 'drivers/a715181@@tmp_rte_pmd_ice at sta/net_ice_ice_rxtx.c.o' -c ../drivers/net/ice/ice_rxtx.c
../drivers/net/ice/ice_rxtx.c: In function ‘ice_program_hw_rx_queue’:
../drivers/net/ice/ice_rxtx.c:61:19: error: ‘ICE_RXDID_COMMS_GENERIC’ undeclared (first use in this function); did you mean ‘ICE_RXDID_FLEX_NIC’?
  uint32_t rxdid = ICE_RXDID_COMMS_GENERIC;
                   ^~~~~~~~~~~~~~~~~~~~~~~
                   ICE_RXDID_FLEX_NIC
../drivers/net/ice/ice_rxtx.c:61:19: note: each undeclared identifier is reported only once for each function it appears in
In file included from ../lib/librte_mbuf/rte_mbuf.h:43:0,
                 from ../lib/librte_net/rte_ether.h:23,
                 from ../lib/librte_ethdev/rte_ethdev.h:160,
                 from ../lib/librte_ethdev/rte_ethdev_driver.h:18,
                 from ../drivers/net/ice/ice_rxtx.c:5:
../drivers/net/ice/ice_rxtx.c: In function ‘ice_rxd_to_pkt_fields’:
../drivers/net/ice/ice_rxtx.c:1122:34: error: dereferencing pointer to incomplete type ‘volatile struct ice_32b_rx_flex_desc_comms’
  stat_err = rte_le_to_cpu_16(desc->status_error0);
                                  ^
../lib/librte_eal/common/include/arch/x86/rte_byteorder.h:81:30: note: in definition of macro ‘rte_le_to_cpu_16’
 #define rte_le_to_cpu_16(x) (x)
                              ^
[851/1791] Compiling C object 'drivers/a715181@@tmp_rte_pmd_ice at sta/net_ice_ice_switch_filter.c.o'.
[852/1791] Compiling C object 'drivers/a715181@@tmp_rte_pmd_ice at sta/net_ice_ice_generic_flow.c.o'.
[853/1791] Compiling C object 'drivers/net/ice/base/39545a2@@ice_base at sta/ice_flex_pipe.c.o'.
[854/1791] Compiling C object 'drivers/net/ice/base/39545a2@@ice_base at sta/ice_switch.c.o'.
[855/1791] Compiling C object 'drivers/a715181@@tmp_rte_pmd_ice at sta/net_ice_ice_ethdev.c.o'.
ninja: build stopped: subcommand failed




*Meson Build Failed #5:
OS: FreeBSD12-64
Target:build-gcc-static
FAILED: drivers/a715181@@tmp_rte_pmd_ice at sta/net_ice_ice_rxtx.c.o 
ccache gcc -Idrivers/a715181@@tmp_rte_pmd_ice at sta -Idrivers -I../drivers -Idrivers/net/ice -I../drivers/net/ice -Idrivers/net/ice/base -I../drivers/net/ice/base -Ilib/librte_ethdev -I../lib/librte_ethdev -I. -I../ -Iconfig -I../config -Ilib/librte_eal/common/include -I../lib/librte_eal/common/include -I../lib/librte_eal/freebsd/eal/include -Ilib/librte_eal/common -I../lib/librte_eal/common -Ilib/librte_eal/common/include/arch/x86 -I../lib/librte_eal/common/include/arch/x86 -Ilib/librte_eal -I../lib/librte_eal -Ilib/librte_kvargs -I../lib/librte_kvargs -Ilib/librte_net -I../lib/librte_net -Ilib/librte_mbuf -I../lib/librte_mbuf -Ilib/librte_mempool -I../lib/librte_mempool -Ilib/librte_ring -I../lib/librte_ring -Ilib/librte_meter -I../lib/librte_meter -Idrivers/bus/pci -I../drivers/bus/pci -I../drivers/bus/pci/bsd -Ilib/librte_pci -I../lib/librte_pci -Idrivers/bus/vdev -I../drivers/bus/vdev -Ilib/librte_hash -I../lib/librte_hash -fdiagnostics-color=always -pipe -D_FILE_OFFSET_BITS=64 -Wall -Winvalid-pch -Werror -O3 -include rte_config.h -Wunused-parameter -Wsign-compare -Wcast-qual -D_GNU_SOURCE -D__BSD_VISIBLE -fPIC -march=native -Wno-format-truncation -DALLOW_EXPERIMENTAL_API -MD -MQ 'drivers/a715181@@tmp_rte_pmd_ice at sta/net_ice_ice_rxtx.c.o' -MF 'drivers/a715181@@tmp_rte_pmd_ice at sta/net_ice_ice_rxtx.c.o.d' -o 'drivers/a715181@@tmp_rte_pmd_ice at sta/net_ice_ice_rxtx.c.o' -c ../drivers/net/ice/ice_rxtx.c
../drivers/net/ice/ice_rxtx.c: In function 'ice_program_hw_rx_queue':
../drivers/net/ice/ice_rxtx.c:61:19: error: 'ICE_RXDID_COMMS_GENERIC' undeclared (first use in this function); did you mean 'ICE_RXDID_FLEX_NIC'?
  uint32_t rxdid = ICE_RXDID_COMMS_GENERIC;
                   ^~~~~~~~~~~~~~~~~~~~~~~
                   ICE_RXDID_FLEX_NIC
../drivers/net/ice/ice_rxtx.c:61:19: note: each undeclared identifier is reported only once for each function it appears in
In file included from ../lib/librte_mbuf/rte_mbuf.h:43:0,
                 from ../lib/librte_net/rte_ether.h:23,
                 from ../lib/librte_ethdev/rte_ethdev.h:160,
                 from ../lib/librte_ethdev/rte_ethdev_driver.h:18,
                 from ../drivers/net/ice/ice_rxtx.c:5:
../drivers/net/ice/ice_rxtx.c: In function 'ice_rxd_to_pkt_fields':
../drivers/net/ice/ice_rxtx.c:1122:34: error: dereferencing pointer to incomplete type 'volatile struct ice_32b_rx_flex_desc_comms'
  stat_err = rte_le_to_cpu_16(desc->status_error0);
                                  ^
../lib/librte_eal/common/include/arch/x86/rte_byteorder.h:81:30: note: in definition of macro 'rte_le_to_cpu_16'
 #define rte_le_to_cpu_16(x) (x)
                              ^
[798/1413] Compiling C object 'drivers/a715181@@tmp_rte_pmd_ice at sta/net_ice_ice_generic_flow.c.o'.
[799/1413] Compiling C object 'drivers/a715181@@tmp_rte_pmd_ipn3ke at sta/net_ipn3ke_ipn3ke_ethdev.c.o'.
[800/1413] Compiling C object 'drivers/a715181@@tmp_rte_pmd_ice at sta/net_ice_ice_rxtx_vec_sse.c.o'.
[801/1413] Compiling C object 'drivers/a715181@@tmp_rte_pmd_ice at sta/net_ice_ice_rxtx_vec_avx2.c.o'.
[802/1413] Compiling C object 'drivers/a715181@@tmp_rte_pmd_ice at sta/net_ice_ice_ethdev.c.o'.
ninja: build stopped: subcommand failed



DPDK STV team


More information about the test-report mailing list