[dpdk-test-report] |FAILURE| pw50410 [PATCH] net/kni: calc mbuf&mtu according to given mb_pool

dpdklab at iol.unh.edu dpdklab at iol.unh.edu
Thu Feb 21 07:48:48 CET 2019


Test-Label: Performance-Testing
Test-Status: FAILURE
http://dpdk.org/patch/50410

_build patch failure_

Submitter: liron himi <lironh at marvell.com>
Date: Thursday, February 21 2019 08:47:35 
Applied on: Branch: dpdk
  CommitID:b13baac8d5ffb6b0b7a6ca0def884d3f1a82babb
Apply patch set 50410 failed:

Configuration done using x86_64-native-linuxapp-gcc
== Build lib
== Build lib/librte_compat
== Build lib/librte_kvargs
== Build lib/librte_eal
== Build lib/librte_eal/common
== Build lib/librte_eal/linuxapp
== Build lib/librte_eal/linuxapp/eal
== Build lib/librte_pci
== Build lib/librte_ring
== Build lib/librte_mempool
== Build lib/librte_mbuf
== Build lib/librte_timer
== Build lib/librte_cfgfile
== Build lib/librte_cmdline
== Build lib/librte_net
== Build lib/librte_meter
== Build lib/librte_ethdev
== Build lib/librte_bbdev
== Build lib/librte_cryptodev
== Build lib/librte_security
== Build lib/librte_compressdev
== Build lib/librte_hash
== Build lib/librte_eventdev
== Build lib/librte_rawdev
== Build lib/librte_vhost
== Build lib/librte_efd
== Build lib/librte_lpm
== Build lib/librte_acl
== Build lib/librte_member
== Build lib/librte_ip_frag
== Build lib/librte_gro
== Build lib/librte_jobstats
== Build lib/librte_metrics
== Build lib/librte_bitratestats
== Build lib/librte_latencystats
== Build lib/librte_power
== Build lib/librte_sched
== Build lib/librte_kni
== Build lib/librte_port
== Build lib/librte_table
== Build lib/librte_flow_classify
== Build lib/librte_distributor
== Build lib/librte_pipeline
== Build lib/librte_reorder
== Build lib/librte_pdump
== Build lib/librte_gso
== Build lib/librte_bpf
== Build lib/librte_ipsec
== Build buildtools
== Build buildtools/pmdinfogen
== Build kernel
== Build kernel/linux
== Build kernel/linux/igb_uio
  Building modules, stage 2.
  MODPOST 1 modules
== Build kernel/linux/kni
  CC [M]  /var/lib/jenkins/workspace/Apply-One-Patch-Set/dpdk/x86_64-native-linuxapp-gcc/build/kernel/linux/kni/kni_misc.o
/var/lib/jenkins/workspace/Apply-One-Patch-Set/dpdk/x86_64-native-linuxapp-gcc/build/kernel/linux/kni/kni_misc.c: In function ‘kni_ioctl_create’:
/var/lib/jenkins/workspace/Apply-One-Patch-Set/dpdk/x86_64-native-linuxapp-gcc/build/kernel/linux/kni/kni_misc.c:462:9: error: ‘struct net_device’ has no member named ‘max_mtu’
  net_dev->max_mtu = net_dev->mtu;
         ^
make[9]: *** [/var/lib/jenkins/workspace/Apply-One-Patch-Set/dpdk/x86_64-native-linuxapp-gcc/build/kernel/linux/kni/kni_misc.o] Error 1
make[8]: *** [_module_/var/lib/jenkins/workspace/Apply-One-Patch-Set/dpdk/x86_64-native-linuxapp-gcc/build/kernel/linux/kni] Error 2
make[7]: *** [sub-make] Error 2
make[6]: *** [rte_kni.ko] Error 2
make[5]: *** [kni] Error 2
make[4]: *** [linux] Error 2
make[3]: *** [kernel] Error 2
make[2]: *** [all] Error 2
make[1]: *** [pre_install] Error 2
make: *** [install] Error 2

https://lab.dpdk.org/results/dashboard/patchsets/4632/

UNH-IOL DPDK Performance Test Lab


More information about the test-report mailing list