[dpdk-test-report] |FAILURE| pw50535[v3] drivers: fix to replace strcat with strlcat

sys_stv at intel.com sys_stv at intel.com
Wed Feb 27 07:19:59 CET 2019


Test-Label: Intel-compilation
Test-Status: FAILURE
http://dpdk.org/patch/50535

_Compilation issues_

Submitter: Chaitanya Babu Talluri <tallurix.chaitanya.babu at intel.com>
Date: 2019-02-27 06:02:51
Reply_mail: 1551247371-32624-1-git-send-email-tallurix.chaitanya.babu at intel.com
DPDK git baseline: Repo:dpdk-next-eventdev, CommitID: 41d8285bdf0a7cd8f0d4f1b306e0ced9556081ac

Build Summary: 16 Builds Done, 2 Successful, 14 Failures

Test environment and configuration as below:

OS: UB1604
	Kernel Version: 4.4.0-78-generic
	CPU info: Intel(R) Xeon(R) CPU E5-2699 v3 @ 2.30GHz
	GCC Version: gcc (Ubuntu 5.4.0-6ubuntu1~16.04.10) 5.4.0 20160609
	Clang Version: 3.8.0-2ubuntu4 (tags/RELEASE_380/final)
	x86_64-native-linuxapp-gcc
	x86_64-native-linuxapp-clang
	x86_64-native-linuxapp-gcc-shared
	i686-native-linuxapp-gcc

OS: CENTOS
	Kernel Version: 3.10.0-957.1.3.el7.x86_64
	CPU info: Intel(R) Xeon(R) CPU E5-2699 v3 @ 2.30GHz
	GCC Version: gcc (GCC) 4.8.5 20150623 (Red Hat 4.8.5-36)
	Clang Version: 3.4.2 (tags/RELEASE_34/dot2-final)
	x86_64-native-linuxapp-clang
	x86_64-native-linuxapp-gcc-shared
	i686-native-linuxapp-gcc
	x86_64-native-linuxapp-gcc

OS: UBT1804
	Kernel Version: 4.15.0-29-generic
	CPU info: Intel(R) Xeon(R) Platinum 8180M CPU @ 2.50GHz
	GCC Version: gcc (Ubuntu 7.3.0-27ubuntu1~18.04) 7.3.0
	Clang Version: 6.0.0-1ubuntu2 (tags/RELEASE_600/final)
	x86_64-native-linuxapp-gcc

OS: FC25
	Kernel Version: 4.5.5-300.fc24.x86_64
	CPU info: Intel(R) Xeon(R) CPU E5-2699 v3 @ 2.30GHz
	GCC Version: gcc (GCC) 6.1.1 20160510 (Red Hat 6.1.1-2)
	Clang Version: 3.8.0 (tags/RELEASE_380/final)
	x86_64-native-linuxapp-gcc
	x86_64-native-linuxapp-gcc-debug

OS: FC24
	Kernel Version: 4.11.12-100.fc24.x86_64
	CPU info: Intel(R) Xeon(R) CPU E5-2699 v3 @ 2.30GHz
	GCC Version: gcc (GCC) 6.3.1 20161221 (Red Hat 6.3.1-1)
	Clang Version: 3.8.1 (tags/RELEASE_381/final)
	x86_64-native-linuxapp-gcc-shared
	i686-native-linuxapp-gcc
	x86_64-native-linuxapp-clang

OS: FreeBSD
	Kernel Version: 10.3-RELEASE
	CPU info: Intel(R) Xeon(R) CPU E5-2699 v3 @ 2.30GHz (2294.75-MHz K8-class CPU)
	GCC Version: gcc (FreeBSD Ports Collection) 7.3.0
	Clang Version: 3.4.1 (tags/RELEASE_34/dot1-final 208032) 20140512
	x86_64-native-bsdapp-clang
	x86_64-native-bsdapp-gcc

*Failed Build #1:
OS: FC25
Target: x86_64-native-linuxapp-gcc
  CC i40e_dcb.o
  CC i40e_ethdev.o
  CC ixgbe_x550.o
  CC ixgbe_phy.o
/tmp/FC25_K4.8.6_GCC6.3.1/x86_64-native-linuxapp-gcc/e8fb31f936de422a8e327cc29084ed20/dpdk/drivers/net/i40e/i40e_ethdev.c: In function ‘i40e_update_customized_pctype’:
/tmp/FC25_K4.8.6_GCC6.3.1/x86_64-native-linuxapp-gcc/e8fb31f936de422a8e327cc29084ed20/dpdk/drivers/net/i40e/i40e_ethdev.c:12163:5: warning: implicit declaration of function ‘strlcat’ [-Wimplicit-function-declaration]
     strlcat(name, proto[n].name,
     ^~~~~~~
/tmp/FC25_K4.8.6_GCC6.3.1/x86_64-native-linuxapp-gcc/e8fb31f936de422a8e327cc29084ed20/dpdk/drivers/net/i40e/i40e_ethdev.c:12163:5: warning: nested extern declaration of ‘strlcat’ [-Wnested-externs]
== Build drivers/net/liquidio
  CC ixgbe_api.o
  CC lio_ethdev.o
  CC ixgbe_vf.o
  CC ixgbe_hv_vf.o
--
  AR librte_pmd_skeleton_rawdev.a
  INSTALL-LIB librte_pmd_skeleton_rawdev.a
  CC ifpga_fme.o
  CC ifpga_fme_iperf.o
  CC ifpga_fme_dperf.o
  CC ifpga_fme_error.o
  CC ifpga_port.o
  CC opae_hw_api.o
  CC ifpga_port_error.o
  CC opae_ifpga_hw_api.o
  CC opae_debug.o
  CC ifpga_fme_pr.o
  CC ifpga_rawdev.o
  PMDINFO ifpga_rawdev.o.pmd.c
--
  LD dpdk-pdump
/tmp/FC25_K4.8.6_GCC6.3.1/x86_64-native-linuxapp-gcc/e8fb31f936de422a8e327cc29084ed20/dpdk/x86_64-native-linuxapp-gcc/lib/librte_pmd_i40e.a(i40e_ethdev.o): In function `i40e_update_customized_info':
(.text+0x17206): undefined reference to `strlcat'
/tmp/FC25_K4.8.6_GCC6.3.1/x86_64-native-linuxapp-gcc/e8fb31f936de422a8e327cc29084ed20/dpdk/x86_64-native-linuxapp-gcc/lib/librte_pmd_i40e.a(i40e_ethdev.o): In function `i40e_update_customized_info':
(.text+0x1725c): undefined reference to `strlcat'
collect2: error: ld returned 1 exit status
/tmp/FC25_K4.8.6_GCC6.3.1/x86_64-native-linuxapp-gcc/e8fb31f936de422a8e327cc29084ed20/dpdk/mk/rte.app.mk:394: recipe for target 'dpdk-procinfo' failed
make[5]: *** [dpdk-procinfo] Error 1
/tmp/FC25_K4.8.6_GCC6.3.1/x86_64-native-linuxapp-gcc/e8fb31f936de422a8e327cc29084ed20/dpdk/mk/rte.subdir.mk:35: recipe for target 'proc-info' failed
make[4]: *** [proc-info] Error 2
make[4]: *** Waiting for unfinished jobs....
  CC parameters.o
/tmp/FC25_K4.8.6_GCC6.3.1/x86_64-native-linuxapp-gcc/e8fb31f936de422a8e327cc29084ed20/dpdk/x86_64-native-linuxapp-gcc/lib/librte_pmd_i40e.a(i40e_ethdev.o): In function `i40e_update_customized_info':
(.text+0x17206): undefined reference to `strlcat'
/tmp/FC25_K4.8.6_GCC6.3.1/x86_64-native-linuxapp-gcc/e8fb31f936de422a8e327cc29084ed20/dpdk/x86_64-native-linuxapp-gcc/lib/librte_pmd_i40e.a(i40e_ethdev.o): In function `i40e_update_customized_info':
(.text+0x1725c): undefined reference to `strlcat'
collect2: error: ld returned 1 exit status
/tmp/FC25_K4.8.6_GCC6.3.1/x86_64-native-linuxapp-gcc/e8fb31f936de422a8e327cc29084ed20/dpdk/mk/rte.app.mk:394: recipe for target 'dpdk-pdump' failed
make[5]: *** [dpdk-pdump] Error 1
/tmp/FC25_K4.8.6_GCC6.3.1/x86_64-native-linuxapp-gcc/e8fb31f936de422a8e327cc29084ed20/dpdk/mk/rte.subdir.mk:35: recipe for target 'pdump' failed
make[4]: *** [pdump] Error 2
  CC cmdline.o
  CC cmdline_flow.o
  CC cmdline_mtr.o
  CC cmdline_tm.o
--
  LD testpmd
/tmp/FC25_K4.8.6_GCC6.3.1/x86_64-native-linuxapp-gcc/e8fb31f936de422a8e327cc29084ed20/dpdk/x86_64-native-linuxapp-gcc/lib/librte_pmd_i40e.a(i40e_ethdev.o): In function `i40e_update_customized_info':
(.text+0x17206): undefined reference to `strlcat'
/tmp/FC25_K4.8.6_GCC6.3.1/x86_64-native-linuxapp-gcc/e8fb31f936de422a8e327cc29084ed20/dpdk/x86_64-native-linuxapp-gcc/lib/librte_pmd_i40e.a(i40e_ethdev.o): In function `i40e_update_customized_info':
(.text+0x1725c): undefined reference to `strlcat'
collect2: error: ld returned 1 exit status
/tmp/FC25_K4.8.6_GCC6.3.1/x86_64-native-linuxapp-gcc/e8fb31f936de422a8e327cc29084ed20/dpdk/mk/rte.app.mk:394: recipe for target 'testpmd' failed
make[5]: *** [testpmd] Error 1
/tmp/FC25_K4.8.6_GCC6.3.1/x86_64-native-linuxapp-gcc/e8fb31f936de422a8e327cc29084ed20/dpdk/mk/rte.subdir.mk:35: recipe for target 'test-pmd' failed
make[4]: *** [test-pmd] Error 2
/tmp/FC25_K4.8.6_GCC6.3.1/x86_64-native-linuxapp-gcc/e8fb31f936de422a8e327cc29084ed20/dpdk/mk/rte.sdkbuild.mk:49: recipe for target 'app' failed
make[3]: *** [app] Error 2
/tmp/FC25_K4.8.6_GCC6.3.1/x86_64-native-linuxapp-gcc/e8fb31f936de422a8e327cc29084ed20/dpdk/mk/rte.sdkroot.mk:100: recipe for target 'all' failed
make[2]: *** [all] Error 2
/tmp/FC25_K4.8.6_GCC6.3.1/x86_64-native-linuxapp-gcc/e8fb31f936de422a8e327cc29084ed20/dpdk/mk/rte.sdkinstall.mk:57: recipe for target 'pre_install' failed
make[1]: *** [pre_install] Error 2
/tmp/FC25_K4.8.6_GCC6.3.1/x86_64-native-linuxapp-gcc/e8fb31f936de422a8e327cc29084ed20/dpdk/mk/rte.sdkroot.mk:79: recipe for target 'install' failed
make: *** [install] Error 2

*Failed Build #2:
OS: UBT1804
Target: x86_64-native-linuxapp-gcc
  CC lio_ethdev.o.pmd.o
  LD lio_ethdev.o
  CC i40e_ethdev.o
  CC lio_rxtx.o
/tmp/UBT1804_K4.15.0_GCC7.3.0/x86_64-native-linuxapp-gcc/e8fb31f936de422a8e327cc29084ed20/dpdk/drivers/net/i40e/i40e_ethdev.c: In function ‘i40e_update_customized_pctype’:
/tmp/UBT1804_K4.15.0_GCC7.3.0/x86_64-native-linuxapp-gcc/e8fb31f936de422a8e327cc29084ed20/dpdk/drivers/net/i40e/i40e_ethdev.c:12163:5: warning: implicit declaration of function ‘strlcat’; did you mean ‘strncat’? [-Wimplicit-function-declaration]
     strlcat(name, proto[n].name,
     ^~~~~~~
     strncat
/tmp/UBT1804_K4.15.0_GCC7.3.0/x86_64-native-linuxapp-gcc/e8fb31f936de422a8e327cc29084ed20/dpdk/drivers/net/i40e/i40e_ethdev.c:12163:5: warning: nested extern declaration of ‘strlcat’ [-Wnested-externs]
  CC ixgbe_82598.o
  CC ixgbe_82599.o
  CC lio_23xx_vf.o
  CC ixgbe_x540.o
  CC lio_mbox.o
--
  INSTALL-LIB librte_pmd_dpaa2_qdma.a
  CC ifpga_feature_dev.o
  CC ifpga_fme.o
  CC ifpga_fme_iperf.o
  CC ifpga_fme_dperf.o
  CC ifpga_fme_error.o
  CC ifpga_port.o
  CC ifpga_port_error.o
  CC opae_hw_api.o
  CC opae_ifpga_hw_api.o
  CC opae_debug.o
  CC ifpga_fme_pr.o
  CC ifpga_rawdev.o
--
  LD dpdk-procinfo
  LD dpdk-pdump
/tmp/UBT1804_K4.15.0_GCC7.3.0/x86_64-native-linuxapp-gcc/e8fb31f936de422a8e327cc29084ed20/dpdk/x86_64-native-linuxapp-gcc/lib/librte_pmd_i40e.a(i40e_ethdev.o): In function `i40e_update_customized_info':
(.text+0x18bfa): undefined reference to `strlcat'
(.text+0x18c52): undefined reference to `strlcat'
collect2: error: ld returned 1 exit status
/tmp/UBT1804_K4.15.0_GCC7.3.0/x86_64-native-linuxapp-gcc/e8fb31f936de422a8e327cc29084ed20/dpdk/mk/rte.app.mk:394: recipe for target 'dpdk-procinfo' failed
make[5]: *** [dpdk-procinfo] Error 1
/tmp/UBT1804_K4.15.0_GCC7.3.0/x86_64-native-linuxapp-gcc/e8fb31f936de422a8e327cc29084ed20/dpdk/mk/rte.subdir.mk:35: recipe for target 'proc-info' failed
make[4]: *** [proc-info] Error 2
make[4]: *** Waiting for unfinished jobs....
  CC parameters.o
/tmp/UBT1804_K4.15.0_GCC7.3.0/x86_64-native-linuxapp-gcc/e8fb31f936de422a8e327cc29084ed20/dpdk/x86_64-native-linuxapp-gcc/lib/librte_pmd_i40e.a(i40e_ethdev.o): In function `i40e_update_customized_info':
(.text+0x18bfa): undefined reference to `strlcat'
(.text+0x18c52): undefined reference to `strlcat'
collect2: error: ld returned 1 exit status
/tmp/UBT1804_K4.15.0_GCC7.3.0/x86_64-native-linuxapp-gcc/e8fb31f936de422a8e327cc29084ed20/dpdk/mk/rte.app.mk:394: recipe for target 'dpdk-pdump' failed
make[5]: *** [dpdk-pdump] Error 1
/tmp/UBT1804_K4.15.0_GCC7.3.0/x86_64-native-linuxapp-gcc/e8fb31f936de422a8e327cc29084ed20/dpdk/mk/rte.subdir.mk:35: recipe for target 'pdump' failed
make[4]: *** [pdump] Error 2
  CC cmdline.o
  CC cmdline_flow.o
  CC cmdline_mtr.o
  CC cmdline_tm.o
--
  CC softnicfwd.o
  LD testpmd
/tmp/UBT1804_K4.15.0_GCC7.3.0/x86_64-native-linuxapp-gcc/e8fb31f936de422a8e327cc29084ed20/dpdk/x86_64-native-linuxapp-gcc/lib/librte_pmd_i40e.a(i40e_ethdev.o): In function `i40e_update_customized_info':
(.text+0x18bfa): undefined reference to `strlcat'
(.text+0x18c52): undefined reference to `strlcat'
collect2: error: ld returned 1 exit status
/tmp/UBT1804_K4.15.0_GCC7.3.0/x86_64-native-linuxapp-gcc/e8fb31f936de422a8e327cc29084ed20/dpdk/mk/rte.app.mk:394: recipe for target 'testpmd' failed
make[5]: *** [testpmd] Error 1
/tmp/UBT1804_K4.15.0_GCC7.3.0/x86_64-native-linuxapp-gcc/e8fb31f936de422a8e327cc29084ed20/dpdk/mk/rte.subdir.mk:35: recipe for target 'test-pmd' failed
make[4]: *** [test-pmd] Error 2
/tmp/UBT1804_K4.15.0_GCC7.3.0/x86_64-native-linuxapp-gcc/e8fb31f936de422a8e327cc29084ed20/dpdk/mk/rte.sdkbuild.mk:49: recipe for target 'app' failed
make[3]: *** [app] Error 2
/tmp/UBT1804_K4.15.0_GCC7.3.0/x86_64-native-linuxapp-gcc/e8fb31f936de422a8e327cc29084ed20/dpdk/mk/rte.sdkroot.mk:100: recipe for target 'all' failed
make[2]: *** [all] Error 2
/tmp/UBT1804_K4.15.0_GCC7.3.0/x86_64-native-linuxapp-gcc/e8fb31f936de422a8e327cc29084ed20/dpdk/mk/rte.sdkinstall.mk:57: recipe for target 'pre_install' failed
make[1]: *** [pre_install] Error 2
/tmp/UBT1804_K4.15.0_GCC7.3.0/x86_64-native-linuxapp-gcc/e8fb31f936de422a8e327cc29084ed20/dpdk/mk/rte.sdkroot.mk:79: recipe for target 'install' failed
make: *** [install] Error 2

*Failed Build #3:
OS: UB1604
Target: x86_64-native-linuxapp-gcc
  CC i40e_ethdev.o
  CC ixgbe_vf.o
  CC hn_ethdev.o
  CC ixgbe_hv_vf.o
/tmp/UB1604_K4.8.0_GCC6.2.0/x86_64-native-linuxapp-gcc/e8fb31f936de422a8e327cc29084ed20/dpdk/drivers/net/i40e/i40e_ethdev.c: In function ‘i40e_update_customized_pctype’:
/tmp/UB1604_K4.8.0_GCC6.2.0/x86_64-native-linuxapp-gcc/e8fb31f936de422a8e327cc29084ed20/dpdk/drivers/net/i40e/i40e_ethdev.c:12163:5: warning: implicit declaration of function ‘strlcat’ [-Wimplicit-function-declaration]
     strlcat(name, proto[n].name,
     ^~~~~~~
/tmp/UB1604_K4.8.0_GCC6.2.0/x86_64-native-linuxapp-gcc/e8fb31f936de422a8e327cc29084ed20/dpdk/drivers/net/i40e/i40e_ethdev.c:12163:5: warning: nested extern declaration of ‘strlcat’ [-Wnested-externs]
  CC ixgbe_dcb.o
  PMDINFO hn_ethdev.o.pmd.c
  CC hn_ethdev.o.pmd.o
  LD hn_ethdev.o
  CC hn_rxtx.o
--
  AR librte_pmd_skeleton_rawdev.a
  INSTALL-LIB librte_pmd_skeleton_rawdev.a
  CC ifpga_fme.o
  CC ifpga_fme_iperf.o
  CC ifpga_fme_dperf.o
  CC ifpga_fme_error.o
  CC ifpga_port.o
  CC ifpga_port_error.o
  CC opae_hw_api.o
  CC opae_ifpga_hw_api.o
  CC opae_debug.o
  CC ifpga_fme_pr.o
  CC ifpga_rawdev.o
--
  LD dpdk-pdump
/tmp/UB1604_K4.8.0_GCC6.2.0/x86_64-native-linuxapp-gcc/e8fb31f936de422a8e327cc29084ed20/dpdk/x86_64-native-linuxapp-gcc/lib/librte_pmd_i40e.a(i40e_ethdev.o): In function `i40e_update_customized_info':
(.text+0x18222): undefined reference to `strlcat'
/tmp/UB1604_K4.8.0_GCC6.2.0/x86_64-native-linuxapp-gcc/e8fb31f936de422a8e327cc29084ed20/dpdk/x86_64-native-linuxapp-gcc/lib/librte_pmd_i40e.a(i40e_ethdev.o): In function `i40e_update_customized_info':
(.text+0x18276): undefined reference to `strlcat'
collect2: error: ld returned 1 exit status
/tmp/UB1604_K4.8.0_GCC6.2.0/x86_64-native-linuxapp-gcc/e8fb31f936de422a8e327cc29084ed20/dpdk/mk/rte.app.mk:394: recipe for target 'dpdk-procinfo' failed
make[5]: *** [dpdk-procinfo] Error 1
/tmp/UB1604_K4.8.0_GCC6.2.0/x86_64-native-linuxapp-gcc/e8fb31f936de422a8e327cc29084ed20/dpdk/mk/rte.subdir.mk:35: recipe for target 'proc-info' failed
make[4]: *** [proc-info] Error 2
make[4]: *** Waiting for unfinished jobs....
  CC parameters.o
/tmp/UB1604_K4.8.0_GCC6.2.0/x86_64-native-linuxapp-gcc/e8fb31f936de422a8e327cc29084ed20/dpdk/x86_64-native-linuxapp-gcc/lib/librte_pmd_i40e.a(i40e_ethdev.o): In function `i40e_update_customized_info':
(.text+0x18222): undefined reference to `strlcat'
/tmp/UB1604_K4.8.0_GCC6.2.0/x86_64-native-linuxapp-gcc/e8fb31f936de422a8e327cc29084ed20/dpdk/x86_64-native-linuxapp-gcc/lib/librte_pmd_i40e.a(i40e_ethdev.o): In function `i40e_update_customized_info':
(.text+0x18276): undefined reference to `strlcat'
collect2: error: ld returned 1 exit status
/tmp/UB1604_K4.8.0_GCC6.2.0/x86_64-native-linuxapp-gcc/e8fb31f936de422a8e327cc29084ed20/dpdk/mk/rte.app.mk:394: recipe for target 'dpdk-pdump' failed
make[5]: *** [dpdk-pdump] Error 1
/tmp/UB1604_K4.8.0_GCC6.2.0/x86_64-native-linuxapp-gcc/e8fb31f936de422a8e327cc29084ed20/dpdk/mk/rte.subdir.mk:35: recipe for target 'pdump' failed
make[4]: *** [pdump] Error 2
  CC cmdline.o
  CC cmdline_flow.o
  CC cmdline_mtr.o
  CC cmdline_tm.o
--
  LD testpmd
/tmp/UB1604_K4.8.0_GCC6.2.0/x86_64-native-linuxapp-gcc/e8fb31f936de422a8e327cc29084ed20/dpdk/x86_64-native-linuxapp-gcc/lib/librte_pmd_i40e.a(i40e_ethdev.o): In function `i40e_update_customized_info':
(.text+0x18222): undefined reference to `strlcat'
/tmp/UB1604_K4.8.0_GCC6.2.0/x86_64-native-linuxapp-gcc/e8fb31f936de422a8e327cc29084ed20/dpdk/x86_64-native-linuxapp-gcc/lib/librte_pmd_i40e.a(i40e_ethdev.o): In function `i40e_update_customized_info':
(.text+0x18276): undefined reference to `strlcat'
collect2: error: ld returned 1 exit status
/tmp/UB1604_K4.8.0_GCC6.2.0/x86_64-native-linuxapp-gcc/e8fb31f936de422a8e327cc29084ed20/dpdk/mk/rte.app.mk:394: recipe for target 'testpmd' failed
make[5]: *** [testpmd] Error 1
/tmp/UB1604_K4.8.0_GCC6.2.0/x86_64-native-linuxapp-gcc/e8fb31f936de422a8e327cc29084ed20/dpdk/mk/rte.subdir.mk:35: recipe for target 'test-pmd' failed
make[4]: *** [test-pmd] Error 2
/tmp/UB1604_K4.8.0_GCC6.2.0/x86_64-native-linuxapp-gcc/e8fb31f936de422a8e327cc29084ed20/dpdk/mk/rte.sdkbuild.mk:49: recipe for target 'app' failed
make[3]: *** [app] Error 2
/tmp/UB1604_K4.8.0_GCC6.2.0/x86_64-native-linuxapp-gcc/e8fb31f936de422a8e327cc29084ed20/dpdk/mk/rte.sdkroot.mk:100: recipe for target 'all' failed
make[2]: *** [all] Error 2
/tmp/UB1604_K4.8.0_GCC6.2.0/x86_64-native-linuxapp-gcc/e8fb31f936de422a8e327cc29084ed20/dpdk/mk/rte.sdkinstall.mk:57: recipe for target 'pre_install' failed
make[1]: *** [pre_install] Error 2
/tmp/UB1604_K4.8.0_GCC6.2.0/x86_64-native-linuxapp-gcc/e8fb31f936de422a8e327cc29084ed20/dpdk/mk/rte.sdkroot.mk:79: recipe for target 'install' failed
make: *** [install] Error 2

*Failed Build #4:
OS: CENTOS
Target: x86_64-native-linuxapp-clang
  PMDINFO lio_ethdev.o.pmd.c
  CC lio_ethdev.o.pmd.o
  LD lio_ethdev.o
  CC lio_rxtx.o
  CC ixgbe_82599.o
/tmp/CENTOS_K3.10.0_GCC4.8.5/x86_64-native-linuxapp-clang/e8fb31f936de422a8e327cc29084ed20/dpdk/drivers/net/i40e/i40e_ethdev.c:12163:5: warning: implicitly declaring library function 'strlcat' with type 'unsigned long (char *, const char *, unsigned long)'
                                strlcat(name, proto[n].name,
                                ^
/tmp/CENTOS_K3.10.0_GCC4.8.5/x86_64-native-linuxapp-clang/e8fb31f936de422a8e327cc29084ed20/dpdk/drivers/net/i40e/i40e_ethdev.c:12163:5: note: please include the header <string.h> or explicitly provide a declaration for 'strlcat'
  CC lio_23xx_vf.o
  CC ixgbe_x540.o
--
  PMDINFO hn_ethdev.o.pmd.c
  CC hn_ethdev.o.pmd.o
  LD hn_ethdev.o
  CC hn_rxtx.o
  CC ixgbe_phy.o
1 warning generated.
  CC ixgbe_api.o
  PMDINFO i40e_ethdev.o.pmd.c
  CC i40e_ethdev.o.pmd.o
  LD i40e_ethdev.o
  CC i40e_rxtx_vec_sse.o
--
  CC ifpga_fme.o
  CC ifpga_fme_iperf.o
  CC ifpga_fme_dperf.o
  AR librte_pmd_dpaa2_qdma.a
  INSTALL-LIB librte_pmd_dpaa2_qdma.a
  CC ifpga_fme_error.o
  CC ifpga_port.o
  CC ifpga_port_error.o
  CC opae_hw_api.o
  CC opae_ifpga_hw_api.o
  CC opae_debug.o
  CC ifpga_fme_pr.o
  CC ifpga_rawdev.o
--
7a21): undefined reference to `strlcat'
/tmp/CENTOS_K3.10.0_GCC4.8.5/x86_64-native-linuxapp-clang/e8fb31f936de422a8e327cc29084ed20/dpdk/x86_64-native-linuxapp-clang/lib/librte_pmd_i40e.a(i40e_ethdev.o): In function `i40e_update_customized_info':
(.text+0x7a43): undefined reference to `strlcat'
/tmp/CENTOS_K3.10.0_GCC4.8.5/x86_64-native-linuxapp-clang/e8fb31f936de422a8e327cc29084ed20/dpdk/x86_64-native-linuxapp-clang/lib/librte_pmd_i40e.a(i40e_ethdev.o): In function `i40e_update_customized_info':
(.text+0x7a43): undefined reference to `strlcat'
clang: error: linker command failed with exit code 1 (use -v to see invocation)
make[5]: *** [dpdk-pdump] Error 1
make[4]: *** [pdump] Error 2
make[4]: *** Waiting for unfinished jobs....
  CC parameters.o
clang: error: linker command failed with exit code 1 (use -v to see invocation)
make[5]: *** [dpdk-procinfo] Error 1
make[4]: *** [proc-info] Error 2
  CC cmdline.o
  CC cmdline_flow.o
  CC cmdline_mtr.o
--
  LD testpmd
/tmp/CENTOS_K3.10.0_GCC4.8.5/x86_64-native-linuxapp-clang/e8fb31f936de422a8e327cc29084ed20/dpdk/x86_64-native-linuxapp-clang/lib/librte_pmd_i40e.a(i40e_ethdev.o): In function `i40e_update_customized_info':
(.text+0x7a21): undefined reference to `strlcat'
/tmp/CENTOS_K3.10.0_GCC4.8.5/x86_64-native-linuxapp-clang/e8fb31f936de422a8e327cc29084ed20/dpdk/x86_64-native-linuxapp-clang/lib/librte_pmd_i40e.a(i40e_ethdev.o): In function `i40e_update_customized_info':
(.text+0x7a43): undefined reference to `strlcat'
clang: error: linker command failed with exit code 1 (use -v to see invocation)
make[5]: *** [testpmd] Error 1
make[4]: *** [test-pmd] Error 2
make[3]: *** [app] Error 2
make[2]: *** [all] Error 2
make[1]: *** [pre_install] Error 2

*Failed Build #5:
OS: CENTOS
Target: x86_64-native-linuxapp-gcc-shared
== Build drivers/net/ixgbe
  CC fm10k_api.o
  CC fm10k_rxtx_vec.o
  CC i40e_ethdev.o
/tmp/CENTOS_K3.10.0_GCC4.8.5/x86_64-native-linuxapp-gcc-shared/e8fb31f936de422a8e327cc29084ed20/dpdk/drivers/net/i40e/i40e_ethdev.c: In function ‘i40e_update_customized_pctype’:
/tmp/CENTOS_K3.10.0_GCC4.8.5/x86_64-native-linuxapp-gcc-shared/e8fb31f936de422a8e327cc29084ed20/dpdk/drivers/net/i40e/i40e_ethdev.c:12163:5: warning: implicit declaration of function ‘strlcat’ [-Wimplicit-function-declaration]
     strlcat(name, proto[n].name,
     ^
/tmp/CENTOS_K3.10.0_GCC4.8.5/x86_64-native-linuxapp-gcc-shared/e8fb31f936de422a8e327cc29084ed20/dpdk/drivers/net/i40e/i40e_ethdev.c:12163:5: warning: nested extern declaration of ‘strlcat’ [-Wnested-externs]
  SYMLINK-FILE include/rte_pmd_ixgbe.h
  CC ixgbe_common.o
  LD librte_pmd_fm10k.so.1.1
  INSTALL-LIB librte_pmd_fm10k.so.1.1
  CC i40e_rxtx.o
--
  CC lio_23xx_vf.o
i40e_ethdev.o: In function `i40e_update_customized_info':
(.text+0x17a53): undefined reference to `strlcat'
i40e_ethdev.o: In function `i40e_update_customized_info':
(.text+0x17aa8): undefined reference to `strlcat'
collect2: error: ld returned 1 exit status
make[6]: *** [librte_pmd_i40e.so.2.1] Error 1
make[5]: *** [i40e] Error 2
make[5]: *** Waiting for unfinished jobs....
  CC lio_mbox.o
  CC ixgbe_ethdev.o

*Failed Build #6:
OS: UB1604
Target: x86_64-native-linuxapp-clang
== Build drivers/net/netvsc
  CC i40e_ethdev.o
  CC hn_ethdev.o
  CC ixgbe_dcb_82598.o
  CC ixgbe_mbx.o
/tmp/UB1604_K4.4.0_GCC5.4.0/x86_64-native-linuxapp-clang/e8fb31f936de422a8e327cc29084ed20/dpdk/drivers/net/i40e/i40e_ethdev.c:12163:5: warning: implicit declaration of function 'strlcat' is invalid in C99 [-Wimplicit-function-declaration]
                                strlcat(name, proto[n].name,
                                ^
  PMDINFO hn_ethdev.o.pmd.c
  CC hn_ethdev.o.pmd.o
  CC ixgbe_rxtx.o
--
  CC hn_vf.o
  CC ixgbe_ethdev.o
  AR librte_pmd_netvsc.a
  INSTALL-LIB librte_pmd_netvsc.a
  CC ixgbe_fdir.o
1 warning generated.
  PMDINFO i40e_ethdev.o.pmd.c
  CC i40e_ethdev.o.pmd.o
  LD i40e_ethdev.o
  CC i40e_rxtx.o
  CC i40e_rxtx_vec_sse.o
--
  AR librte_pmd_dpaa2_qdma.a
  INSTALL-LIB librte_pmd_dpaa2_qdma.a
  CC ifpga_fme.o
  CC ifpga_fme_iperf.o
  CC ifpga_fme_dperf.o
  CC ifpga_fme_error.o
  CC ifpga_port.o
  CC ifpga_port_error.o
  CC opae_hw_api.o
  CC opae_ifpga_hw_api.o
  CC opae_debug.o
  CC ifpga_fme_pr.o
  CC ifpga_rawdev.o
--
(.text+0x82b6): undefined reference to `strlcat'
/tmp/UB1604_K4.4.0_GCC5.4.0/x86_64-native-linuxapp-clang/e8fb31f936de422a8e327cc29084ed20/dpdk/x86_64-native-linuxapp-clang/lib/librte_pmd_i40e.a(i40e_ethdev.o): In function `i40e_update_customized_info':
(.text+0x8297): undefined reference to `strlcat'
/tmp/UB1604_K4.4.0_GCC5.4.0/x86_64-native-linuxapp-clang/e8fb31f936de422a8e327cc29084ed20/dpdk/x86_64-native-linuxapp-clang/lib/librte_pmd_i40e.a(i40e_ethdev.o): In function `i40e_update_customized_info':
(.text+0x82b6): undefined reference to `strlcat'
clang: error: linker command failed with exit code 1 (use -v to see invocation)
/tmp/UB1604_K4.4.0_GCC5.4.0/x86_64-native-linuxapp-clang/e8fb31f936de422a8e327cc29084ed20/dpdk/mk/rte.app.mk:394: recipe for target 'dpdk-procinfo' failed
make[5]: *** [dpdk-procinfo] Error 1
/tmp/UB1604_K4.4.0_GCC5.4.0/x86_64-native-linuxapp-clang/e8fb31f936de422a8e327cc29084ed20/dpdk/mk/rte.subdir.mk:35: recipe for target 'proc-info' failed
make[4]: *** [proc-info] Error 2
make[4]: *** Waiting for unfinished jobs....
  CC parameters.o
clang: error: linker command failed with exit code 1 (use -v to see invocation)
/tmp/UB1604_K4.4.0_GCC5.4.0/x86_64-native-linuxapp-clang/e8fb31f936de422a8e327cc29084ed20/dpdk/mk/rte.app.mk:394: recipe for target 'dpdk-pdump' failed
make[5]: *** [dpdk-pdump] Error 1
/tmp/UB1604_K4.4.0_GCC5.4.0/x86_64-native-linuxapp-clang/e8fb31f936de422a8e327cc29084ed20/dpdk/mk/rte.subdir.mk:35: recipe for target 'pdump' failed
make[4]: *** [pdump] Error 2
  CC cmdline.o
  CC cmdline_flow.o
  CC cmdline_mtr.o
  CC cmdline_tm.o
--
  LD testpmd
/tmp/UB1604_K4.4.0_GCC5.4.0/x86_64-native-linuxapp-clang/e8fb31f936de422a8e327cc29084ed20/dpdk/x86_64-native-linuxapp-clang/lib/librte_pmd_i40e.a(i40e_ethdev.o): In function `i40e_update_customized_info':
(.text+0x8297): undefined reference to `strlcat'
/tmp/UB1604_K4.4.0_GCC5.4.0/x86_64-native-linuxapp-clang/e8fb31f936de422a8e327cc29084ed20/dpdk/x86_64-native-linuxapp-clang/lib/librte_pmd_i40e.a(i40e_ethdev.o): In function `i40e_update_customized_info':
(.text+0x82b6): undefined reference to `strlcat'
clang: error: linker command failed with exit code 1 (use -v to see invocation)
/tmp/UB1604_K4.4.0_GCC5.4.0/x86_64-native-linuxapp-clang/e8fb31f936de422a8e327cc29084ed20/dpdk/mk/rte.app.mk:394: recipe for target 'testpmd' failed
make[5]: *** [testpmd] Error 1
/tmp/UB1604_K4.4.0_GCC5.4.0/x86_64-native-linuxapp-clang/e8fb31f936de422a8e327cc29084ed20/dpdk/mk/rte.subdir.mk:35: recipe for target 'test-pmd' failed
make[4]: *** [test-pmd] Error 2
/tmp/UB1604_K4.4.0_GCC5.4.0/x86_64-native-linuxapp-clang/e8fb31f936de422a8e327cc29084ed20/dpdk/mk/rte.sdkbuild.mk:49: recipe for target 'app' failed
make[3]: *** [app] Error 2
/tmp/UB1604_K4.4.0_GCC5.4.0/x86_64-native-linuxapp-clang/e8fb31f936de422a8e327cc29084ed20/dpdk/mk/rte.sdkroot.mk:100: recipe for target 'all' failed
make[2]: *** [all] Error 2
/tmp/UB1604_K4.4.0_GCC5.4.0/x86_64-native-linuxapp-clang/e8fb31f936de422a8e327cc29084ed20/dpdk/mk/rte.sdkinstall.mk:57: recipe for target 'pre_install' failed
make[1]: *** [pre_install] Error 2
/tmp/UB1604_K4.4.0_GCC5.4.0/x86_64-native-linuxapp-clang/e8fb31f936de422a8e327cc29084ed20/dpdk/mk/rte.sdkroot.mk:79: recipe for target 'install' failed
make: *** [install] Error 2

*Failed Build #7:
OS: UB1604
Target: x86_64-native-linuxapp-gcc-shared
  CC i40e_dcb.o
  CC ixgbe_phy.o
  CC i40e_ethdev.o
  LD librte_pmd_fm10k.so.1.1
/tmp/UB1604_K4.4.0_GCC5.4.0/x86_64-native-linuxapp-gcc-shared/e8fb31f936de422a8e327cc29084ed20/dpdk/drivers/net/i40e/i40e_ethdev.c: In function ‘i40e_update_customized_pctype’:
/tmp/UB1604_K4.4.0_GCC5.4.0/x86_64-native-linuxapp-gcc-shared/e8fb31f936de422a8e327cc29084ed20/dpdk/drivers/net/i40e/i40e_ethdev.c:12163:5: warning: implicit declaration of function ‘strlcat’ [-Wimplicit-function-declaration]
     strlcat(name, proto[n].name,
     ^
/tmp/UB1604_K4.4.0_GCC5.4.0/x86_64-native-linuxapp-gcc-shared/e8fb31f936de422a8e327cc29084ed20/dpdk/drivers/net/i40e/i40e_ethdev.c:12163:5: warning: nested extern declaration of ‘strlcat’ [-Wnested-externs]
  INSTALL-LIB librte_pmd_fm10k.so.1.1
  CC i40e_rxtx.o
  CC ixgbe_api.o
  CC ixgbe_vf.o
  CC ixgbe_hv_vf.o
--
  LD librte_pmd_i40e.so.2.1
i40e_ethdev.o: In function `i40e_update_customized_info':
(.text+0x15e16): undefined reference to `strlcat'
i40e_ethdev.o: In function `i40e_update_customized_info':
(.text+0x15e6e): undefined reference to `strlcat'
collect2: error: ld returned 1 exit status
/tmp/UB1604_K4.4.0_GCC5.4.0/x86_64-native-linuxapp-gcc-shared/e8fb31f936de422a8e327cc29084ed20/dpdk/mk/rte.lib.mk:98: recipe for target 'librte_pmd_i40e.so.2.1' failed
make[6]: *** [librte_pmd_i40e.so.2.1] Error 1
/tmp/UB1604_K4.4.0_GCC5.4.0/x86_64-native-linuxapp-gcc-shared/e8fb31f936de422a8e327cc29084ed20/dpdk/mk/rte.subdir.mk:35: recipe for target 'i40e' failed
make[5]: *** [i40e] Error 2
make[5]: *** Waiting for unfinished jobs....
  CC hn_nvs.o
  CC hn_vf.o
  CC ixgbe_ipsec.o
--
  INSTALL-LIB librte_pmd_netvsc.so.1.1
  CC ixgbe_tm.o
  CC ixgbe_vf_representor.o
  LD librte_pmd_ixgbe.so.2.1
  INSTALL-LIB librte_pmd_ixgbe.so.2.1
/tmp/UB1604_K4.4.0_GCC5.4.0/x86_64-native-linuxapp-gcc-shared/e8fb31f936de422a8e327cc29084ed20/dpdk/mk/rte.subdir.mk:35: recipe for target 'net' failed
make[4]: *** [net] Error 2
/tmp/UB1604_K4.4.0_GCC5.4.0/x86_64-native-linuxapp-gcc-shared/e8fb31f936de422a8e327cc29084ed20/dpdk/mk/rte.sdkbuild.mk:49: recipe for target 'drivers' failed
make[3]: *** [drivers] Error 2
/tmp/UB1604_K4.4.0_GCC5.4.0/x86_64-native-linuxapp-gcc-shared/e8fb31f936de422a8e327cc29084ed20/dpdk/mk/rte.sdkroot.mk:100: recipe for target 'all' failed
make[2]: *** [all] Error 2
/tmp/UB1604_K4.4.0_GCC5.4.0/x86_64-native-linuxapp-gcc-shared/e8fb31f936de422a8e327cc29084ed20/dpdk/mk/rte.sdkinstall.mk:57: recipe for target 'pre_install' failed
make[1]: *** [pre_install] Error 2
/tmp/UB1604_K4.4.0_GCC5.4.0/x86_64-native-linuxapp-gcc-shared/e8fb31f936de422a8e327cc29084ed20/dpdk/mk/rte.sdkroot.mk:79: recipe for target 'install' failed
make: *** [install] Error 2

*Failed Build #8:
OS: CENTOS
Target: i686-native-linuxapp-gcc
  LD em_ethdev.o
  CC em_rxtx.o
  CC fm10k_rxtx_vec.o
  CC i40e_ethdev.o
/tmp/CENTOS_K3.10.0_GCC4.8.5/i686-native-linuxapp-gcc/e8fb31f936de422a8e327cc29084ed20/dpdk/drivers/net/i40e/i40e_ethdev.c: In function ‘i40e_update_customized_pctype’:
/tmp/CENTOS_K3.10.0_GCC4.8.5/i686-native-linuxapp-gcc/e8fb31f936de422a8e327cc29084ed20/dpdk/drivers/net/i40e/i40e_ethdev.c:12163:5: warning: implicit declaration of function ‘strlcat’ [-Wimplicit-function-declaration]
     strlcat(name, proto[n].name,
     ^
/tmp/CENTOS_K3.10.0_GCC4.8.5/i686-native-linuxapp-gcc/e8fb31f936de422a8e327cc29084ed20/dpdk/drivers/net/i40e/i40e_ethdev.c:12163:5: warning: nested extern declaration of ‘strlcat’ [-Wnested-externs]
  AR librte_pmd_fm10k.a
  INSTALL-LIB librte_pmd_fm10k.a
== Build drivers/net/ixgbe
  AR librte_pmd_e1000.a
  INSTALL-LIB librte_pmd_e1000.a
--
  CC ifpga_enumerate.o
  CC ifpga_feature_dev.o
  CC ifpga_fme.o
  CC ifpga_fme_iperf.o
  CC ifpga_fme_dperf.o
  CC ifpga_fme_error.o
  CC ifpga_port.o
  AR librte_pmd_dpaa2_qdma.a
  INSTALL-LIB librte_pmd_dpaa2_qdma.a
  CC ifpga_port_error.o
  CC opae_hw_api.o
  CC opae_ifpga_hw_api.o
  CC opae_debug.o
  CC ifpga_fme_pr.o
  CC ifpga_rawdev.o
--
  LD dpdk-pdump
/tmp/CENTOS_K3.10.0_GCC4.8.5/i686-native-linuxapp-gcc/e8fb31f936de422a8e327cc29084ed20/dpdk/i686-native-linuxapp-gcc/lib/librte_pmd_i40e.a(i40e_ethdev.o): In function `i40e_update_customized_info':
(.text+0x1b936): undefined reference to `strlcat'
/tmp/CENTOS_K3.10.0_GCC4.8.5/i686-native-linuxapp-gcc/e8fb31f936de422a8e327cc29084ed20/dpdk/i686-native-linuxapp-gcc/lib/librte_pmd_i40e.a(i40e_ethdev.o): In function `i40e_update_customized_info':
(.text+0x1b997): undefined reference to `strlcat'
collect2: error: ld returned 1 exit status
make[5]: *** [dpdk-procinfo] Error 1
make[4]: *** [proc-info] Error 2
make[4]: *** Waiting for unfinished jobs....
  CC parameters.o
/tmp/CENTOS_K3.10.0_GCC4.8.5/i686-native-linuxapp-gcc/e8fb31f936de422a8e327cc29084ed20/dpdk/i686-native-linuxapp-gcc/lib/librte_pmd_i40e.a(i40e_ethdev.o): In function `i40e_update_customized_info':
(.text+0x1b936): undefined reference to `strlcat'
/tmp/CENTOS_K3.10.0_GCC4.8.5/i686-native-linuxapp-gcc/e8fb31f936de422a8e327cc29084ed20/dpdk/i686-native-linuxapp-gcc/lib/librte_pmd_i40e.a(i40e_ethdev.o): In function `i40e_update_customized_info':
(.text+0x1b997): undefined reference to `strlcat'
collect2: error: ld returned 1 exit status
make[5]: *** [dpdk-pdump] Error 1
make[4]: *** [pdump] Error 2
  CC cmdline.o
  CC cmdline_flow.o
  CC cmdline_mtr.o
--
  LD testpmd
/tmp/CENTOS_K3.10.0_GCC4.8.5/i686-native-linuxapp-gcc/e8fb31f936de422a8e327cc29084ed20/dpdk/i686-native-linuxapp-gcc/lib/librte_pmd_i40e.a(i40e_ethdev.o): In function `i40e_update_customized_info':
(.text+0x1b936): undefined reference to `strlcat'
/tmp/CENTOS_K3.10.0_GCC4.8.5/i686-native-linuxapp-gcc/e8fb31f936de422a8e327cc29084ed20/dpdk/i686-native-linuxapp-gcc/lib/librte_pmd_i40e.a(i40e_ethdev.o): In function `i40e_update_customized_info':
(.text+0x1b997): undefined reference to `strlcat'
collect2: error: ld returned 1 exit status
make[5]: *** [testpmd] Error 1
make[4]: *** [test-pmd] Error 2
make[3]: *** [app] Error 2
make[2]: *** [all] Error 2
make[1]: *** [pre_install] Error 2

*Failed Build #9:
OS: UB1604
Target: i686-native-linuxapp-gcc
  CC fm10k_api.o
  CC fm10k_rxtx_vec.o
  CC i40e_ethdev.o
  CC ixgbe_phy.o
/tmp/UB1604_K4.4.0_GCC5.4.0/i686-native-linuxapp-gcc/e8fb31f936de422a8e327cc29084ed20/dpdk/drivers/net/i40e/i40e_ethdev.c: In function ‘i40e_update_customized_pctype’:
/tmp/UB1604_K4.4.0_GCC5.4.0/i686-native-linuxapp-gcc/e8fb31f936de422a8e327cc29084ed20/dpdk/drivers/net/i40e/i40e_ethdev.c:12163:5: warning: implicit declaration of function ‘strlcat’ [-Wimplicit-function-declaration]
     strlcat(name, proto[n].name,
     ^
/tmp/UB1604_K4.4.0_GCC5.4.0/i686-native-linuxapp-gcc/e8fb31f936de422a8e327cc29084ed20/dpdk/drivers/net/i40e/i40e_ethdev.c:12163:5: warning: nested extern declaration of ‘strlcat’ [-Wnested-externs]
  AR librte_pmd_fm10k.a
  INSTALL-LIB librte_pmd_fm10k.a
  CC ixgbe_api.o
== Build drivers/net/liquidio
  CC lio_ethdev.o
--
  INSTALL-LIB librte_pmd_dpaa2_qdma.a
  CC ifpga_feature_dev.o
  CC ifpga_fme.o
  CC ifpga_fme_iperf.o
  CC ifpga_fme_dperf.o
  CC ifpga_fme_error.o
  CC ifpga_port.o
  CC ifpga_port_error.o
  CC opae_hw_api.o
  CC opae_ifpga_hw_api.o
  CC opae_debug.o
  CC ifpga_fme_pr.o
  CC ifpga_rawdev.o
--
  LD dpdk-pdump
/tmp/UB1604_K4.4.0_GCC5.4.0/i686-native-linuxapp-gcc/e8fb31f936de422a8e327cc29084ed20/dpdk/i686-native-linuxapp-gcc/lib/librte_pmd_i40e.a(i40e_ethdev.o): In function `i40e_update_customized_info':
(.text+0x18019): undefined reference to `strlcat'
/tmp/UB1604_K4.4.0_GCC5.4.0/i686-native-linuxapp-gcc/e8fb31f936de422a8e327cc29084ed20/dpdk/i686-native-linuxapp-gcc/lib/librte_pmd_i40e.a(i40e_ethdev.o): In function `i40e_update_customized_info':
(.text+0x1806b): undefined reference to `strlcat'
collect2: error: ld returned 1 exit status
/tmp/UB1604_K4.4.0_GCC5.4.0/i686-native-linuxapp-gcc/e8fb31f936de422a8e327cc29084ed20/dpdk/mk/rte.app.mk:394: recipe for target 'dpdk-procinfo' failed
make[5]: *** [dpdk-procinfo] Error 1
/tmp/UB1604_K4.4.0_GCC5.4.0/i686-native-linuxapp-gcc/e8fb31f936de422a8e327cc29084ed20/dpdk/mk/rte.subdir.mk:35: recipe for target 'proc-info' failed
make[4]: *** [proc-info] Error 2
make[4]: *** Waiting for unfinished jobs....
  CC parameters.o
/tmp/UB1604_K4.4.0_GCC5.4.0/i686-native-linuxapp-gcc/e8fb31f936de422a8e327cc29084ed20/dpdk/i686-native-linuxapp-gcc/lib/librte_pmd_i40e.a(i40e_ethdev.o): In function `i40e_update_customized_info':
(.text+0x18019): undefined reference to `strlcat'
/tmp/UB1604_K4.4.0_GCC5.4.0/i686-native-linuxapp-gcc/e8fb31f936de422a8e327cc29084ed20/dpdk/i686-native-linuxapp-gcc/lib/librte_pmd_i40e.a(i40e_ethdev.o): In function `i40e_update_customized_info':
(.text+0x1806b): undefined reference to `strlcat'
collect2: error: ld returned 1 exit status
/tmp/UB1604_K4.4.0_GCC5.4.0/i686-native-linuxapp-gcc/e8fb31f936de422a8e327cc29084ed20/dpdk/mk/rte.app.mk:394: recipe for target 'dpdk-pdump' failed
make[5]: *** [dpdk-pdump] Error 1
/tmp/UB1604_K4.4.0_GCC5.4.0/i686-native-linuxapp-gcc/e8fb31f936de422a8e327cc29084ed20/dpdk/mk/rte.subdir.mk:35: recipe for target 'pdump' failed
make[4]: *** [pdump] Error 2
  CC cmdline.o
  CC cmdline_flow.o
  CC cmdline_mtr.o
  CC cmdline_tm.o
--
  LD testpmd
/tmp/UB1604_K4.4.0_GCC5.4.0/i686-native-linuxapp-gcc/e8fb31f936de422a8e327cc29084ed20/dpdk/i686-native-linuxapp-gcc/lib/librte_pmd_i40e.a(i40e_ethdev.o): In function `i40e_update_customized_info':
(.text+0x18019): undefined reference to `strlcat'
/tmp/UB1604_K4.4.0_GCC5.4.0/i686-native-linuxapp-gcc/e8fb31f936de422a8e327cc29084ed20/dpdk/i686-native-linuxapp-gcc/lib/librte_pmd_i40e.a(i40e_ethdev.o): In function `i40e_update_customized_info':
(.text+0x1806b): undefined reference to `strlcat'
collect2: error: ld returned 1 exit status
/tmp/UB1604_K4.4.0_GCC5.4.0/i686-native-linuxapp-gcc/e8fb31f936de422a8e327cc29084ed20/dpdk/mk/rte.app.mk:394: recipe for target 'testpmd' failed
make[5]: *** [testpmd] Error 1
/tmp/UB1604_K4.4.0_GCC5.4.0/i686-native-linuxapp-gcc/e8fb31f936de422a8e327cc29084ed20/dpdk/mk/rte.subdir.mk:35: recipe for target 'test-pmd' failed
make[4]: *** [test-pmd] Error 2
/tmp/UB1604_K4.4.0_GCC5.4.0/i686-native-linuxapp-gcc/e8fb31f936de422a8e327cc29084ed20/dpdk/mk/rte.sdkbuild.mk:49: recipe for target 'app' failed
make[3]: *** [app] Error 2
/tmp/UB1604_K4.4.0_GCC5.4.0/i686-native-linuxapp-gcc/e8fb31f936de422a8e327cc29084ed20/dpdk/mk/rte.sdkroot.mk:100: recipe for target 'all' failed
make[2]: *** [all] Error 2
/tmp/UB1604_K4.4.0_GCC5.4.0/i686-native-linuxapp-gcc/e8fb31f936de422a8e327cc29084ed20/dpdk/mk/rte.sdkinstall.mk:57: recipe for target 'pre_install' failed
make[1]: *** [pre_install] Error 2
/tmp/UB1604_K4.4.0_GCC5.4.0/i686-native-linuxapp-gcc/e8fb31f936de422a8e327cc29084ed20/dpdk/mk/rte.sdkroot.mk:79: recipe for target 'install' failed
make: *** [install] Error 2

*Failed Build #10:
OS: CENTOS
Target: x86_64-native-linuxapp-gcc
== Build drivers/net/liquidio
  CC i40e_dcb.o
  CC lio_ethdev.o
  CC i40e_ethdev.o
/tmp/CENTOS_K3.10.0_GCC4.8.5/x86_64-native-linuxapp-gcc/e8fb31f936de422a8e327cc29084ed20/dpdk/drivers/net/i40e/i40e_ethdev.c: In function ‘i40e_update_customized_pctype’:
/tmp/CENTOS_K3.10.0_GCC4.8.5/x86_64-native-linuxapp-gcc/e8fb31f936de422a8e327cc29084ed20/dpdk/drivers/net/i40e/i40e_ethdev.c:12163:5: warning: implicit declaration of function ‘strlcat’ [-Wimplicit-function-declaration]
     strlcat(name, proto[n].name,
     ^
/tmp/CENTOS_K3.10.0_GCC4.8.5/x86_64-native-linuxapp-gcc/e8fb31f936de422a8e327cc29084ed20/dpdk/drivers/net/i40e/i40e_ethdev.c:12163:5: warning: nested extern declaration of ‘strlcat’ [-Wnested-externs]
  CC ixgbe_82598.o
  PMDINFO lio_ethdev.o.pmd.c
  CC lio_ethdev.o.pmd.o
  LD lio_ethdev.o
  CC lio_rxtx.o
--
  INSTALL-LIB librte_pmd_dpaa2_qdma.a
  CC ifpga_feature_dev.o
  CC ifpga_fme.o
  CC ifpga_fme_iperf.o
  CC ifpga_fme_dperf.o
  CC ifpga_fme_error.o
  CC ifpga_port.o
  CC ifpga_port_error.o
  CC opae_hw_api.o
  CC opae_ifpga_hw_api.o
  CC opae_debug.o
  CC ifpga_fme_pr.o
  CC ifpga_rawdev.o
--
  LD dpdk-pdump
/tmp/CENTOS_K3.10.0_GCC4.8.5/x86_64-native-linuxapp-gcc/e8fb31f936de422a8e327cc29084ed20/dpdk/x86_64-native-linuxapp-gcc/lib/librte_pmd_i40e.a(i40e_ethdev.o): In function `i40e_update_customized_info':
(.text+0x18d03): undefined reference to `strlcat'
/tmp/CENTOS_K3.10.0_GCC4.8.5/x86_64-native-linuxapp-gcc/e8fb31f936de422a8e327cc29084ed20/dpdk/x86_64-native-linuxapp-gcc/lib/librte_pmd_i40e.a(i40e_ethdev.o): In function `i40e_update_customized_info':
(.text+0x18d56): undefined reference to `strlcat'
collect2: error: ld returned 1 exit status
make[5]: *** [dpdk-procinfo] Error 1
make[4]: *** [proc-info] Error 2
make[4]: *** Waiting for unfinished jobs....
  CC parameters.o
/tmp/CENTOS_K3.10.0_GCC4.8.5/x86_64-native-linuxapp-gcc/e8fb31f936de422a8e327cc29084ed20/dpdk/x86_64-native-linuxapp-gcc/lib/librte_pmd_i40e.a(i40e_ethdev.o): In function `i40e_update_customized_info':
(.text+0x18d03): undefined reference to `strlcat'
/tmp/CENTOS_K3.10.0_GCC4.8.5/x86_64-native-linuxapp-gcc/e8fb31f936de422a8e327cc29084ed20/dpdk/x86_64-native-linuxapp-gcc/lib/librte_pmd_i40e.a(i40e_ethdev.o): In function `i40e_update_customized_info':
(.text+0x18d56): undefined reference to `strlcat'
collect2: error: ld returned 1 exit status
make[5]: *** [dpdk-pdump] Error 1
make[4]: *** [pdump] Error 2
  CC cmdline.o
  CC cmdline_flow.o
  CC cmdline_mtr.o
--
  LD testpmd
/tmp/CENTOS_K3.10.0_GCC4.8.5/x86_64-native-linuxapp-gcc/e8fb31f936de422a8e327cc29084ed20/dpdk/x86_64-native-linuxapp-gcc/lib/librte_pmd_i40e.a(i40e_ethdev.o): In function `i40e_update_customized_info':
(.text+0x18d03): undefined reference to `strlcat'
/tmp/CENTOS_K3.10.0_GCC4.8.5/x86_64-native-linuxapp-gcc/e8fb31f936de422a8e327cc29084ed20/dpdk/x86_64-native-linuxapp-gcc/lib/librte_pmd_i40e.a(i40e_ethdev.o): In function `i40e_update_customized_info':
(.text+0x18d56): undefined reference to `strlcat'
collect2: error: ld returned 1 exit status
make[5]: *** [testpmd] Error 1
make[4]: *** [test-pmd] Error 2
make[3]: *** [app] Error 2
make[2]: *** [all] Error 2
make[1]: *** [pre_install] Error 2

*Failed Build #11:
OS: FC24
Target: x86_64-native-linuxapp-gcc-shared
  CC lio_ethdev.o.pmd.o
  CC ixgbe_phy.o
  LD lio_ethdev.o
  CC lio_rxtx.o
/tmp/FC24_K4.9.13_GCC6.2.1/x86_64-native-linuxapp-gcc-shared/e8fb31f936de422a8e327cc29084ed20/dpdk/drivers/net/i40e/i40e_ethdev.c: In function ‘i40e_update_customized_pctype’:
/tmp/FC24_K4.9.13_GCC6.2.1/x86_64-native-linuxapp-gcc-shared/e8fb31f936de422a8e327cc29084ed20/dpdk/drivers/net/i40e/i40e_ethdev.c:12163:5: warning: implicit declaration of function ‘strlcat’ [-Wimplicit-function-declaration]
     strlcat(name, proto[n].name,
     ^~~~~~~
/tmp/FC24_K4.9.13_GCC6.2.1/x86_64-native-linuxapp-gcc-shared/e8fb31f936de422a8e327cc29084ed20/dpdk/drivers/net/i40e/i40e_ethdev.c:12163:5: warning: nested extern declaration of ‘strlcat’ [-Wnested-externs]
  CC ixgbe_api.o
  CC ixgbe_vf.o
  CC lio_23xx_vf.o
  CC ixgbe_hv_vf.o
  CC ixgbe_dcb.o
--
== Build drivers/net/bnxt
i40e_ethdev.o: In function `i40e_update_customized_info':
(.text+0x15b42): undefined reference to `strlcat'
i40e_ethdev.o: In function `i40e_update_customized_info':
(.text+0x15b96): undefined reference to `strlcat'
collect2: error: ld returned 1 exit status
/tmp/FC24_K4.9.13_GCC6.2.1/x86_64-native-linuxapp-gcc-shared/e8fb31f936de422a8e327cc29084ed20/dpdk/mk/rte.lib.mk:98: recipe for target 'librte_pmd_i40e.so.2.1' failed
make[6]: *** [librte_pmd_i40e.so.2.1] Error 1
/tmp/FC24_K4.9.13_GCC6.2.1/x86_64-native-linuxapp-gcc-shared/e8fb31f936de422a8e327cc29084ed20/dpdk/mk/rte.subdir.mk:35: recipe for target 'i40e' failed
make[5]: *** [i40e] Error 2
make[5]: *** Waiting for unfinished jobs....
  CC nfp_resource.o
  CC nfp_crc.o
  CC nfp_mip.o
--
  CC bnxt_irq.o
  CC bnxt_util.o
  CC rte_pmd_bnxt.o
  LD librte_pmd_bnxt.so.2.1
  INSTALL-LIB librte_pmd_bnxt.so.2.1
/tmp/FC24_K4.9.13_GCC6.2.1/x86_64-native-linuxapp-gcc-shared/e8fb31f936de422a8e327cc29084ed20/dpdk/mk/rte.subdir.mk:35: recipe for target 'net' failed
make[4]: *** [net] Error 2
/tmp/FC24_K4.9.13_GCC6.2.1/x86_64-native-linuxapp-gcc-shared/e8fb31f936de422a8e327cc29084ed20/dpdk/mk/rte.sdkbuild.mk:49: recipe for target 'drivers' failed
make[3]: *** [drivers] Error 2
/tmp/FC24_K4.9.13_GCC6.2.1/x86_64-native-linuxapp-gcc-shared/e8fb31f936de422a8e327cc29084ed20/dpdk/mk/rte.sdkroot.mk:100: recipe for target 'all' failed
make[2]: *** [all] Error 2
/tmp/FC24_K4.9.13_GCC6.2.1/x86_64-native-linuxapp-gcc-shared/e8fb31f936de422a8e327cc29084ed20/dpdk/mk/rte.sdkinstall.mk:57: recipe for target 'pre_install' failed
make[1]: *** [pre_install] Error 2
/tmp/FC24_K4.9.13_GCC6.2.1/x86_64-native-linuxapp-gcc-shared/e8fb31f936de422a8e327cc29084ed20/dpdk/mk/rte.sdkroot.mk:79: recipe for target 'install' failed
make: *** [install] Error 2

*Failed Build #12:
OS: FC24
Target: i686-native-linuxapp-gcc
  CC ixgbe_x540.o
  CC i40e_ethdev.o
  CC i40e_rxtx.o
  CC ixgbe_x550.o
/tmp/FC24_K4.5.5_GCC6.1.1/i686-native-linuxapp-gcc/e8fb31f936de422a8e327cc29084ed20/dpdk/drivers/net/i40e/i40e_ethdev.c: In function ‘i40e_update_customized_pctype’:
/tmp/FC24_K4.5.5_GCC6.1.1/i686-native-linuxapp-gcc/e8fb31f936de422a8e327cc29084ed20/dpdk/drivers/net/i40e/i40e_ethdev.c:12163:5: warning: implicit declaration of function ‘strlcat’ [-Wimplicit-function-declaration]
     strlcat(name, proto[n].name,
     ^~~~~~~
/tmp/FC24_K4.5.5_GCC6.1.1/i686-native-linuxapp-gcc/e8fb31f936de422a8e327cc29084ed20/dpdk/drivers/net/i40e/i40e_ethdev.c:12163:5: warning: nested extern declaration of ‘strlcat’ [-Wnested-externs]
  CC ixgbe_phy.o
  CC ixgbe_api.o
== Build drivers/net/liquidio
  CC ixgbe_vf.o
  CC lio_ethdev.o
--
  AR librte_pmd_skeleton_rawdev.a
  INSTALL-LIB librte_pmd_skeleton_rawdev.a
  CC ifpga_fme.o
  CC ifpga_fme_iperf.o
  CC ifpga_fme_dperf.o
  CC ifpga_fme_error.o
  CC ifpga_port.o
  CC ifpga_port_error.o
  CC opae_hw_api.o
  CC opae_ifpga_hw_api.o
  CC opae_debug.o
  CC ifpga_fme_pr.o
  CC ifpga_rawdev.o
--
  LD dpdk-pdump
/tmp/FC24_K4.5.5_GCC6.1.1/i686-native-linuxapp-gcc/e8fb31f936de422a8e327cc29084ed20/dpdk/i686-native-linuxapp-gcc/lib/librte_pmd_i40e.a(i40e_ethdev.o): In function `i40e_update_customized_info':
(.text+0x17d19): undefined reference to `strlcat'
/tmp/FC24_K4.5.5_GCC6.1.1/i686-native-linuxapp-gcc/e8fb31f936de422a8e327cc29084ed20/dpdk/i686-native-linuxapp-gcc/lib/librte_pmd_i40e.a(i40e_ethdev.o): In function `i40e_update_customized_info':
(.text+0x17d6b): undefined reference to `strlcat'
collect2: error: ld returned 1 exit status
/tmp/FC24_K4.5.5_GCC6.1.1/i686-native-linuxapp-gcc/e8fb31f936de422a8e327cc29084ed20/dpdk/mk/rte.app.mk:394: recipe for target 'dpdk-procinfo' failed
make[5]: *** [dpdk-procinfo] Error 1
/tmp/FC24_K4.5.5_GCC6.1.1/i686-native-linuxapp-gcc/e8fb31f936de422a8e327cc29084ed20/dpdk/mk/rte.subdir.mk:35: recipe for target 'proc-info' failed
make[4]: *** [proc-info] Error 2
make[4]: *** Waiting for unfinished jobs....
  CC parameters.o
/tmp/FC24_K4.5.5_GCC6.1.1/i686-native-linuxapp-gcc/e8fb31f936de422a8e327cc29084ed20/dpdk/i686-native-linuxapp-gcc/lib/librte_pmd_i40e.a(i40e_ethdev.o): In function `i40e_update_customized_info':
(.text+0x17d19): undefined reference to `strlcat'
/tmp/FC24_K4.5.5_GCC6.1.1/i686-native-linuxapp-gcc/e8fb31f936de422a8e327cc29084ed20/dpdk/i686-native-linuxapp-gcc/lib/librte_pmd_i40e.a(i40e_ethdev.o): In function `i40e_update_customized_info':
(.text+0x17d6b): undefined reference to `strlcat'
collect2: error: ld returned 1 exit status
/tmp/FC24_K4.5.5_GCC6.1.1/i686-native-linuxapp-gcc/e8fb31f936de422a8e327cc29084ed20/dpdk/mk/rte.app.mk:394: recipe for target 'dpdk-pdump' failed
make[5]: *** [dpdk-pdump] Error 1
/tmp/FC24_K4.5.5_GCC6.1.1/i686-native-linuxapp-gcc/e8fb31f936de422a8e327cc29084ed20/dpdk/mk/rte.subdir.mk:35: recipe for target 'pdump' failed
make[4]: *** [pdump] Error 2
  CC cmdline.o
  CC cmdline_flow.o
  CC cmdline_mtr.o
  CC cmdline_tm.o
--
  LD testpmd
/tmp/FC24_K4.5.5_GCC6.1.1/i686-native-linuxapp-gcc/e8fb31f936de422a8e327cc29084ed20/dpdk/i686-native-linuxapp-gcc/lib/librte_pmd_i40e.a(i40e_ethdev.o): In function `i40e_update_customized_info':
(.text+0x17d19): undefined reference to `strlcat'
/tmp/FC24_K4.5.5_GCC6.1.1/i686-native-linuxapp-gcc/e8fb31f936de422a8e327cc29084ed20/dpdk/i686-native-linuxapp-gcc/lib/librte_pmd_i40e.a(i40e_ethdev.o): In function `i40e_update_customized_info':
(.text+0x17d6b): undefined reference to `strlcat'
collect2: error: ld returned 1 exit status
/tmp/FC24_K4.5.5_GCC6.1.1/i686-native-linuxapp-gcc/e8fb31f936de422a8e327cc29084ed20/dpdk/mk/rte.app.mk:394: recipe for target 'testpmd' failed
make[5]: *** [testpmd] Error 1
/tmp/FC24_K4.5.5_GCC6.1.1/i686-native-linuxapp-gcc/e8fb31f936de422a8e327cc29084ed20/dpdk/mk/rte.subdir.mk:35: recipe for target 'test-pmd' failed
make[4]: *** [test-pmd] Error 2
/tmp/FC24_K4.5.5_GCC6.1.1/i686-native-linuxapp-gcc/e8fb31f936de422a8e327cc29084ed20/dpdk/mk/rte.sdkbuild.mk:49: recipe for target 'app' failed
make[3]: *** [app] Error 2
/tmp/FC24_K4.5.5_GCC6.1.1/i686-native-linuxapp-gcc/e8fb31f936de422a8e327cc29084ed20/dpdk/mk/rte.sdkroot.mk:100: recipe for target 'all' failed
make[2]: *** [all] Error 2
/tmp/FC24_K4.5.5_GCC6.1.1/i686-native-linuxapp-gcc/e8fb31f936de422a8e327cc29084ed20/dpdk/mk/rte.sdkinstall.mk:57: recipe for target 'pre_install' failed
make[1]: *** [pre_install] Error 2
/tmp/FC24_K4.5.5_GCC6.1.1/i686-native-linuxapp-gcc/e8fb31f936de422a8e327cc29084ed20/dpdk/mk/rte.sdkroot.mk:79: recipe for target 'install' failed
make: *** [install] Error 2

*Failed Build #13:
OS: FC25
Target: x86_64-native-linuxapp-gcc-debug
  CC lio_23xx_vf.o
  CC ixgbe_x540.o
  CC lio_mbox.o
  CC ixgbe_x550.o
/tmp/FC25_K4.8.6_GCC6.3.1/x86_64-native-linuxapp-gcc-debug/e8fb31f936de422a8e327cc29084ed20/dpdk/drivers/net/i40e/i40e_ethdev.c: In function ‘i40e_update_customized_pctype’:
/tmp/FC25_K4.8.6_GCC6.3.1/x86_64-native-linuxapp-gcc-debug/e8fb31f936de422a8e327cc29084ed20/dpdk/drivers/net/i40e/i40e_ethdev.c:12163:5: warning: implicit declaration of function ‘strlcat’ [-Wimplicit-function-declaration]
     strlcat(name, proto[n].name,
     ^~~~~~~
/tmp/FC25_K4.8.6_GCC6.3.1/x86_64-native-linuxapp-gcc-debug/e8fb31f936de422a8e327cc29084ed20/dpdk/drivers/net/i40e/i40e_ethdev.c:12163:5: warning: nested extern declaration of ‘strlcat’ [-Wnested-externs]
  AR librte_pmd_lio.a
  INSTALL-LIB librte_pmd_lio.a
  CC ixgbe_phy.o
== Build drivers/net/netvsc
  CC ixgbe_api.o
--
  AR librte_pmd_dpaa2_qdma.a
  INSTALL-LIB librte_pmd_dpaa2_qdma.a
  CC ifpga_fme.o
  CC ifpga_fme_dperf.o
  CC ifpga_fme_iperf.o
  CC ifpga_fme_error.o
  CC ifpga_port.o
  CC ifpga_port_error.o
  CC opae_hw_api.o
  CC opae_ifpga_hw_api.o
  CC opae_debug.o
  CC ifpga_fme_pr.o
  CC ifpga_rawdev.o
--
/tmp/FC25_K4.8.6_GCC6.3.1/x86_64-native-linuxapp-gcc-debug/e8fb31f936de422a8e327cc29084ed20/dpdk/x86_64-native-linuxapp-gcc/lib/librte_pmd_i40e.a(i40e_ethdev.o): In function `i40e_update_customized_info':
(.text+0x1710c): undefined reference to `strlcat'
.text+0x170b6): undefined reference to `strlcat'
/tmp/FC25_K4.8.6_GCC6.3.1/x86_64-native-linuxapp-gcc-debug/e8fb31f936de422a8e327cc29084ed20/dpdk/x86_64-native-linuxapp-gcc/lib/librte_pmd_i40e.a(i40e_ethdev.o): In function `i40e_update_customized_info':
(.text+0x1710c): undefined reference to `strlcat'
collect2: error: ld returned 1 exit status
collect2: error: ld returned 1 exit status
/tmp/FC25_K4.8.6_GCC6.3.1/x86_64-native-linuxapp-gcc-debug/e8fb31f936de422a8e327cc29084ed20/dpdk/mk/rte.app.mk:394: recipe for target 'dpdk-procinfo' failed
make[5]: *** [dpdk-procinfo] Error 1
/tmp/FC25_K4.8.6_GCC6.3.1/x86_64-native-linuxapp-gcc-debug/e8fb31f936de422a8e327cc29084ed20/dpdk/mk/rte.app.mk:394: recipe for target 'dpdk-pdump' failed
make[5]: *** [dpdk-pdump] Error 1
/tmp/FC25_K4.8.6_GCC6.3.1/x86_64-native-linuxapp-gcc-debug/e8fb31f936de422a8e327cc29084ed20/dpdk/mk/rte.subdir.mk:35: recipe for target 'proc-info' failed
make[4]: *** [proc-info] Error 2
make[4]: *** Waiting for unfinished jobs....
/tmp/FC25_K4.8.6_GCC6.3.1/x86_64-native-linuxapp-gcc-debug/e8fb31f936de422a8e327cc29084ed20/dpdk/mk/rte.subdir.mk:35: recipe for target 'pdump' failed
make[4]: *** [pdump] Error 2
  CC parameters.o
  CC cmdline.o
  CC cmdline_flow.o
  CC cmdline_mtr.o
--
  LD testpmd
/tmp/FC25_K4.8.6_GCC6.3.1/x86_64-native-linuxapp-gcc-debug/e8fb31f936de422a8e327cc29084ed20/dpdk/x86_64-native-linuxapp-gcc/lib/librte_pmd_i40e.a(i40e_ethdev.o): In function `i40e_update_customized_info':
(.text+0x170b6): undefined reference to `strlcat'
/tmp/FC25_K4.8.6_GCC6.3.1/x86_64-native-linuxapp-gcc-debug/e8fb31f936de422a8e327cc29084ed20/dpdk/x86_64-native-linuxapp-gcc/lib/librte_pmd_i40e.a(i40e_ethdev.o): In function `i40e_update_customized_info':
(.text+0x1710c): undefined reference to `strlcat'
collect2: error: ld returned 1 exit status
/tmp/FC25_K4.8.6_GCC6.3.1/x86_64-native-linuxapp-gcc-debug/e8fb31f936de422a8e327cc29084ed20/dpdk/mk/rte.app.mk:394: recipe for target 'testpmd' failed
make[5]: *** [testpmd] Error 1
/tmp/FC25_K4.8.6_GCC6.3.1/x86_64-native-linuxapp-gcc-debug/e8fb31f936de422a8e327cc29084ed20/dpdk/mk/rte.subdir.mk:35: recipe for target 'test-pmd' failed
make[4]: *** [test-pmd] Error 2
/tmp/FC25_K4.8.6_GCC6.3.1/x86_64-native-linuxapp-gcc-debug/e8fb31f936de422a8e327cc29084ed20/dpdk/mk/rte.sdkbuild.mk:49: recipe for target 'app' failed
make[3]: *** [app] Error 2
/tmp/FC25_K4.8.6_GCC6.3.1/x86_64-native-linuxapp-gcc-debug/e8fb31f936de422a8e327cc29084ed20/dpdk/mk/rte.sdkroot.mk:100: recipe for target 'all' failed
make[2]: *** [all] Error 2
/tmp/FC25_K4.8.6_GCC6.3.1/x86_64-native-linuxapp-gcc-debug/e8fb31f936de422a8e327cc29084ed20/dpdk/mk/rte.sdkinstall.mk:57: recipe for target 'pre_install' failed
make[1]: *** [pre_install] Error 2
/tmp/FC25_K4.8.6_GCC6.3.1/x86_64-native-linuxapp-gcc-debug/e8fb31f936de422a8e327cc29084ed20/dpdk/mk/rte.sdkroot.mk:79: recipe for target 'install' failed
make: *** [install] Error 2

*Failed Build #14:
OS: FC24
Target: x86_64-native-linuxapp-clang
  CC i40e_dcb.o
  CC i40e_ethdev.o
  CC ixgbe_api.o
  CC ixgbe_vf.o
  CC ixgbe_hv_vf.o
/tmp/FC24_K4.9.13_GCC6.2.1/x86_64-native-linuxapp-clang/e8fb31f936de422a8e327cc29084ed20/dpdk/drivers/net/i40e/i40e_ethdev.c:12163:5: warning: implicitly declaring library function 'strlcat' with type 'unsigned long (char *, const char *, unsigned long)' [-Wimplicit-function-declaration]
                                strlcat(name, proto[n].name,
                                ^
  CC i40e_rxtx.o
/tmp/FC24_K4.9.13_GCC6.2.1/x86_64-native-linuxapp-clang/e8fb31f936de422a8e327cc29084ed20/dpdk/drivers/net/i40e/i40e_ethdev.c:12163:5: note: include the header <string.h> or explicitly provide a declaration for 'strlcat'
  CC ixgbe_dcb.o
--
  CC ixgbe_rxtx.o
  PMDINFO lio_ethdev.o.pmd.c
  CC lio_ethdev.o.pmd.o
  LD lio_ethdev.o
  CC lio_rxtx.o
1 warning generated.
  PMDINFO i40e_ethdev.o.pmd.c
  CC i40e_ethdev.o.pmd.o
  LD i40e_ethdev.o
  CC i40e_rxtx_vec_sse.o
  CC lio_23xx_vf.o
--
  INSTALL-LIB librte_pmd_dpaa2_qdma.a
  CC ifpga_feature_dev.o
  CC ifpga_fme.o
  CC ifpga_fme_iperf.o
  CC ifpga_fme_dperf.o
  CC ifpga_fme_error.o
  CC ifpga_port.o
  CC ifpga_port_error.o
  CC opae_hw_api.o
  CC opae_ifpga_hw_api.o
  CC opae_debug.o
  CC ifpga_fme_pr.o
  CC ifpga_rawdev.o
--
(.text+0x8292): undefined reference to `strlcat'
/tmp/FC24_K4.9.13_GCC6.2.1/x86_64-native-linuxapp-clang/e8fb31f936de422a8e327cc29084ed20/dpdk/x86_64-native-linuxapp-clang/lib/librte_pmd_i40e.a(i40e_ethdev.o): In function `i40e_update_customized_info':
(.text+0x8275): undefined reference to `strlcat'
/tmp/FC24_K4.9.13_GCC6.2.1/x86_64-native-linuxapp-clang/e8fb31f936de422a8e327cc29084ed20/dpdk/x86_64-native-linuxapp-clang/lib/librte_pmd_i40e.a(i40e_ethdev.o): In function `i40e_update_customized_info':
(.text+0x8292): undefined reference to `strlcat'
clang-3.8: error: linker command failed with exit code 1 (use -v to see invocation)
/tmp/FC24_K4.9.13_GCC6.2.1/x86_64-native-linuxapp-clang/e8fb31f936de422a8e327cc29084ed20/dpdk/mk/rte.app.mk:394: recipe for target 'dpdk-procinfo' failed
make[5]: *** [dpdk-procinfo] Error 1
/tmp/FC24_K4.9.13_GCC6.2.1/x86_64-native-linuxapp-clang/e8fb31f936de422a8e327cc29084ed20/dpdk/mk/rte.subdir.mk:35: recipe for target 'proc-info' failed
make[4]: *** [proc-info] Error 2
make[4]: *** Waiting for unfinished jobs....
  CC parameters.o
clang-3.8: error: linker command failed with exit code 1 (use -v to see invocation)
/tmp/FC24_K4.9.13_GCC6.2.1/x86_64-native-linuxapp-clang/e8fb31f936de422a8e327cc29084ed20/dpdk/mk/rte.app.mk:394: recipe for target 'dpdk-pdump' failed
make[5]: *** [dpdk-pdump] Error 1
/tmp/FC24_K4.9.13_GCC6.2.1/x86_64-native-linuxapp-clang/e8fb31f936de422a8e327cc29084ed20/dpdk/mk/rte.subdir.mk:35: recipe for target 'pdump' failed
make[4]: *** [pdump] Error 2
  CC cmdline.o
  CC cmdline_flow.o
  CC cmdline_mtr.o
  CC cmdline_tm.o
--
  LD testpmd
/tmp/FC24_K4.9.13_GCC6.2.1/x86_64-native-linuxapp-clang/e8fb31f936de422a8e327cc29084ed20/dpdk/x86_64-native-linuxapp-clang/lib/librte_pmd_i40e.a(i40e_ethdev.o): In function `i40e_update_customized_info':
(.text+0x8275): undefined reference to `strlcat'
/tmp/FC24_K4.9.13_GCC6.2.1/x86_64-native-linuxapp-clang/e8fb31f936de422a8e327cc29084ed20/dpdk/x86_64-native-linuxapp-clang/lib/librte_pmd_i40e.a(i40e_ethdev.o): In function `i40e_update_customized_info':
(.text+0x8292): undefined reference to `strlcat'
clang-3.8: error: linker command failed with exit code 1 (use -v to see invocation)
/tmp/FC24_K4.9.13_GCC6.2.1/x86_64-native-linuxapp-clang/e8fb31f936de422a8e327cc29084ed20/dpdk/mk/rte.app.mk:394: recipe for target 'testpmd' failed
make[5]: *** [testpmd] Error 1
/tmp/FC24_K4.9.13_GCC6.2.1/x86_64-native-linuxapp-clang/e8fb31f936de422a8e327cc29084ed20/dpdk/mk/rte.subdir.mk:35: recipe for target 'test-pmd' failed
make[4]: *** [test-pmd] Error 2
/tmp/FC24_K4.9.13_GCC6.2.1/x86_64-native-linuxapp-clang/e8fb31f936de422a8e327cc29084ed20/dpdk/mk/rte.sdkbuild.mk:49: recipe for target 'app' failed
make[3]: *** [app] Error 2
/tmp/FC24_K4.9.13_GCC6.2.1/x86_64-native-linuxapp-clang/e8fb31f936de422a8e327cc29084ed20/dpdk/mk/rte.sdkroot.mk:100: recipe for target 'all' failed
make[2]: *** [all] Error 2
/tmp/FC24_K4.9.13_GCC6.2.1/x86_64-native-linuxapp-clang/e8fb31f936de422a8e327cc29084ed20/dpdk/mk/rte.sdkinstall.mk:57: recipe for target 'pre_install' failed
make[1]: *** [pre_install] Error 2
/tmp/FC24_K4.9.13_GCC6.2.1/x86_64-native-linuxapp-clang/e8fb31f936de422a8e327cc29084ed20/dpdk/mk/rte.sdkroot.mk:79: recipe for target 'install' failed
make: *** [install] Error 2

DPDK STV team


More information about the test-report mailing list