[dpdk-test-report] |FAILURE| pw50536vhost: prevent disabled rings to be processed with zero-copy

sys_stv at intel.com sys_stv at intel.com
Wed Feb 27 10:16:10 CET 2019


Test-Label: Intel-compilation
Test-Status: FAILURE
http://dpdk.org/patch/50536

_Compilation issues_

Submitter: Maxime Coquelin <maxime.coquelin at redhat.com>
Date: 2019-02-27 08:54:28
Reply_mail: 20190227085428.13666-1-maxime.coquelin at redhat.com
DPDK git baseline: Repo:dpdk-master, CommitID: 921c7e926fcdf127bcac16fca6ca09e76d509c97

Build Summary: 16 Builds Done, 2 Successful, 14 Failures

Test environment and configuration as below:

OS: UB1604
	Kernel Version: 4.4.0-78-generic
	CPU info: Intel(R) Xeon(R) CPU E5-2699 v3 @ 2.30GHz
	GCC Version: gcc (Ubuntu 5.4.0-6ubuntu1~16.04.10) 5.4.0 20160609
	Clang Version: 3.8.0-2ubuntu4 (tags/RELEASE_380/final)
	x86_64-native-linuxapp-gcc
	x86_64-native-linuxapp-gcc-shared
	x86_64-native-linuxapp-clang
	i686-native-linuxapp-gcc

OS: CENTOS
	Kernel Version: 3.10.0-957.1.3.el7.x86_64
	CPU info: Intel(R) Xeon(R) CPU E5-2699 v3 @ 2.30GHz
	GCC Version: gcc (GCC) 4.8.5 20150623 (Red Hat 4.8.5-36)
	Clang Version: 3.4.2 (tags/RELEASE_34/dot2-final)
	x86_64-native-linuxapp-gcc-shared
	x86_64-native-linuxapp-clang
	i686-native-linuxapp-gcc
	x86_64-native-linuxapp-gcc

OS: UBT1804
	Kernel Version: 4.15.0-29-generic
	CPU info: Intel(R) Xeon(R) Platinum 8180M CPU @ 2.50GHz
	GCC Version: gcc (Ubuntu 7.3.0-27ubuntu1~18.04) 7.3.0
	Clang Version: 6.0.0-1ubuntu2 (tags/RELEASE_600/final)
	x86_64-native-linuxapp-gcc

OS: FC25
	Kernel Version: 4.5.5-300.fc24.x86_64
	CPU info: Intel(R) Xeon(R) CPU E5-2699 v3 @ 2.30GHz
	GCC Version: gcc (GCC) 6.1.1 20160510 (Red Hat 6.1.1-2)
	Clang Version: 3.8.0 (tags/RELEASE_380/final)
	x86_64-native-linuxapp-gcc
	x86_64-native-linuxapp-gcc-debug

OS: FC24
	Kernel Version: 4.11.12-100.fc24.x86_64
	CPU info: Intel(R) Xeon(R) CPU E5-2699 v3 @ 2.30GHz
	GCC Version: gcc (GCC) 6.3.1 20161221 (Red Hat 6.3.1-1)
	Clang Version: 3.8.1 (tags/RELEASE_381/final)
	x86_64-native-linuxapp-gcc-shared
	i686-native-linuxapp-gcc
	x86_64-native-linuxapp-clang

OS: FreeBSD
	Kernel Version: 10.3-RELEASE
	CPU info: Intel(R) Xeon(R) CPU E5-2699 v3 @ 2.30GHz (2294.75-MHz K8-class CPU)
	GCC Version: gcc (FreeBSD Ports Collection) 7.3.0
	Clang Version: 3.4.1 (tags/RELEASE_34/dot1-final 208032) 20140512
	x86_64-native-bsdapp-clang
	x86_64-native-bsdapp-gcc

*Failed Build #1:
OS: FC25
Target: x86_64-native-linuxapp-gcc
  CC rte_event_eth_tx_adapter.o
  CC rte_ipv6_reassembly.o
  CC rte_ip_frag_common.o
  CC vhost_user.o
/tmp/FC25_K4.8.6_GCC6.3.1/x86_64-native-linuxapp-gcc/e9d678164d8546388948cc01ac3b8cba/dpdk/lib/librte_vhost/vhost_user.c: In function ‘vhost_user_set_vring_enable’:
/tmp/FC25_K4.8.6_GCC6.3.1/x86_64-native-linuxapp-gcc/e9d678164d8546388948cc01ac3b8cba/dpdk/lib/librte_vhost/vhost_user.c:1317:3: warning: implicit declaration of function ‘drain_zmbuf_list’ [-Wimplicit-function-declaration]
   drain_zmbuf_list(dev->virtqueue[index]);
   ^~~~~~~~~~~~~~~~
/tmp/FC25_K4.8.6_GCC6.3.1/x86_64-native-linuxapp-gcc/e9d678164d8546388948cc01ac3b8cba/dpdk/lib/librte_vhost/vhost_user.c:1317:3: warning: nested extern declaration of ‘drain_zmbuf_list’ [-Wnested-externs]
  CC ip_frag_internal.o
  AR librte_eventdev.a
  INSTALL-LIB librte_eventdev.a
  CC virtio_net.o
  AR librte_ip_frag.a
--
  INSTALL-LIB librte_pmd_dpaa2_qdma.a
  CC ifpga_feature_dev.o
  CC ifpga_fme.o
  CC ifpga_fme_iperf.o
  CC ifpga_fme_dperf.o
  CC ifpga_fme_error.o
  CC ifpga_port.o
  CC ifpga_port_error.o
  CC opae_hw_api.o
  CC opae_ifpga_hw_api.o
  CC opae_debug.o
  CC ifpga_fme_pr.o
  CC ifpga_rawdev.o
--
  CC test.o
  CC resource.o
  CC test_resource.o
/tmp/FC25_K4.8.6_GCC6.3.1/x86_64-native-linuxapp-gcc/e9d678164d8546388948cc01ac3b8cba/dpdk/x86_64-native-linuxapp-gcc/lib/librte_vhost.a(vhost_user.o): In function `vhost_user_set_vring_enable':
vhost_user.c:(.text+0x688): undefined reference to `drain_zmbuf_list'
collect2: error: ld returned 1 exit status
/tmp/FC25_K4.8.6_GCC6.3.1/x86_64-native-linuxapp-gcc/e9d678164d8546388948cc01ac3b8cba/dpdk/mk/rte.app.mk:397: recipe for target 'dpdk-procinfo' failed
make[5]: *** [dpdk-procinfo] Error 1
/tmp/FC25_K4.8.6_GCC6.3.1/x86_64-native-linuxapp-gcc/e9d678164d8546388948cc01ac3b8cba/dpdk/mk/rte.subdir.mk:35: recipe for target 'proc-info' failed
make[4]: *** [proc-info] Error 2
make[4]: *** Waiting for unfinished jobs....
  CC parameters.o
  CC test_prefetch.o
  CC test_byteorder.o
--
  CC test_table_ports.o
  CC test_table_combined.o
  LD testpmd
/tmp/FC25_K4.8.6_GCC6.3.1/x86_64-native-linuxapp-gcc/e9d678164d8546388948cc01ac3b8cba/dpdk/x86_64-native-linuxapp-gcc/lib/librte_vhost.a(vhost_user.o): In function `vhost_user_set_vring_enable':
vhost_user.c:(.text+0x688): undefined reference to `drain_zmbuf_list'
collect2: error: ld returned 1 exit status
/tmp/FC25_K4.8.6_GCC6.3.1/x86_64-native-linuxapp-gcc/e9d678164d8546388948cc01ac3b8cba/dpdk/mk/rte.app.mk:397: recipe for target 'testpmd' failed
make[5]: *** [testpmd] Error 1
/tmp/FC25_K4.8.6_GCC6.3.1/x86_64-native-linuxapp-gcc/e9d678164d8546388948cc01ac3b8cba/dpdk/mk/rte.subdir.mk:35: recipe for target 'test-pmd' failed
make[4]: *** [test-pmd] Error 2
  CC test_table_acl.o
  CC test_flow_classify.o
  CC test_rwlock.o
  CC test_timer.o
--
  CC test_ipsec.o
  MKRES test_resource_c.res.o
  LD test
/tmp/FC25_K4.8.6_GCC6.3.1/x86_64-native-linuxapp-gcc/e9d678164d8546388948cc01ac3b8cba/dpdk/x86_64-native-linuxapp-gcc/lib/librte_vhost.a(vhost_user.o): In function `vhost_user_set_vring_enable':
vhost_user.c:(.text+0x688): undefined reference to `drain_zmbuf_list'
collect2: error: ld returned 1 exit status
/tmp/FC25_K4.8.6_GCC6.3.1/x86_64-native-linuxapp-gcc/e9d678164d8546388948cc01ac3b8cba/dpdk/mk/rte.app.mk:397: recipe for target 'test' failed
make[5]: *** [test] Error 1
/tmp/FC25_K4.8.6_GCC6.3.1/x86_64-native-linuxapp-gcc/e9d678164d8546388948cc01ac3b8cba/dpdk/mk/rte.subdir.mk:35: recipe for target 'test' failed
make[4]: *** [test] Error 2
/tmp/FC25_K4.8.6_GCC6.3.1/x86_64-native-linuxapp-gcc/e9d678164d8546388948cc01ac3b8cba/dpdk/mk/rte.sdkbuild.mk:46: recipe for target 'app' failed
make[3]: *** [app] Error 2
/tmp/FC25_K4.8.6_GCC6.3.1/x86_64-native-linuxapp-gcc/e9d678164d8546388948cc01ac3b8cba/dpdk/mk/rte.sdkroot.mk:98: recipe for target 'all' failed
make[2]: *** [all] Error 2
/tmp/FC25_K4.8.6_GCC6.3.1/x86_64-native-linuxapp-gcc/e9d678164d8546388948cc01ac3b8cba/dpdk/mk/rte.sdkinstall.mk:57: recipe for target 'pre_install' failed
make[1]: *** [pre_install] Error 2
/tmp/FC25_K4.8.6_GCC6.3.1/x86_64-native-linuxapp-gcc/e9d678164d8546388948cc01ac3b8cba/dpdk/mk/rte.sdkroot.mk:77: recipe for target 'install' failed
make: *** [install] Error 2

*Failed Build #2:
OS: UBT1804
Target: x86_64-native-linuxapp-gcc
  CC rte_ip_frag_common.o
  CC ip_frag_internal.o
  CC vhost_user.o
  CC rte_event_timer_adapter.o
/tmp/UBT1804_K4.15.0_GCC7.3.0/x86_64-native-linuxapp-gcc/e9d678164d8546388948cc01ac3b8cba/dpdk/lib/librte_vhost/vhost_user.c: In function ‘vhost_user_set_vring_enable’:
/tmp/UBT1804_K4.15.0_GCC7.3.0/x86_64-native-linuxapp-gcc/e9d678164d8546388948cc01ac3b8cba/dpdk/lib/librte_vhost/vhost_user.c:1317:3: warning: implicit declaration of function ‘drain_zmbuf_list’; did you mean ‘free_zmbufs’? [-Wimplicit-function-declaration]
   drain_zmbuf_list(dev->virtqueue[index]);
   ^~~~~~~~~~~~~~~~
   free_zmbufs
/tmp/UBT1804_K4.15.0_GCC7.3.0/x86_64-native-linuxapp-gcc/e9d678164d8546388948cc01ac3b8cba/dpdk/lib/librte_vhost/vhost_user.c:1317:3: warning: nested extern declaration of ‘drain_zmbuf_list’ [-Wnested-externs]
  AR librte_ip_frag.a
  INSTALL-LIB librte_ip_frag.a
== Build lib/librte_gro
  SYMLINK-FILE include/rte_gro.h
  CC rte_gro.o
--
  AR librte_pmd_skeleton_rawdev.a
  INSTALL-LIB librte_pmd_skeleton_rawdev.a
  CC ifpga_fme.o
  CC ifpga_fme_iperf.o
  CC ifpga_fme_dperf.o
  CC ifpga_fme_error.o
  CC ifpga_port.o
  CC ifpga_port_error.o
  CC opae_hw_api.o
  CC opae_ifpga_hw_api.o
  CC opae_debug.o
  CC ifpga_fme_pr.o
  CC ifpga_rawdev.o
--
  CC test.o
  CC resource.o
  CC test_resource.o
/tmp/UBT1804_K4.15.0_GCC7.3.0/x86_64-native-linuxapp-gcc/e9d678164d8546388948cc01ac3b8cba/dpdk/x86_64-native-linuxapp-gcc/lib/librte_vhost.a(vhost_user.o): In function `vhost_user_set_vring_enable':
vhost_user.c:(.text+0x7a8): undefined reference to `drain_zmbuf_list'
collect2: error: ld returned 1 exit status
/tmp/UBT1804_K4.15.0_GCC7.3.0/x86_64-native-linuxapp-gcc/e9d678164d8546388948cc01ac3b8cba/dpdk/mk/rte.app.mk:397: recipe for target 'dpdk-procinfo' failed
make[5]: *** [dpdk-procinfo] Error 1
/tmp/UBT1804_K4.15.0_GCC7.3.0/x86_64-native-linuxapp-gcc/e9d678164d8546388948cc01ac3b8cba/dpdk/mk/rte.subdir.mk:35: recipe for target 'proc-info' failed
make[4]: *** [proc-info] Error 2
make[4]: *** Waiting for unfinished jobs....
  CC test_prefetch.o
  CC parameters.o
  CC test_byteorder.o
--
  CC test_mbuf.o
  CC test_logs.o
  CC test_memcpy.o
/tmp/UBT1804_K4.15.0_GCC7.3.0/x86_64-native-linuxapp-gcc/e9d678164d8546388948cc01ac3b8cba/dpdk/x86_64-native-linuxapp-gcc/lib/librte_vhost.a(vhost_user.o): In function `vhost_user_set_vring_enable':
vhost_user.c:(.text+0x7a8): undefined reference to `drain_zmbuf_list'
collect2: error: ld returned 1 exit status
/tmp/UBT1804_K4.15.0_GCC7.3.0/x86_64-native-linuxapp-gcc/e9d678164d8546388948cc01ac3b8cba/dpdk/mk/rte.app.mk:397: recipe for target 'testpmd' failed
make[5]: *** [testpmd] Error 1
/tmp/UBT1804_K4.15.0_GCC7.3.0/x86_64-native-linuxapp-gcc/e9d678164d8546388948cc01ac3b8cba/dpdk/mk/rte.subdir.mk:35: recipe for target 'test-pmd' failed
make[4]: *** [test-pmd] Error 2
  CC test_memcpy_perf.o
  CC test_member.o
  CC test_member_perf.o
  CC test_efd.o
--
  CC test_ipsec.o
  MKRES test_resource_c.res.o
  LD test
/tmp/UBT1804_K4.15.0_GCC7.3.0/x86_64-native-linuxapp-gcc/e9d678164d8546388948cc01ac3b8cba/dpdk/x86_64-native-linuxapp-gcc/lib/librte_vhost.a(vhost_user.o): In function `vhost_user_set_vring_enable':
vhost_user.c:(.text+0x7a8): undefined reference to `drain_zmbuf_list'
collect2: error: ld returned 1 exit status
/tmp/UBT1804_K4.15.0_GCC7.3.0/x86_64-native-linuxapp-gcc/e9d678164d8546388948cc01ac3b8cba/dpdk/mk/rte.app.mk:397: recipe for target 'test' failed
make[5]: *** [test] Error 1
/tmp/UBT1804_K4.15.0_GCC7.3.0/x86_64-native-linuxapp-gcc/e9d678164d8546388948cc01ac3b8cba/dpdk/mk/rte.subdir.mk:35: recipe for target 'test' failed
make[4]: *** [test] Error 2
/tmp/UBT1804_K4.15.0_GCC7.3.0/x86_64-native-linuxapp-gcc/e9d678164d8546388948cc01ac3b8cba/dpdk/mk/rte.sdkbuild.mk:46: recipe for target 'app' failed
make[3]: *** [app] Error 2
/tmp/UBT1804_K4.15.0_GCC7.3.0/x86_64-native-linuxapp-gcc/e9d678164d8546388948cc01ac3b8cba/dpdk/mk/rte.sdkroot.mk:98: recipe for target 'all' failed
make[2]: *** [all] Error 2
/tmp/UBT1804_K4.15.0_GCC7.3.0/x86_64-native-linuxapp-gcc/e9d678164d8546388948cc01ac3b8cba/dpdk/mk/rte.sdkinstall.mk:57: recipe for target 'pre_install' failed
make[1]: *** [pre_install] Error 2
/tmp/UBT1804_K4.15.0_GCC7.3.0/x86_64-native-linuxapp-gcc/e9d678164d8546388948cc01ac3b8cba/dpdk/mk/rte.sdkroot.mk:77: recipe for target 'install' failed
make: *** [install] Error 2

*Failed Build #3:
OS: UB1604
Target: x86_64-native-linuxapp-gcc
  CC rte_event_timer_adapter.o
  CC rte_ipv6_reassembly.o
  CC vhost_user.o
  CC rte_ip_frag_common.o
/tmp/UB1604_K4.8.0_GCC6.2.0/x86_64-native-linuxapp-gcc/e9d678164d8546388948cc01ac3b8cba/dpdk/lib/librte_vhost/vhost_user.c: In function ‘vhost_user_set_vring_enable’:
/tmp/UB1604_K4.8.0_GCC6.2.0/x86_64-native-linuxapp-gcc/e9d678164d8546388948cc01ac3b8cba/dpdk/lib/librte_vhost/vhost_user.c:1317:3: warning: implicit declaration of function ‘drain_zmbuf_list’ [-Wimplicit-function-declaration]
   drain_zmbuf_list(dev->virtqueue[index]);
   ^~~~~~~~~~~~~~~~
/tmp/UB1604_K4.8.0_GCC6.2.0/x86_64-native-linuxapp-gcc/e9d678164d8546388948cc01ac3b8cba/dpdk/lib/librte_vhost/vhost_user.c:1317:3: warning: nested extern declaration of ‘drain_zmbuf_list’ [-Wnested-externs]
  CC rte_event_crypto_adapter.o
  CC ip_frag_internal.o
  AR librte_ip_frag.a
  INSTALL-LIB librte_ip_frag.a
  CC rte_event_eth_tx_adapter.o
--
  AR librte_pmd_skeleton_rawdev.a
  INSTALL-LIB librte_pmd_skeleton_rawdev.a
  CC ifpga_fme.o
  CC ifpga_fme_iperf.o
  CC ifpga_fme_dperf.o
  CC ifpga_fme_error.o
  CC ifpga_port.o
  CC ifpga_port_error.o
  CC opae_hw_api.o
  CC opae_ifpga_hw_api.o
  CC opae_debug.o
  CC ifpga_fme_pr.o
  CC ifpga_rawdev.o
--
  LD dpdk-procinfo
  CC test.o
  CC resource.o
/tmp/UB1604_K4.8.0_GCC6.2.0/x86_64-native-linuxapp-gcc/e9d678164d8546388948cc01ac3b8cba/dpdk/x86_64-native-linuxapp-gcc/lib/librte_vhost.a(vhost_user.o): In function `vhost_user_set_vring_enable':
vhost_user.c:(.text+0x7c8): undefined reference to `drain_zmbuf_list'
collect2: error: ld returned 1 exit status
/tmp/UB1604_K4.8.0_GCC6.2.0/x86_64-native-linuxapp-gcc/e9d678164d8546388948cc01ac3b8cba/dpdk/mk/rte.app.mk:397: recipe for target 'dpdk-procinfo' failed
make[5]: *** [dpdk-procinfo] Error 1
/tmp/UB1604_K4.8.0_GCC6.2.0/x86_64-native-linuxapp-gcc/e9d678164d8546388948cc01ac3b8cba/dpdk/mk/rte.subdir.mk:35: recipe for target 'proc-info' failed
make[4]: *** [proc-info] Error 2
make[4]: *** Waiting for unfinished jobs....
  CC parameters.o
  CC test_resource.o
  CC test_prefetch.o
--
  CC test_memcpy_perf.o
  LD testpmd
  CC test_member.o
/tmp/UB1604_K4.8.0_GCC6.2.0/x86_64-native-linuxapp-gcc/e9d678164d8546388948cc01ac3b8cba/dpdk/x86_64-native-linuxapp-gcc/lib/librte_vhost.a(vhost_user.o): In function `vhost_user_set_vring_enable':
vhost_user.c:(.text+0x7c8): undefined reference to `drain_zmbuf_list'
collect2: error: ld returned 1 exit status
/tmp/UB1604_K4.8.0_GCC6.2.0/x86_64-native-linuxapp-gcc/e9d678164d8546388948cc01ac3b8cba/dpdk/mk/rte.app.mk:397: recipe for target 'testpmd' failed
make[5]: *** [testpmd] Error 1
/tmp/UB1604_K4.8.0_GCC6.2.0/x86_64-native-linuxapp-gcc/e9d678164d8546388948cc01ac3b8cba/dpdk/mk/rte.subdir.mk:35: recipe for target 'test-pmd' failed
make[4]: *** [test-pmd] Error 2
  CC test_member_perf.o
  CC test_efd.o
  CC test_efd_perf.o
  CC test_hash.o
--
  CC test_ipsec.o
  MKRES test_resource_c.res.o
  LD test
/tmp/UB1604_K4.8.0_GCC6.2.0/x86_64-native-linuxapp-gcc/e9d678164d8546388948cc01ac3b8cba/dpdk/x86_64-native-linuxapp-gcc/lib/librte_vhost.a(vhost_user.o): In function `vhost_user_set_vring_enable':
vhost_user.c:(.text+0x7c8): undefined reference to `drain_zmbuf_list'
collect2: error: ld returned 1 exit status
/tmp/UB1604_K4.8.0_GCC6.2.0/x86_64-native-linuxapp-gcc/e9d678164d8546388948cc01ac3b8cba/dpdk/mk/rte.app.mk:397: recipe for target 'test' failed
make[5]: *** [test] Error 1
/tmp/UB1604_K4.8.0_GCC6.2.0/x86_64-native-linuxapp-gcc/e9d678164d8546388948cc01ac3b8cba/dpdk/mk/rte.subdir.mk:35: recipe for target 'test' failed
make[4]: *** [test] Error 2
/tmp/UB1604_K4.8.0_GCC6.2.0/x86_64-native-linuxapp-gcc/e9d678164d8546388948cc01ac3b8cba/dpdk/mk/rte.sdkbuild.mk:46: recipe for target 'app' failed
make[3]: *** [app] Error 2
/tmp/UB1604_K4.8.0_GCC6.2.0/x86_64-native-linuxapp-gcc/e9d678164d8546388948cc01ac3b8cba/dpdk/mk/rte.sdkroot.mk:98: recipe for target 'all' failed
make[2]: *** [all] Error 2
/tmp/UB1604_K4.8.0_GCC6.2.0/x86_64-native-linuxapp-gcc/e9d678164d8546388948cc01ac3b8cba/dpdk/mk/rte.sdkinstall.mk:57: recipe for target 'pre_install' failed
make[1]: *** [pre_install] Error 2
/tmp/UB1604_K4.8.0_GCC6.2.0/x86_64-native-linuxapp-gcc/e9d678164d8546388948cc01ac3b8cba/dpdk/mk/rte.sdkroot.mk:77: recipe for target 'install' failed
make: *** [install] Error 2

*Failed Build #4:
OS: CENTOS
Target: x86_64-native-linuxapp-gcc-shared
  LD librte_ip_frag.so.1.1
  INSTALL-LIB librte_ip_frag.so.1.1
== Build lib/librte_gro
  CC vhost_user.o
/tmp/CENTOS_K3.10.0_GCC4.8.5/x86_64-native-linuxapp-gcc-shared/e9d678164d8546388948cc01ac3b8cba/dpdk/lib/librte_vhost/vhost_user.c: In function ‘vhost_user_set_vring_enable’:
/tmp/CENTOS_K3.10.0_GCC4.8.5/x86_64-native-linuxapp-gcc-shared/e9d678164d8546388948cc01ac3b8cba/dpdk/lib/librte_vhost/vhost_user.c:1317:3: warning: implicit declaration of function ‘drain_zmbuf_list’ [-Wimplicit-function-declaration]
   drain_zmbuf_list(dev->virtqueue[index]);
   ^
/tmp/CENTOS_K3.10.0_GCC4.8.5/x86_64-native-linuxapp-gcc-shared/e9d678164d8546388948cc01ac3b8cba/dpdk/lib/librte_vhost/vhost_user.c:1317:3: warning: nested extern declaration of ‘drain_zmbuf_list’ [-Wnested-externs]
  SYMLINK-FILE include/rte_gro.h
  CC rte_gro.o
  CC gro_tcp4.o
  CC rte_event_timer_adapter.o
  CC gro_vxlan_tcp4.o
--
  INSTALL-LIB librte_pdump.so.3.1
== Build lib/librte_gso
  LD librte_vhost.so.4.1
vhost_user.o: In function `vhost_user_set_vring_enable':
vhost_user.c:(.text+0x728): undefined reference to `drain_zmbuf_list'
collect2: error: ld returned 1 exit status
make[5]: *** [librte_vhost.so.4.1] Error 1
make[4]: *** [librte_vhost] Error 2
make[4]: *** Waiting for unfinished jobs....
  SYMLINK-FILE include/rte_gso.h
  CC rte_gso.o

*Failed Build #5:
OS: UB1604
Target: x86_64-native-linuxapp-gcc-shared
  CC socket.o
  CC rte_event_eth_tx_adapter.o
  CC vhost.o
  CC vhost_user.o
/tmp/UB1604_K4.4.0_GCC5.4.0/x86_64-native-linuxapp-gcc-shared/e9d678164d8546388948cc01ac3b8cba/dpdk/lib/librte_vhost/vhost_user.c: In function ‘vhost_user_set_vring_enable’:
/tmp/UB1604_K4.4.0_GCC5.4.0/x86_64-native-linuxapp-gcc-shared/e9d678164d8546388948cc01ac3b8cba/dpdk/lib/librte_vhost/vhost_user.c:1317:3: warning: implicit declaration of function ‘drain_zmbuf_list’ [-Wimplicit-function-declaration]
   drain_zmbuf_list(dev->virtqueue[index]);
   ^
/tmp/UB1604_K4.4.0_GCC5.4.0/x86_64-native-linuxapp-gcc-shared/e9d678164d8546388948cc01ac3b8cba/dpdk/lib/librte_vhost/vhost_user.c:1317:3: warning: nested extern declaration of ‘drain_zmbuf_list’ [-Wnested-externs]
  LD librte_eventdev.so.6.1
  INSTALL-LIB librte_eventdev.so.6.1
  CC virtio_net.o
== Build lib/librte_ip_frag
  SYMLINK-FILE include/rte_ip_frag.h
--
  INSTALL-LIB librte_kni.so.2.1
  LD librte_vhost.so.4.1
== Build lib/librte_pdump
vhost_user.o: In function `vhost_user_set_vring_enable':
vhost_user.c:(.text+0x7c8): undefined reference to `drain_zmbuf_list'
collect2: error: ld returned 1 exit status
/tmp/UB1604_K4.4.0_GCC5.4.0/x86_64-native-linuxapp-gcc-shared/e9d678164d8546388948cc01ac3b8cba/dpdk/mk/rte.lib.mk:100: recipe for target 'librte_vhost.so.4.1' failed
make[5]: *** [librte_vhost.so.4.1] Error 1
/tmp/UB1604_K4.4.0_GCC5.4.0/x86_64-native-linuxapp-gcc-shared/e9d678164d8546388948cc01ac3b8cba/dpdk/mk/rte.subdir.mk:35: recipe for target 'librte_vhost' failed
make[4]: *** [librte_vhost] Error 2
make[4]: *** Waiting for unfinished jobs....
  CC rte_distributor.o
  CC rte_distributor_match_sse.o
  SYMLINK-FILE include/rte_pdump.h
  CC rte_pdump.o
  LD librte_distributor.so.1.1
  INSTALL-LIB librte_distributor.so.1.1
  LD librte_pdump.so.3.1
  INSTALL-LIB librte_pdump.so.3.1
/tmp/UB1604_K4.4.0_GCC5.4.0/x86_64-native-linuxapp-gcc-shared/e9d678164d8546388948cc01ac3b8cba/dpdk/mk/rte.sdkbuild.mk:46: recipe for target 'lib' failed
make[3]: *** [lib] Error 2
/tmp/UB1604_K4.4.0_GCC5.4.0/x86_64-native-linuxapp-gcc-shared/e9d678164d8546388948cc01ac3b8cba/dpdk/mk/rte.sdkroot.mk:98: recipe for target 'all' failed
make[2]: *** [all] Error 2
/tmp/UB1604_K4.4.0_GCC5.4.0/x86_64-native-linuxapp-gcc-shared/e9d678164d8546388948cc01ac3b8cba/dpdk/mk/rte.sdkinstall.mk:57: recipe for target 'pre_install' failed
make[1]: *** [pre_install] Error 2
/tmp/UB1604_K4.4.0_GCC5.4.0/x86_64-native-linuxapp-gcc-shared/e9d678164d8546388948cc01ac3b8cba/dpdk/mk/rte.sdkroot.mk:77: recipe for target 'install' failed
make: *** [install] Error 2

*Failed Build #6:
OS: CENTOS
Target: x86_64-native-linuxapp-clang
  CC ip_frag_internal.o
  CC vhost.o
  AR librte_ip_frag.a
  INSTALL-LIB librte_ip_frag.a
  CC vhost_user.o
/tmp/CENTOS_K3.10.0_GCC4.8.5/x86_64-native-linuxapp-clang/e9d678164d8546388948cc01ac3b8cba/dpdk/lib/librte_vhost/vhost_user.c:1317:3: warning: implicit declaration of function 'drain_zmbuf_list' is invalid in C99 [-Wimplicit-function-declaration]
                drain_zmbuf_list(dev->virtqueue[index]);
                ^
  CC virtio_net.o
1 warning generated.
  CC vdpa.o
  CC rte_event_timer_adapter.o
  CC vhost_crypto.o
  CC rte_event_crypto_adapter.o
== Build lib/librte_gro
--
  CC ifpga_fme.o
  CC ifpga_fme_iperf.o
  CC ifpga_fme_dperf.o
  AR librte_pmd_dpaa2_qdma.a
  INSTALL-LIB librte_pmd_dpaa2_qdma.a
  CC ifpga_fme_error.o
  CC ifpga_port.o
  CC ifpga_port_error.o
  CC opae_hw_api.o
  CC opae_ifpga_hw_api.o
  CC opae_debug.o
  CC ifpga_fme_pr.o
  CC ifpga_rawdev.o
--
  LD dpdk-procinfo
  CC test.o
/tmp/CENTOS_K3.10.0_GCC4.8.5/x86_64-native-linuxapp-clang/e9d678164d8546388948cc01ac3b8cba/dpdk/x86_64-native-linuxapp-clang/lib/librte_vhost.a(vhost_user.o): In function `vhost_user_set_vring_enable':
/tmp/CENTOS_K3.10.0_GCC4.8.5/x86_64-native-linuxapp-clang/e9d678164d8546388948cc01ac3b8cba/dpdk/lib/librte_vhost/vhost_user.c:(.text+0x1d51): undefined reference to `drain_zmbuf_list'
  CC parameters.o
clang: error: linker command failed with exit code 1 (use -v to see invocation)
make[5]: *** [dpdk-procinfo] Error 1
make[4]: *** [proc-info] Error 2
make[4]: *** Waiting for unfinished jobs....
  CC resource.o
  CC test_resource.o
--
  CC test_table_ports.o
  LD testpmd
  CC test_table_combined.o
/tmp/CENTOS_K3.10.0_GCC4.8.5/x86_64-native-linuxapp-clang/e9d678164d8546388948cc01ac3b8cba/dpdk/x86_64-native-linuxapp-clang/lib/librte_vhost.a(vhost_user.o): In function `vhost_user_set_vring_enable':
/tmp/CENTOS_K3.10.0_GCC4.8.5/x86_64-native-linuxapp-clang/e9d678164d8546388948cc01ac3b8cba/dpdk/lib/librte_vhost/vhost_user.c:(.text+0x1d51): undefined reference to `drain_zmbuf_list'
clang: error: linker command failed with exit code 1 (use -v to see invocation)
make[5]: *** [testpmd] Error 1
make[4]: *** [test-pmd] Error 2
  CC test_table_acl.o
  CC test_flow_classify.o
  CC test_rwlock.o
--
  CC test_ipsec.o
  MKRES test_resource_c.res.o
  LD test
/tmp/CENTOS_K3.10.0_GCC4.8.5/x86_64-native-linuxapp-clang/e9d678164d8546388948cc01ac3b8cba/dpdk/x86_64-native-linuxapp-clang/lib/librte_vhost.a(vhost_user.o): In function `vhost_user_set_vring_enable':
/tmp/CENTOS_K3.10.0_GCC4.8.5/x86_64-native-linuxapp-clang/e9d678164d8546388948cc01ac3b8cba/dpdk/lib/librte_vhost/vhost_user.c:(.text+0x1d51): undefined reference to `drain_zmbuf_list'
clang: error: linker command failed with exit code 1 (use -v to see invocation)
make[5]: *** [test] Error 1
make[4]: *** [test] Error 2
make[3]: *** [app] Error 2
make[2]: *** [all] Error 2
make[1]: *** [pre_install] Error 2

*Failed Build #7:
OS: CENTOS
Target: i686-native-linuxapp-gcc
  SYMLINK-FILE include/rte_ip_frag.h
  CC rte_ipv4_fragmentation.o
  CC vhost_user.o
  CC rte_ipv6_fragmentation.o
/tmp/CENTOS_K3.10.0_GCC4.8.5/i686-native-linuxapp-gcc/e9d678164d8546388948cc01ac3b8cba/dpdk/lib/librte_vhost/vhost_user.c: In function ‘vhost_user_set_vring_enable’:
/tmp/CENTOS_K3.10.0_GCC4.8.5/i686-native-linuxapp-gcc/e9d678164d8546388948cc01ac3b8cba/dpdk/lib/librte_vhost/vhost_user.c:1317:3: warning: implicit declaration of function ‘drain_zmbuf_list’ [-Wimplicit-function-declaration]
   drain_zmbuf_list(dev->virtqueue[index]);
   ^
/tmp/CENTOS_K3.10.0_GCC4.8.5/i686-native-linuxapp-gcc/e9d678164d8546388948cc01ac3b8cba/dpdk/lib/librte_vhost/vhost_user.c:1317:3: warning: nested extern declaration of ‘drain_zmbuf_list’ [-Wnested-externs]
  CC virtio_net.o
  CC rte_ipv4_reassembly.o
  CC rte_ipv6_reassembly.o
  CC rte_ip_frag_common.o
  CC vdpa.o
--
  CC ifpga_fme.o
  CC ifpga_fme_iperf.o
  CC ifpga_fme_dperf.o
  AR librte_pmd_dpaa2_qdma.a
  INSTALL-LIB librte_pmd_dpaa2_qdma.a
  CC ifpga_fme_error.o
  CC ifpga_port.o
  CC ifpga_port_error.o
  CC opae_hw_api.o
  CC opae_ifpga_hw_api.o
  CC opae_debug.o
  CC ifpga_fme_pr.o
  CC ifpga_rawdev.o
--
  LD dpdk-procinfo
  CC test.o
  CC resource.o
/tmp/CENTOS_K3.10.0_GCC4.8.5/i686-native-linuxapp-gcc/e9d678164d8546388948cc01ac3b8cba/dpdk/i686-native-linuxapp-gcc/lib/librte_vhost.a(vhost_user.o): In function `vhost_user_set_vring_enable':
vhost_user.c:(.text+0x830): undefined reference to `drain_zmbuf_list'
collect2: error: ld returned 1 exit status
make[5]: *** [dpdk-procinfo] Error 1
make[4]: *** [proc-info] Error 2
make[4]: *** Waiting for unfinished jobs....
  CC test_resource.o
  CC test_prefetch.o
--
  LD testpmd
  CC test_mbuf.o
  CC test_logs.o
/tmp/CENTOS_K3.10.0_GCC4.8.5/i686-native-linuxapp-gcc/e9d678164d8546388948cc01ac3b8cba/dpdk/i686-native-linuxapp-gcc/lib/librte_vhost.a(vhost_user.o): In function `vhost_user_set_vring_enable':
vhost_user.c:(.text+0x830): undefined reference to `drain_zmbuf_list'
collect2: error: ld returned 1 exit status
make[5]: *** [testpmd] Error 1
make[4]: *** [test-pmd] Error 2
  CC test_memcpy.o
  CC test_memcpy_perf.o
  CC test_member.o
--
  CC test_ipsec.o
  MKRES test_resource_c.res.o
  LD test
/tmp/CENTOS_K3.10.0_GCC4.8.5/i686-native-linuxapp-gcc/e9d678164d8546388948cc01ac3b8cba/dpdk/i686-native-linuxapp-gcc/lib/librte_vhost.a(vhost_user.o): In function `vhost_user_set_vring_enable':
vhost_user.c:(.text+0x830): undefined reference to `drain_zmbuf_list'
collect2: error: ld returned 1 exit status
make[5]: *** [test] Error 1
make[4]: *** [test] Error 2
make[3]: *** [app] Error 2
make[2]: *** [all] Error 2
make[1]: *** [pre_install] Error 2

*Failed Build #8:
OS: UB1604
Target: x86_64-native-linuxapp-clang
  CC ip_frag_internal.o
  CC vhost_user.o
  AR librte_ip_frag.a
  INSTALL-LIB librte_ip_frag.a
  CC virtio_net.o
/tmp/UB1604_K4.4.0_GCC5.4.0/x86_64-native-linuxapp-clang/e9d678164d8546388948cc01ac3b8cba/dpdk/lib/librte_vhost/vhost_user.c:1317:3: warning: implicit declaration of function 'drain_zmbuf_list' is invalid in C99 [-Wimplicit-function-declaration]
                drain_zmbuf_list(dev->virtqueue[index]);
                ^
  CC rte_event_eth_tx_adapter.o
1 warning generated.
== Build lib/librte_gro
  SYMLINK-FILE include/rte_gro.h
  CC rte_gro.o
  AR librte_eventdev.a
  INSTALL-LIB librte_eventdev.a
--
  AR librte_pmd_skeleton_rawdev.a
  INSTALL-LIB librte_pmd_skeleton_rawdev.a
  CC ifpga_fme.o
  CC ifpga_fme_iperf.o
  CC ifpga_fme_dperf.o
  CC ifpga_fme_error.o
  CC ifpga_port.o
  CC ifpga_port_error.o
  CC opae_hw_api.o
  CC opae_ifpga_hw_api.o
  CC opae_debug.o
  CC ifpga_fme_pr.o
  CC ifpga_rawdev.o
--
  CC test.o
/tmp/UB1604_K4.4.0_GCC5.4.0/x86_64-native-linuxapp-clang/e9d678164d8546388948cc01ac3b8cba/dpdk/x86_64-native-linuxapp-clang/lib/librte_vhost.a(vhost_user.o): In function `vhost_user_set_vring_enable':
/tmp/UB1604_K4.4.0_GCC5.4.0/x86_64-native-linuxapp-clang/e9d678164d8546388948cc01ac3b8cba/dpdk/lib/librte_vhost/vhost_user.c:(.text+0x1f01): undefined reference to `drain_zmbuf_list'
  CC resource.o
  CC test_resource.o
clang: error: linker command failed with exit code 1 (use -v to see invocation)
/tmp/UB1604_K4.4.0_GCC5.4.0/x86_64-native-linuxapp-clang/e9d678164d8546388948cc01ac3b8cba/dpdk/mk/rte.app.mk:397: recipe for target 'dpdk-procinfo' failed
make[5]: *** [dpdk-procinfo] Error 1
/tmp/UB1604_K4.4.0_GCC5.4.0/x86_64-native-linuxapp-clang/e9d678164d8546388948cc01ac3b8cba/dpdk/mk/rte.subdir.mk:35: recipe for target 'proc-info' failed
make[4]: *** [proc-info] Error 2
make[4]: *** Waiting for unfinished jobs....
  CC parameters.o
  CC test_prefetch.o
  CC test_byteorder.o
--
  CC softnicfwd.o
  CC test_member_perf.o
  LD testpmd
/tmp/UB1604_K4.4.0_GCC5.4.0/x86_64-native-linuxapp-clang/e9d678164d8546388948cc01ac3b8cba/dpdk/x86_64-native-linuxapp-clang/lib/librte_vhost.a(vhost_user.o): In function `vhost_user_set_vring_enable':
/tmp/UB1604_K4.4.0_GCC5.4.0/x86_64-native-linuxapp-clang/e9d678164d8546388948cc01ac3b8cba/dpdk/lib/librte_vhost/vhost_user.c:(.text+0x1f01): undefined reference to `drain_zmbuf_list'
clang: error: linker command failed with exit code 1 (use -v to see invocation)
/tmp/UB1604_K4.4.0_GCC5.4.0/x86_64-native-linuxapp-clang/e9d678164d8546388948cc01ac3b8cba/dpdk/mk/rte.app.mk:397: recipe for target 'testpmd' failed
make[5]: *** [testpmd] Error 1
/tmp/UB1604_K4.4.0_GCC5.4.0/x86_64-native-linuxapp-clang/e9d678164d8546388948cc01ac3b8cba/dpdk/mk/rte.subdir.mk:35: recipe for target 'test-pmd' failed
make[4]: *** [test-pmd] Error 2
  CC test_efd.o
  CC test_efd_perf.o
  CC test_hash.o
  CC test_thash.o
--
  CC test_ipsec.o
  MKRES test_resource_c.res.o
  LD test
/tmp/UB1604_K4.4.0_GCC5.4.0/x86_64-native-linuxapp-clang/e9d678164d8546388948cc01ac3b8cba/dpdk/x86_64-native-linuxapp-clang/lib/librte_vhost.a(vhost_user.o): In function `vhost_user_set_vring_enable':
/tmp/UB1604_K4.4.0_GCC5.4.0/x86_64-native-linuxapp-clang/e9d678164d8546388948cc01ac3b8cba/dpdk/lib/librte_vhost/vhost_user.c:(.text+0x1f01): undefined reference to `drain_zmbuf_list'
clang: error: linker command failed with exit code 1 (use -v to see invocation)
/tmp/UB1604_K4.4.0_GCC5.4.0/x86_64-native-linuxapp-clang/e9d678164d8546388948cc01ac3b8cba/dpdk/mk/rte.app.mk:397: recipe for target 'test' failed
make[5]: *** [test] Error 1
/tmp/UB1604_K4.4.0_GCC5.4.0/x86_64-native-linuxapp-clang/e9d678164d8546388948cc01ac3b8cba/dpdk/mk/rte.subdir.mk:35: recipe for target 'test' failed
make[4]: *** [test] Error 2
/tmp/UB1604_K4.4.0_GCC5.4.0/x86_64-native-linuxapp-clang/e9d678164d8546388948cc01ac3b8cba/dpdk/mk/rte.sdkbuild.mk:46: recipe for target 'app' failed
make[3]: *** [app] Error 2
/tmp/UB1604_K4.4.0_GCC5.4.0/x86_64-native-linuxapp-clang/e9d678164d8546388948cc01ac3b8cba/dpdk/mk/rte.sdkroot.mk:98: recipe for target 'all' failed
make[2]: *** [all] Error 2
/tmp/UB1604_K4.4.0_GCC5.4.0/x86_64-native-linuxapp-clang/e9d678164d8546388948cc01ac3b8cba/dpdk/mk/rte.sdkinstall.mk:57: recipe for target 'pre_install' failed
make[1]: *** [pre_install] Error 2
/tmp/UB1604_K4.4.0_GCC5.4.0/x86_64-native-linuxapp-clang/e9d678164d8546388948cc01ac3b8cba/dpdk/mk/rte.sdkroot.mk:77: recipe for target 'install' failed
make: *** [install] Error 2

*Failed Build #9:
OS: UB1604
Target: i686-native-linuxapp-gcc
  CC rte_ip_frag_common.o
  CC rte_event_crypto_adapter.o
  CC vhost_user.o
  CC ip_frag_internal.o
/tmp/UB1604_K4.4.0_GCC5.4.0/i686-native-linuxapp-gcc/e9d678164d8546388948cc01ac3b8cba/dpdk/lib/librte_vhost/vhost_user.c: In function ‘vhost_user_set_vring_enable’:
/tmp/UB1604_K4.4.0_GCC5.4.0/i686-native-linuxapp-gcc/e9d678164d8546388948cc01ac3b8cba/dpdk/lib/librte_vhost/vhost_user.c:1317:3: warning: implicit declaration of function ‘drain_zmbuf_list’ [-Wimplicit-function-declaration]
   drain_zmbuf_list(dev->virtqueue[index]);
   ^
/tmp/UB1604_K4.4.0_GCC5.4.0/i686-native-linuxapp-gcc/e9d678164d8546388948cc01ac3b8cba/dpdk/lib/librte_vhost/vhost_user.c:1317:3: warning: nested extern declaration of ‘drain_zmbuf_list’ [-Wnested-externs]
  AR librte_ip_frag.a
  INSTALL-LIB librte_ip_frag.a
  CC virtio_net.o
  CC vdpa.o
  CC rte_event_eth_tx_adapter.o
--
  INSTALL-LIB librte_pmd_dpaa2_qdma.a
  CC ifpga_feature_dev.o
  CC ifpga_fme.o
  CC ifpga_fme_iperf.o
  CC ifpga_fme_dperf.o
  CC ifpga_fme_error.o
  CC ifpga_port.o
  CC ifpga_port_error.o
  CC opae_hw_api.o
  CC opae_ifpga_hw_api.o
  CC opae_debug.o
  CC ifpga_fme_pr.o
  CC ifpga_rawdev.o
--
  LD dpdk-procinfo
  CC test.o
  CC resource.o
/tmp/UB1604_K4.4.0_GCC5.4.0/i686-native-linuxapp-gcc/e9d678164d8546388948cc01ac3b8cba/dpdk/i686-native-linuxapp-gcc/lib/librte_vhost.a(vhost_user.o): In function `vhost_user_set_vring_enable':
vhost_user.c:(.text+0x7b8): undefined reference to `drain_zmbuf_list'
collect2: error: ld returned 1 exit status
/tmp/UB1604_K4.4.0_GCC5.4.0/i686-native-linuxapp-gcc/e9d678164d8546388948cc01ac3b8cba/dpdk/mk/rte.app.mk:397: recipe for target 'dpdk-procinfo' failed
make[5]: *** [dpdk-procinfo] Error 1
/tmp/UB1604_K4.4.0_GCC5.4.0/i686-native-linuxapp-gcc/e9d678164d8546388948cc01ac3b8cba/dpdk/mk/rte.subdir.mk:35: recipe for target 'proc-info' failed
make[4]: *** [proc-info] Error 2
make[4]: *** Waiting for unfinished jobs....
  CC test_resource.o
  CC parameters.o
  CC cmdline.o
--
  CC test_table_ports.o
  CC test_table_combined.o
  LD testpmd
/tmp/UB1604_K4.4.0_GCC5.4.0/i686-native-linuxapp-gcc/e9d678164d8546388948cc01ac3b8cba/dpdk/i686-native-linuxapp-gcc/lib/librte_vhost.a(vhost_user.o): In function `vhost_user_set_vring_enable':
vhost_user.c:(.text+0x7b8): undefined reference to `drain_zmbuf_list'
collect2: error: ld returned 1 exit status
/tmp/UB1604_K4.4.0_GCC5.4.0/i686-native-linuxapp-gcc/e9d678164d8546388948cc01ac3b8cba/dpdk/mk/rte.app.mk:397: recipe for target 'testpmd' failed
make[5]: *** [testpmd] Error 1
/tmp/UB1604_K4.4.0_GCC5.4.0/i686-native-linuxapp-gcc/e9d678164d8546388948cc01ac3b8cba/dpdk/mk/rte.subdir.mk:35: recipe for target 'test-pmd' failed
make[4]: *** [test-pmd] Error 2
  CC test_table_acl.o
  CC test_flow_classify.o
  CC test_rwlock.o
  CC test_timer.o
--
  CC test_ipsec.o
  MKRES test_resource_c.res.o
  LD test
/tmp/UB1604_K4.4.0_GCC5.4.0/i686-native-linuxapp-gcc/e9d678164d8546388948cc01ac3b8cba/dpdk/i686-native-linuxapp-gcc/lib/librte_vhost.a(vhost_user.o): In function `vhost_user_set_vring_enable':
vhost_user.c:(.text+0x7b8): undefined reference to `drain_zmbuf_list'
collect2: error: ld returned 1 exit status
/tmp/UB1604_K4.4.0_GCC5.4.0/i686-native-linuxapp-gcc/e9d678164d8546388948cc01ac3b8cba/dpdk/mk/rte.app.mk:397: recipe for target 'test' failed
make[5]: *** [test] Error 1
/tmp/UB1604_K4.4.0_GCC5.4.0/i686-native-linuxapp-gcc/e9d678164d8546388948cc01ac3b8cba/dpdk/mk/rte.subdir.mk:35: recipe for target 'test' failed
make[4]: *** [test] Error 2
/tmp/UB1604_K4.4.0_GCC5.4.0/i686-native-linuxapp-gcc/e9d678164d8546388948cc01ac3b8cba/dpdk/mk/rte.sdkbuild.mk:46: recipe for target 'app' failed
make[3]: *** [app] Error 2
/tmp/UB1604_K4.4.0_GCC5.4.0/i686-native-linuxapp-gcc/e9d678164d8546388948cc01ac3b8cba/dpdk/mk/rte.sdkroot.mk:98: recipe for target 'all' failed
make[2]: *** [all] Error 2
/tmp/UB1604_K4.4.0_GCC5.4.0/i686-native-linuxapp-gcc/e9d678164d8546388948cc01ac3b8cba/dpdk/mk/rte.sdkinstall.mk:57: recipe for target 'pre_install' failed
make[1]: *** [pre_install] Error 2
/tmp/UB1604_K4.4.0_GCC5.4.0/i686-native-linuxapp-gcc/e9d678164d8546388948cc01ac3b8cba/dpdk/mk/rte.sdkroot.mk:77: recipe for target 'install' failed
make: *** [install] Error 2

*Failed Build #10:
OS: CENTOS
Target: x86_64-native-linuxapp-gcc
== Build lib/librte_gro
  SYMLINK-FILE include/rte_gro.h
  CC rte_gro.o
  CC vhost_user.o
/tmp/CENTOS_K3.10.0_GCC4.8.5/x86_64-native-linuxapp-gcc/e9d678164d8546388948cc01ac3b8cba/dpdk/lib/librte_vhost/vhost_user.c: In function ‘vhost_user_set_vring_enable’:
/tmp/CENTOS_K3.10.0_GCC4.8.5/x86_64-native-linuxapp-gcc/e9d678164d8546388948cc01ac3b8cba/dpdk/lib/librte_vhost/vhost_user.c:1317:3: warning: implicit declaration of function ‘drain_zmbuf_list’ [-Wimplicit-function-declaration]
   drain_zmbuf_list(dev->virtqueue[index]);
   ^
/tmp/CENTOS_K3.10.0_GCC4.8.5/x86_64-native-linuxapp-gcc/e9d678164d8546388948cc01ac3b8cba/dpdk/lib/librte_vhost/vhost_user.c:1317:3: warning: nested extern declaration of ‘drain_zmbuf_list’ [-Wnested-externs]
  CC gro_tcp4.o
  CC rte_event_timer_adapter.o
  CC gro_vxlan_tcp4.o
  AR librte_gro.a
  INSTALL-LIB librte_gro.a
--
  CC ifpga_fme.o
  AR librte_pmd_dpaa2_qdma.a
  INSTALL-LIB librte_pmd_dpaa2_qdma.a
  CC ifpga_fme_iperf.o
  CC ifpga_fme_dperf.o
  CC ifpga_fme_error.o
  CC ifpga_port.o
  CC ifpga_port_error.o
  CC opae_hw_api.o
  CC opae_ifpga_hw_api.o
  CC opae_debug.o
  CC ifpga_fme_pr.o
  CC ifpga_rawdev.o
--
  CC test.o
  CC resource.o
  CC test_resource.o
/tmp/CENTOS_K3.10.0_GCC4.8.5/x86_64-native-linuxapp-gcc/e9d678164d8546388948cc01ac3b8cba/dpdk/x86_64-native-linuxapp-gcc/lib/librte_vhost.a(vhost_user.o): In function `vhost_user_set_vring_enable':
vhost_user.c:(.text+0x6b0): undefined reference to `drain_zmbuf_list'
collect2: error: ld returned 1 exit status
make[5]: *** [dpdk-procinfo] Error 1
make[4]: *** [proc-info] Error 2
make[4]: *** Waiting for unfinished jobs....
  CC test_prefetch.o
  CC test_byteorder.o
--
  LD testpmd
  CC test_flow_classify.o
  CC test_rwlock.o
/tmp/CENTOS_K3.10.0_GCC4.8.5/x86_64-native-linuxapp-gcc/e9d678164d8546388948cc01ac3b8cba/dpdk/x86_64-native-linuxapp-gcc/lib/librte_vhost.a(vhost_user.o): In function `vhost_user_set_vring_enable':
vhost_user.c:(.text+0x6b0): undefined reference to `drain_zmbuf_list'
collect2: error: ld returned 1 exit status
make[5]: *** [testpmd] Error 1
make[4]: *** [test-pmd] Error 2
  CC test_timer.o
  CC test_timer_perf.o
  CC test_timer_racecond.o
--
  CC test_ipsec.o
  MKRES test_resource_c.res.o
  LD test
/tmp/CENTOS_K3.10.0_GCC4.8.5/x86_64-native-linuxapp-gcc/e9d678164d8546388948cc01ac3b8cba/dpdk/x86_64-native-linuxapp-gcc/lib/librte_vhost.a(vhost_user.o): In function `vhost_user_set_vring_enable':
vhost_user.c:(.text+0x6b0): undefined reference to `drain_zmbuf_list'
collect2: error: ld returned 1 exit status
make[5]: *** [test] Error 1
make[4]: *** [test] Error 2
make[3]: *** [app] Error 2
make[2]: *** [all] Error 2
make[1]: *** [pre_install] Error 2

*Failed Build #11:
OS: FC24
Target: x86_64-native-linuxapp-gcc-shared
  CC vhost.o
  CC rte_ipv6_reassembly.o
  CC rte_ip_frag_common.o
  CC vhost_user.o
/tmp/FC24_K4.9.13_GCC6.2.1/x86_64-native-linuxapp-gcc-shared/e9d678164d8546388948cc01ac3b8cba/dpdk/lib/librte_vhost/vhost_user.c: In function ‘vhost_user_set_vring_enable’:
/tmp/FC24_K4.9.13_GCC6.2.1/x86_64-native-linuxapp-gcc-shared/e9d678164d8546388948cc01ac3b8cba/dpdk/lib/librte_vhost/vhost_user.c:1317:3: warning: implicit declaration of function ‘drain_zmbuf_list’ [-Wimplicit-function-declaration]
   drain_zmbuf_list(dev->virtqueue[index]);
   ^~~~~~~~~~~~~~~~
/tmp/FC24_K4.9.13_GCC6.2.1/x86_64-native-linuxapp-gcc-shared/e9d678164d8546388948cc01ac3b8cba/dpdk/lib/librte_vhost/vhost_user.c:1317:3: warning: nested extern declaration of ‘drain_zmbuf_list’ [-Wnested-externs]
  CC rte_event_crypto_adapter.o
  CC ip_frag_internal.o
  LD librte_ip_frag.so.1.1
  INSTALL-LIB librte_ip_frag.so.1.1
  CC rte_event_eth_tx_adapter.o
--
  INSTALL-LIB librte_bitratestats.so.2.1
== Build lib/librte_kni
  LD librte_vhost.so.4.1
vhost_user.o: In function `vhost_user_set_vring_enable':
vhost_user.c:(.text+0x6a8): undefined reference to `drain_zmbuf_list'
collect2: error: ld returned 1 exit status
/tmp/FC24_K4.9.13_GCC6.2.1/x86_64-native-linuxapp-gcc-shared/e9d678164d8546388948cc01ac3b8cba/dpdk/mk/rte.lib.mk:100: recipe for target 'librte_vhost.so.4.1' failed
make[5]: *** [librte_vhost.so.4.1] Error 1
/tmp/FC24_K4.9.13_GCC6.2.1/x86_64-native-linuxapp-gcc-shared/e9d678164d8546388948cc01ac3b8cba/dpdk/mk/rte.subdir.mk:35: recipe for target 'librte_vhost' failed
make[4]: *** [librte_vhost] Error 2
make[4]: *** Waiting for unfinished jobs....
  SYMLINK-FILE include/rte_latencystats.h
  CC rte_latencystats.o
  SYMLINK-FILE include/rte_kni.h
  CC rte_kni.o
  LD librte_latencystats.so.1.1
  INSTALL-LIB librte_latencystats.so.1.1
  LD librte_kni.so.2.1
  INSTALL-LIB librte_kni.so.2.1
/tmp/FC24_K4.9.13_GCC6.2.1/x86_64-native-linuxapp-gcc-shared/e9d678164d8546388948cc01ac3b8cba/dpdk/mk/rte.sdkbuild.mk:46: recipe for target 'lib' failed
make[3]: *** [lib] Error 2
/tmp/FC24_K4.9.13_GCC6.2.1/x86_64-native-linuxapp-gcc-shared/e9d678164d8546388948cc01ac3b8cba/dpdk/mk/rte.sdkroot.mk:98: recipe for target 'all' failed
make[2]: *** [all] Error 2
/tmp/FC24_K4.9.13_GCC6.2.1/x86_64-native-linuxapp-gcc-shared/e9d678164d8546388948cc01ac3b8cba/dpdk/mk/rte.sdkinstall.mk:57: recipe for target 'pre_install' failed
make[1]: *** [pre_install] Error 2
/tmp/FC24_K4.9.13_GCC6.2.1/x86_64-native-linuxapp-gcc-shared/e9d678164d8546388948cc01ac3b8cba/dpdk/mk/rte.sdkroot.mk:77: recipe for target 'install' failed
make: *** [install] Error 2

*Failed Build #12:
OS: FC24
Target: i686-native-linuxapp-gcc
  CC rte_event_timer_adapter.o
  CC rte_ip_frag_common.o
  CC ip_frag_internal.o
  CC vhost_user.o
/tmp/FC24_K4.5.5_GCC6.1.1/i686-native-linuxapp-gcc/e9d678164d8546388948cc01ac3b8cba/dpdk/lib/librte_vhost/vhost_user.c: In function ‘vhost_user_set_vring_enable’:
/tmp/FC24_K4.5.5_GCC6.1.1/i686-native-linuxapp-gcc/e9d678164d8546388948cc01ac3b8cba/dpdk/lib/librte_vhost/vhost_user.c:1317:3: warning: implicit declaration of function ‘drain_zmbuf_list’ [-Wimplicit-function-declaration]
   drain_zmbuf_list(dev->virtqueue[index]);
   ^~~~~~~~~~~~~~~~
/tmp/FC24_K4.5.5_GCC6.1.1/i686-native-linuxapp-gcc/e9d678164d8546388948cc01ac3b8cba/dpdk/lib/librte_vhost/vhost_user.c:1317:3: warning: nested extern declaration of ‘drain_zmbuf_list’ [-Wnested-externs]
  AR librte_ip_frag.a
  INSTALL-LIB librte_ip_frag.a
  CC rte_event_crypto_adapter.o
  CC virtio_net.o
  CC rte_event_eth_tx_adapter.o
--
  CC ifpga_enumerate.o
  CC ifpga_feature_dev.o
  CC ifpga_fme_iperf.o
  CC ifpga_fme.o
  CC ifpga_fme_dperf.o
  CC ifpga_fme_error.o
  CC ifpga_port.o
  CC ifpga_port_error.o
  CC opae_hw_api.o
  CC opae_ifpga_hw_api.o
  CC opae_debug.o
  CC ifpga_fme_pr.o
  CC ifpga_rawdev.o
--
  CC commands.o
  LD dpdk-procinfo
  CC test.o
/tmp/FC24_K4.5.5_GCC6.1.1/i686-native-linuxapp-gcc/e9d678164d8546388948cc01ac3b8cba/dpdk/i686-native-linuxapp-gcc/lib/librte_vhost.a(vhost_user.o): In function `vhost_user_set_vring_enable':
vhost_user.c:(.text+0x718): undefined reference to `drain_zmbuf_list'
collect2: error: ld returned 1 exit status
/tmp/FC24_K4.5.5_GCC6.1.1/i686-native-linuxapp-gcc/e9d678164d8546388948cc01ac3b8cba/dpdk/mk/rte.app.mk:397: recipe for target 'dpdk-procinfo' failed
make[5]: *** [dpdk-procinfo] Error 1
/tmp/FC24_K4.5.5_GCC6.1.1/i686-native-linuxapp-gcc/e9d678164d8546388948cc01ac3b8cba/dpdk/mk/rte.subdir.mk:35: recipe for target 'proc-info' failed
make[4]: *** [proc-info] Error 2
make[4]: *** Waiting for unfinished jobs....
  CC resource.o
  CC test_resource.o
  CC test_prefetch.o
--
  CC test_memcpy.o
  LD testpmd
  CC test_memcpy_perf.o
/tmp/FC24_K4.5.5_GCC6.1.1/i686-native-linuxapp-gcc/e9d678164d8546388948cc01ac3b8cba/dpdk/i686-native-linuxapp-gcc/lib/librte_vhost.a(vhost_user.o): In function `vhost_user_set_vring_enable':
vhost_user.c:(.text+0x718): undefined reference to `drain_zmbuf_list'
collect2: error: ld returned 1 exit status
/tmp/FC24_K4.5.5_GCC6.1.1/i686-native-linuxapp-gcc/e9d678164d8546388948cc01ac3b8cba/dpdk/mk/rte.app.mk:397: recipe for target 'testpmd' failed
make[5]: *** [testpmd] Error 1
/tmp/FC24_K4.5.5_GCC6.1.1/i686-native-linuxapp-gcc/e9d678164d8546388948cc01ac3b8cba/dpdk/mk/rte.subdir.mk:35: recipe for target 'test-pmd' failed
make[4]: *** [test-pmd] Error 2
  CC test_member.o
  CC test_member_perf.o
  CC test_efd.o
  CC test_efd_perf.o
--
  CC test_ipsec.o
  MKRES test_resource_c.res.o
  LD test
/tmp/FC24_K4.5.5_GCC6.1.1/i686-native-linuxapp-gcc/e9d678164d8546388948cc01ac3b8cba/dpdk/i686-native-linuxapp-gcc/lib/librte_vhost.a(vhost_user.o): In function `vhost_user_set_vring_enable':
vhost_user.c:(.text+0x718): undefined reference to `drain_zmbuf_list'
collect2: error: ld returned 1 exit status
/tmp/FC24_K4.5.5_GCC6.1.1/i686-native-linuxapp-gcc/e9d678164d8546388948cc01ac3b8cba/dpdk/mk/rte.app.mk:397: recipe for target 'test' failed
make[5]: *** [test] Error 1
/tmp/FC24_K4.5.5_GCC6.1.1/i686-native-linuxapp-gcc/e9d678164d8546388948cc01ac3b8cba/dpdk/mk/rte.subdir.mk:35: recipe for target 'test' failed
make[4]: *** [test] Error 2
/tmp/FC24_K4.5.5_GCC6.1.1/i686-native-linuxapp-gcc/e9d678164d8546388948cc01ac3b8cba/dpdk/mk/rte.sdkbuild.mk:46: recipe for target 'app' failed
make[3]: *** [app] Error 2
/tmp/FC24_K4.5.5_GCC6.1.1/i686-native-linuxapp-gcc/e9d678164d8546388948cc01ac3b8cba/dpdk/mk/rte.sdkroot.mk:98: recipe for target 'all' failed
make[2]: *** [all] Error 2
/tmp/FC24_K4.5.5_GCC6.1.1/i686-native-linuxapp-gcc/e9d678164d8546388948cc01ac3b8cba/dpdk/mk/rte.sdkinstall.mk:57: recipe for target 'pre_install' failed
make[1]: *** [pre_install] Error 2
/tmp/FC24_K4.5.5_GCC6.1.1/i686-native-linuxapp-gcc/e9d678164d8546388948cc01ac3b8cba/dpdk/mk/rte.sdkroot.mk:77: recipe for target 'install' failed
make: *** [install] Error 2

*Failed Build #13:
OS: FC25
Target: x86_64-native-linuxapp-gcc-debug
  AR librte_eventdev.a
  INSTALL-LIB librte_eventdev.a
  CC virtio_net.o
== Build lib/librte_ip_frag
/tmp/FC25_K4.8.6_GCC6.3.1/x86_64-native-linuxapp-gcc-debug/e9d678164d8546388948cc01ac3b8cba/dpdk/lib/librte_vhost/vhost_user.c: In function ‘vhost_user_set_vring_enable’:
/tmp/FC25_K4.8.6_GCC6.3.1/x86_64-native-linuxapp-gcc-debug/e9d678164d8546388948cc01ac3b8cba/dpdk/lib/librte_vhost/vhost_user.c:1317:3: warning: implicit declaration of function ‘drain_zmbuf_list’ [-Wimplicit-function-declaration]
   drain_zmbuf_list(dev->virtqueue[index]);
   ^~~~~~~~~~~~~~~~
/tmp/FC25_K4.8.6_GCC6.3.1/x86_64-native-linuxapp-gcc-debug/e9d678164d8546388948cc01ac3b8cba/dpdk/lib/librte_vhost/vhost_user.c:1317:3: warning: nested extern declaration of ‘drain_zmbuf_list’ [-Wnested-externs]
  SYMLINK-FILE include/rte_ip_frag.h
  CC rte_ipv4_fragmentation.o
  CC rte_ipv6_fragmentation.o
  CC rte_ipv4_reassembly.o
  CC vdpa.o
--
  CC ifpga_api.o
  CC ifpga_feature_dev.o
  CC ifpga_fme.o
  CC ifpga_fme_iperf.o
  CC ifpga_fme_dperf.o
  CC ifpga_fme_error.o
  CC ifpga_port.o
  CC ifpga_port_error.o
  CC opae_hw_api.o
  CC opae_ifpga_hw_api.o
  CC opae_debug.o
  CC ifpga_fme_pr.o
  CC ifpga_rawdev.o
--
  LD dpdk-procinfo
  CC test.o
  CC resource.o
/tmp/FC25_K4.8.6_GCC6.3.1/x86_64-native-linuxapp-gcc-debug/e9d678164d8546388948cc01ac3b8cba/dpdk/x86_64-native-linuxapp-gcc/lib/librte_vhost.a(vhost_user.o): In function `vhost_user_set_vring_enable':
vhost_user.c:(.text+0x688): undefined reference to `drain_zmbuf_list'
collect2: error: ld returned 1 exit status
/tmp/FC25_K4.8.6_GCC6.3.1/x86_64-native-linuxapp-gcc-debug/e9d678164d8546388948cc01ac3b8cba/dpdk/mk/rte.app.mk:397: recipe for target 'dpdk-procinfo' failed
make[5]: *** [dpdk-procinfo] Error 1
/tmp/FC25_K4.8.6_GCC6.3.1/x86_64-native-linuxapp-gcc-debug/e9d678164d8546388948cc01ac3b8cba/dpdk/mk/rte.subdir.mk:35: recipe for target 'proc-info' failed
make[4]: *** [proc-info] Error 2
make[4]: *** Waiting for unfinished jobs....
  CC parameters.o
  CC test_resource.o
  CC test_prefetch.o
--
  CC test_memcpy.o
  LD testpmd
  CC test_memcpy_perf.o
/tmp/FC25_K4.8.6_GCC6.3.1/x86_64-native-linuxapp-gcc-debug/e9d678164d8546388948cc01ac3b8cba/dpdk/x86_64-native-linuxapp-gcc/lib/librte_vhost.a(vhost_user.o): In function `vhost_user_set_vring_enable':
vhost_user.c:(.text+0x688): undefined reference to `drain_zmbuf_list'
collect2: error: ld returned 1 exit status
/tmp/FC25_K4.8.6_GCC6.3.1/x86_64-native-linuxapp-gcc-debug/e9d678164d8546388948cc01ac3b8cba/dpdk/mk/rte.app.mk:397: recipe for target 'testpmd' failed
make[5]: *** [testpmd] Error 1
/tmp/FC25_K4.8.6_GCC6.3.1/x86_64-native-linuxapp-gcc-debug/e9d678164d8546388948cc01ac3b8cba/dpdk/mk/rte.subdir.mk:35: recipe for target 'test-pmd' failed
make[4]: *** [test-pmd] Error 2
  CC test_member.o
  CC test_member_perf.o
  CC test_efd.o
  CC test_efd_perf.o
--
  CC test_ipsec.o
  MKRES test_resource_c.res.o
  LD test
/tmp/FC25_K4.8.6_GCC6.3.1/x86_64-native-linuxapp-gcc-debug/e9d678164d8546388948cc01ac3b8cba/dpdk/x86_64-native-linuxapp-gcc/lib/librte_vhost.a(vhost_user.o): In function `vhost_user_set_vring_enable':
vhost_user.c:(.text+0x688): undefined reference to `drain_zmbuf_list'
collect2: error: ld returned 1 exit status
/tmp/FC25_K4.8.6_GCC6.3.1/x86_64-native-linuxapp-gcc-debug/e9d678164d8546388948cc01ac3b8cba/dpdk/mk/rte.app.mk:397: recipe for target 'test' failed
make[5]: *** [test] Error 1
/tmp/FC25_K4.8.6_GCC6.3.1/x86_64-native-linuxapp-gcc-debug/e9d678164d8546388948cc01ac3b8cba/dpdk/mk/rte.subdir.mk:35: recipe for target 'test' failed
make[4]: *** [test] Error 2
/tmp/FC25_K4.8.6_GCC6.3.1/x86_64-native-linuxapp-gcc-debug/e9d678164d8546388948cc01ac3b8cba/dpdk/mk/rte.sdkbuild.mk:46: recipe for target 'app' failed
make[3]: *** [app] Error 2
/tmp/FC25_K4.8.6_GCC6.3.1/x86_64-native-linuxapp-gcc-debug/e9d678164d8546388948cc01ac3b8cba/dpdk/mk/rte.sdkroot.mk:98: recipe for target 'all' failed
make[2]: *** [all] Error 2
/tmp/FC25_K4.8.6_GCC6.3.1/x86_64-native-linuxapp-gcc-debug/e9d678164d8546388948cc01ac3b8cba/dpdk/mk/rte.sdkinstall.mk:57: recipe for target 'pre_install' failed
make[1]: *** [pre_install] Error 2
/tmp/FC25_K4.8.6_GCC6.3.1/x86_64-native-linuxapp-gcc-debug/e9d678164d8546388948cc01ac3b8cba/dpdk/mk/rte.sdkroot.mk:77: recipe for target 'install' failed
make: *** [install] Error 2

*Failed Build #14:
OS: FC24
Target: x86_64-native-linuxapp-clang
  AR librte_ip_frag.a
  INSTALL-LIB librte_ip_frag.a
== Build lib/librte_gro
  SYMLINK-FILE include/rte_gro.h
  CC rte_gro.o
/tmp/FC24_K4.9.13_GCC6.2.1/x86_64-native-linuxapp-clang/e9d678164d8546388948cc01ac3b8cba/dpdk/lib/librte_vhost/vhost_user.c:1317:3: warning: implicit declaration of function 'drain_zmbuf_list' is invalid in C99 [-Wimplicit-function-declaration]
                drain_zmbuf_list(dev->virtqueue[index]);
                ^
  CC gro_tcp4.o
1 warning generated.
  CC virtio_net.o
  CC rte_event_crypto_adapter.o
  CC gro_vxlan_tcp4.o
  AR librte_gro.a
  INSTALL-LIB librte_gro.a
--
  AR librte_pmd_skeleton_rawdev.a
  INSTALL-LIB librte_pmd_skeleton_rawdev.a
  CC ifpga_fme.o
  CC ifpga_fme_iperf.o
  CC ifpga_fme_dperf.o
  CC ifpga_fme_error.o
  CC ifpga_port.o
  CC ifpga_port_error.o
  CC opae_hw_api.o
  CC opae_ifpga_hw_api.o
  CC opae_debug.o
  CC ifpga_rawdev.o
  CC ifpga_fme_pr.o
--
  LD dpdk-procinfo
  CC test.o
/tmp/FC24_K4.9.13_GCC6.2.1/x86_64-native-linuxapp-clang/e9d678164d8546388948cc01ac3b8cba/dpdk/x86_64-native-linuxapp-clang/lib/librte_vhost.a(vhost_user.o): In function `vhost_user_set_vring_enable':
/tmp/FC24_K4.9.13_GCC6.2.1/x86_64-native-linuxapp-clang/e9d678164d8546388948cc01ac3b8cba/dpdk/lib/librte_vhost/vhost_user.c:(.text+0x1f01): undefined reference to `drain_zmbuf_list'
  CC resource.o
clang-3.8: error: linker command failed with exit code 1 (use -v to see invocation)
/tmp/FC24_K4.9.13_GCC6.2.1/x86_64-native-linuxapp-clang/e9d678164d8546388948cc01ac3b8cba/dpdk/mk/rte.app.mk:397: recipe for target 'dpdk-procinfo' failed
make[5]: *** [dpdk-procinfo] Error 1
/tmp/FC24_K4.9.13_GCC6.2.1/x86_64-native-linuxapp-clang/e9d678164d8546388948cc01ac3b8cba/dpdk/mk/rte.subdir.mk:35: recipe for target 'proc-info' failed
make[4]: *** [proc-info] Error 2
make[4]: *** Waiting for unfinished jobs....
  CC parameters.o
  CC test_resource.o
  CC test_prefetch.o
--
  CC test_table_ports.o
  LD testpmd
  CC test_table_combined.o
/tmp/FC24_K4.9.13_GCC6.2.1/x86_64-native-linuxapp-clang/e9d678164d8546388948cc01ac3b8cba/dpdk/x86_64-native-linuxapp-clang/lib/librte_vhost.a(vhost_user.o): In function `vhost_user_set_vring_enable':
/tmp/FC24_K4.9.13_GCC6.2.1/x86_64-native-linuxapp-clang/e9d678164d8546388948cc01ac3b8cba/dpdk/lib/librte_vhost/vhost_user.c:(.text+0x1f01): undefined reference to `drain_zmbuf_list'
clang-3.8: error: linker command failed with exit code 1 (use -v to see invocation)
/tmp/FC24_K4.9.13_GCC6.2.1/x86_64-native-linuxapp-clang/e9d678164d8546388948cc01ac3b8cba/dpdk/mk/rte.app.mk:397: recipe for target 'testpmd' failed
make[5]: *** [testpmd] Error 1
/tmp/FC24_K4.9.13_GCC6.2.1/x86_64-native-linuxapp-clang/e9d678164d8546388948cc01ac3b8cba/dpdk/mk/rte.subdir.mk:35: recipe for target 'test-pmd' failed
make[4]: *** [test-pmd] Error 2
  CC test_table_acl.o
  CC test_flow_classify.o
  CC test_rwlock.o
  CC test_timer.o
--
  CC test_ipsec.o
  MKRES test_resource_c.res.o
  LD test
/tmp/FC24_K4.9.13_GCC6.2.1/x86_64-native-linuxapp-clang/e9d678164d8546388948cc01ac3b8cba/dpdk/x86_64-native-linuxapp-clang/lib/librte_vhost.a(vhost_user.o): In function `vhost_user_set_vring_enable':
/tmp/FC24_K4.9.13_GCC6.2.1/x86_64-native-linuxapp-clang/e9d678164d8546388948cc01ac3b8cba/dpdk/lib/librte_vhost/vhost_user.c:(.text+0x1f01): undefined reference to `drain_zmbuf_list'
clang-3.8: error: linker command failed with exit code 1 (use -v to see invocation)
/tmp/FC24_K4.9.13_GCC6.2.1/x86_64-native-linuxapp-clang/e9d678164d8546388948cc01ac3b8cba/dpdk/mk/rte.app.mk:397: recipe for target 'test' failed
make[5]: *** [test] Error 1
/tmp/FC24_K4.9.13_GCC6.2.1/x86_64-native-linuxapp-clang/e9d678164d8546388948cc01ac3b8cba/dpdk/mk/rte.subdir.mk:35: recipe for target 'test' failed
make[4]: *** [test] Error 2
/tmp/FC24_K4.9.13_GCC6.2.1/x86_64-native-linuxapp-clang/e9d678164d8546388948cc01ac3b8cba/dpdk/mk/rte.sdkbuild.mk:46: recipe for target 'app' failed
make[3]: *** [app] Error 2
/tmp/FC24_K4.9.13_GCC6.2.1/x86_64-native-linuxapp-clang/e9d678164d8546388948cc01ac3b8cba/dpdk/mk/rte.sdkroot.mk:98: recipe for target 'all' failed
make[2]: *** [all] Error 2
/tmp/FC24_K4.9.13_GCC6.2.1/x86_64-native-linuxapp-clang/e9d678164d8546388948cc01ac3b8cba/dpdk/mk/rte.sdkinstall.mk:57: recipe for target 'pre_install' failed
make[1]: *** [pre_install] Error 2
/tmp/FC24_K4.9.13_GCC6.2.1/x86_64-native-linuxapp-clang/e9d678164d8546388948cc01ac3b8cba/dpdk/mk/rte.sdkroot.mk:77: recipe for target 'install' failed
make: *** [install] Error 2

DPDK STV team


More information about the test-report mailing list