[dpdk-test-report] |FAILURE| pw50661-50664 [PATCH] [1/4] common/qat: add headers for asymmetric crypto

dpdklab at iol.unh.edu dpdklab at iol.unh.edu
Thu Feb 28 18:04:28 CET 2019


Test-Label: Performance-Testing
Test-Status: FAILURE
http://dpdk.org/patch/50661

_build patch failure_

Submitter: Arek Kusztal <arkadiuszx.kusztal at intel.com>
Date: Thursday, February 28 2019 16:35:20 
Applied on: Branch: dpdk
  CommitID:8d47a753b7cb05e0ef62360324c6a28505038d09
Apply patch set 50661-50664 failed:

Configuration done using x86_64-native-linuxapp-gcc
== Build lib
== Build lib/librte_kvargs
== Build lib/librte_eal
== Build lib/librte_eal/common
== Build lib/librte_eal/linuxapp
== Build lib/librte_eal/linuxapp/eal
== Build lib/librte_pci
== Build lib/librte_ring
== Build lib/librte_mempool
== Build lib/librte_mbuf
== Build lib/librte_timer
== Build lib/librte_cfgfile
== Build lib/librte_cmdline
== Build lib/librte_net
== Build lib/librte_meter
== Build lib/librte_ethdev
== Build lib/librte_bbdev
== Build lib/librte_cryptodev
== Build lib/librte_security
== Build lib/librte_compressdev
== Build lib/librte_hash
== Build lib/librte_eventdev
== Build lib/librte_rawdev
== Build lib/librte_vhost
== Build lib/librte_efd
== Build lib/librte_lpm
== Build lib/librte_acl
== Build lib/librte_member
== Build lib/librte_ip_frag
== Build lib/librte_gro
== Build lib/librte_jobstats
== Build lib/librte_metrics
== Build lib/librte_bitratestats
== Build lib/librte_latencystats
== Build lib/librte_power
== Build lib/librte_sched
== Build lib/librte_kni
== Build lib/librte_port
== Build lib/librte_table
== Build lib/librte_flow_classify
== Build lib/librte_distributor
== Build lib/librte_pipeline
== Build lib/librte_reorder
== Build lib/librte_pdump
== Build lib/librte_gso
== Build lib/librte_bpf
== Build lib/librte_ipsec
== Build buildtools
== Build buildtools/pmdinfogen
== Build kernel
== Build kernel/linux
== Build kernel/linux/igb_uio
  Building modules, stage 2.
  MODPOST 1 modules
== Build kernel/linux/kni
  Building modules, stage 2.
  MODPOST 1 modules
== Build drivers
== Build drivers/common
== Build drivers/common/cpt
== Build drivers/common/octeontx
== Build drivers/common/dpaax
== Build drivers/bus
== Build drivers/bus/dpaa
== Build drivers/bus/fslmc
== Build drivers/bus/ifpga
== Build drivers/bus/pci
== Build drivers/bus/vdev
== Build drivers/bus/vmbus
== Build drivers/mempool
== Build drivers/mempool/bucket
== Build drivers/mempool/dpaa
== Build drivers/mempool/dpaa2
== Build drivers/mempool/ring
== Build drivers/mempool/stack
== Build drivers/mempool/octeontx
== Build drivers/net
== Build drivers/net/af_packet
== Build drivers/net/ark
== Build drivers/net/atlantic
== Build drivers/net/avf
== Build drivers/net/avp
== Build drivers/net/axgbe
== Build drivers/net/bonding
== Build drivers/net/cxgbe
== Build drivers/net/dpaa
== Build drivers/net/dpaa2
== Build drivers/net/e1000
== Build drivers/net/ena
== Build drivers/net/enetc
== Build drivers/net/enic
== Build drivers/net/failsafe
== Build drivers/net/fm10k
== Build drivers/net/i40e
== Build drivers/net/ice
== Build drivers/net/ixgbe
== Build drivers/net/liquidio
== Build drivers/net/netvsc
== Build drivers/net/nfp
== Build drivers/net/bnxt
== Build drivers/net/null
== Build drivers/net/octeontx
== Build drivers/net/qede
== Build drivers/net/ring
== Build drivers/net/sfc
== Build drivers/net/tap
== Build drivers/net/thunderx
== Build drivers/net/vdev_netvsc
== Build drivers/net/virtio
== Build drivers/net/vmxnet3
== Build drivers/net/kni
== Build drivers/net/softnic
== Build drivers/net/vhost
== Build drivers/net/ifc
== Build drivers/baseband
== Build drivers/baseband/null
== Build drivers/crypto
== Build drivers/crypto/octeontx
== Build drivers/crypto/scheduler
== Build drivers/crypto/null
== Build drivers/crypto/dpaa2_sec
== Build drivers/crypto/dpaa_sec
== Build drivers/crypto/caam_jr
== Build drivers/crypto/virtio
== Build drivers/common/qat
  CC qat_asym.o
/var/lib/jenkins/workspace/Apply-One-Patch-Set/dpdk/drivers/crypto/qat/qat_asym.c: In function ‘qat_asym_process_response’:
/var/lib/jenkins/workspace/Apply-One-Patch-Set/dpdk/drivers/crypto/qat/qat_asym.c:246:42: error: ‘struct rte_crypto_mod_op_param’ has no member named ‘result’
   uint8_t *modexp_result = asym_op->modex.result.data;
                                          ^
/var/lib/jenkins/workspace/Apply-One-Patch-Set/dpdk/drivers/crypto/qat/qat_asym.c:249:20: error: ‘struct rte_crypto_mod_op_param’ has no member named ‘result’
     (asym_op->modex.result.length - ctx->sess_alg_params.mod_exp.n.length),
                    ^
/var/lib/jenkins/workspace/Apply-One-Patch-Set/dpdk/drivers/crypto/qat/qat_asym.c:262:43: error: ‘struct rte_crypto_mod_op_param’ has no member named ‘result’
   uint8_t *modinv_result = asym_op->modinv.result.data;
                                           ^
/var/lib/jenkins/workspace/Apply-One-Patch-Set/dpdk/drivers/crypto/qat/qat_asym.c:265:21: error: ‘struct rte_crypto_mod_op_param’ has no member named ‘result’
     (asym_op->modinv.result.length - ctx->sess_alg_params.mod_inv.n.length),
                     ^
make[5]: *** [qat_asym.o] Error 1
make[4]: *** [common/qat] Error 2
make[3]: *** [drivers] Error 2
make[2]: *** [all] Error 2
make[1]: *** [pre_install] Error 2
make: *** [install] Error 2

https://lab.dpdk.org/results/dashboard/patchsets/4716/

UNH-IOL DPDK Performance Test Lab


More information about the test-report mailing list