[dpdk-test-report] |FAILURE| pw50077[v4, 5/5] mempool/ring: add non-blocking ring handlers

sys_stv at intel.com sys_stv at intel.com
Mon Jan 28 19:24:09 CET 2019


Test-Label: Intel-compilation
Test-Status: FAILURE
http://dpdk.org/patch/50077

_Compilation issues_

Submitter: Gage Eads <gage.eads at intel.com>
Date: 2019-01-28 18:14:07
Reply_mail: 20190128181407.32739-6-gage.eads at intel.com
DPDK git baseline: Repo:dpdk-master, CommitID: a2f9c0d417e3417e2858f2446b08ea27d962b056

Build Summary: 15 Builds Done, 3 Successful, 12 Failures

Test environment and configuration as below:

OS: FC25
	Kernel Version: 4.5.5-300.fc24.x86_64
	CPU info: Intel(R) Xeon(R) CPU E5-2699 v3 @ 2.30GHz
	GCC Version: gcc (GCC) 6.1.1 20160510 (Red Hat 6.1.1-2)
	Clang Version: 3.8.0 (tags/RELEASE_380/final)
	x86_64-native-linuxapp-gcc
	x86_64-native-linuxapp-gcc-debug

OS: FC24
	Kernel Version: 4.11.12-100.fc24.x86_64
	CPU info: Intel(R) Xeon(R) CPU E5-2699 v3 @ 2.30GHz
	GCC Version: gcc (GCC) 6.3.1 20161221 (Red Hat 6.3.1-1)
	Clang Version: 3.8.1 (tags/RELEASE_381/final)
	x86_64-native-linuxapp-clang
	x86_64-native-linuxapp-gcc-shared
	i686-native-linuxapp-gcc

OS: CENTOS
	Kernel Version: 3.10.0-957.1.3.el7.x86_64
	CPU info: Intel(R) Xeon(R) CPU E5-2699 v3 @ 2.30GHz
	GCC Version: gcc (GCC) 4.8.5 20150623 (Red Hat 4.8.5-36)
	Clang Version: NA
	x86_64-native-linuxapp-clang
	x86_64-native-linuxapp-gcc-shared
	x86_64-native-linuxapp-gcc
	i686-native-linuxapp-gcc

OS: UB1604
	Kernel Version: 4.4.0-78-generic
	CPU info: Intel(R) Xeon(R) CPU E5-2699 v3 @ 2.30GHz
	GCC Version: gcc (Ubuntu 5.4.0-6ubuntu1~16.04.10) 5.4.0 20160609
	Clang Version: 3.8.0-2ubuntu4 (tags/RELEASE_380/final)
	x86_64-native-linuxapp-gcc
	x86_64-native-linuxapp-clang
	x86_64-native-linuxapp-gcc-shared
	i686-native-linuxapp-gcc

OS: FreeBSD
	Kernel Version: 10.3-RELEASE
	CPU info: Intel(R) Xeon(R) CPU E5-2699 v3 @ 2.30GHz (2294.76-MHz K8-class CPU)
	GCC Version: gcc (FreeBSD Ports Collection) 7.3.0
	Clang Version: 3.4.1 (tags/RELEASE_34/dot1-final 208032) 20140512
	x86_64-native-bsdapp-clang
	x86_64-native-bsdapp-gcc

*Failed Build #1:
OS: FC25
Target: x86_64-native-linuxapp-gcc
  CC rte_mempool.o
In file included from /tmp/FC25_K4.8.6_GCC6.3.1/x86_64-native-linuxapp-gcc/4ec513432db04bc2afa739f344a764b0/dpdk/x86_64-native-linuxapp-gcc/include/rte_ring.h:442:0,
                 from /tmp/FC25_K4.8.6_GCC6.3.1/x86_64-native-linuxapp-gcc/4ec513432db04bc2afa739f344a764b0/dpdk/lib/librte_mempool/rte_mempool.h:50,
                 from /tmp/FC25_K4.8.6_GCC6.3.1/x86_64-native-linuxapp-gcc/4ec513432db04bc2afa739f344a764b0/dpdk/lib/librte_mempool/rte_mempool.c:34:
/tmp/FC25_K4.8.6_GCC6.3.1/x86_64-native-linuxapp-gcc/4ec513432db04bc2afa739f344a764b0/dpdk/x86_64-native-linuxapp-gcc/include/rte_ring_generic.h: In function ‘__rte_ring_do_nb_enqueue_mp’:
/tmp/FC25_K4.8.6_GCC6.3.1/x86_64-native-linuxapp-gcc/4ec513432db04bc2afa739f344a764b0/dpdk/x86_64-native-linuxapp-gcc/include/rte_ring_generic.h:440:7: warning: implicit declaration of function ‘rte_atomic128_cmpset’ [-Wimplicit-function-declaration]
   if (rte_atomic128_cmpset((volatile rte_int128_t *)ring_ptr,
       ^~~~~~~~~~~~~~~~~~~~
/tmp/FC25_K4.8.6_GCC6.3.1/x86_64-native-linuxapp-gcc/4ec513432db04bc2afa739f344a764b0/dpdk/x86_64-native-linuxapp-gcc/include/rte_ring_generic.h:440:3: warning: nested extern declaration of ‘rte_atomic128_cmpset’ [-Wnested-externs]
   if (rte_atomic128_cmpset((volatile rte_int128_t *)ring_ptr,
   ^~
/tmp/FC25_K4.8.6_GCC6.3.1/x86_64-native-linuxapp-gcc/4ec513432db04bc2afa739f344a764b0/dpdk/x86_64-native-linuxapp-gcc/include/rte_ring_generic.h:440:38: error: unknown type name ‘rte_int128_t’
   if (rte_atomic128_cmpset((volatile rte_int128_t *)ring_ptr,
                                      ^~~~~~~~~~~~
/tmp/FC25_K4.8.6_GCC6.3.1/x86_64-native-linuxapp-gcc/4ec513432db04bc2afa739f344a764b0/dpdk/x86_64-native-linuxapp-gcc/include/rte_ring_generic.h:441:8: error: ‘rte_int128_t’ undeclared (first use in this function)
       (rte_int128_t *)&old_value,
        ^~~~~~~~~~~~
/tmp/FC25_K4.8.6_GCC6.3.1/x86_64-native-linuxapp-gcc/4ec513432db04bc2afa739f344a764b0/dpdk/x86_64-native-linuxapp-gcc/include/rte_ring_generic.h:441:8: note: each undeclared identifier is reported only once for each function it appears in
/tmp/FC25_K4.8.6_GCC6.3.1/x86_64-native-linuxapp-gcc/4ec513432db04bc2afa739f344a764b0/dpdk/x86_64-native-linuxapp-gcc/include/rte_ring_generic.h:441:22: error: expected expression before ‘)’ token
       (rte_int128_t *)&old_value,
                      ^
/tmp/FC25_K4.8.6_GCC6.3.1/x86_64-native-linuxapp-gcc/4ec513432db04bc2afa739f344a764b0/dpdk/x86_64-native-linuxapp-gcc/include/rte_ring_generic.h:403:35: warning: variable ‘new_value’ set but not used [-Wunused-but-set-variable]
   struct nb_ring_entry old_value, new_value;
                                   ^~~~~~~~~
  CC power_pstate_cpufreq.o
/tmp/FC25_K4.8.6_GCC6.3.1/x86_64-native-linuxapp-gcc/4ec513432db04bc2afa739f344a764b0/dpdk/mk/internal/rte.compile-pre.mk:114: recipe for target 'rte_mempool.o' failed
make[5]: *** [rte_mempool.o] Error 1
/tmp/FC25_K4.8.6_GCC6.3.1/x86_64-native-linuxapp-gcc/4ec513432db04bc2afa739f344a764b0/dpdk/mk/rte.subdir.mk:35: recipe for target 'librte_mempool' failed
make[4]: *** [librte_mempool] Error 2
make[4]: *** Waiting for unfinished jobs....
  AR librte_power.a
  INSTALL-LIB librte_power.a
/tmp/FC25_K4.8.6_GCC6.3.1/x86_64-native-linuxapp-gcc/4ec513432db04bc2afa739f344a764b0/dpdk/mk/rte.sdkbuild.mk:49: recipe for target 'lib' failed
make[3]: *** [lib] Error 2
/tmp/FC25_K4.8.6_GCC6.3.1/x86_64-native-linuxapp-gcc/4ec513432db04bc2afa739f344a764b0/dpdk/mk/rte.sdkroot.mk:100: recipe for target 'all' failed
make[2]: *** [all] Error 2
/tmp/FC25_K4.8.6_GCC6.3.1/x86_64-native-linuxapp-gcc/4ec513432db04bc2afa739f344a764b0/dpdk/mk/rte.sdkinstall.mk:57: recipe for target 'pre_install' failed
make[1]: *** [pre_install] Error 2
/tmp/FC25_K4.8.6_GCC6.3.1/x86_64-native-linuxapp-gcc/4ec513432db04bc2afa739f344a764b0/dpdk/mk/rte.sdkroot.mk:79: recipe for target 'install' failed
make: *** [install] Error 2

*Failed Build #2:
OS: UB1604
Target: x86_64-native-linuxapp-gcc
  CC rte_mempool.o
In file included from /tmp/UB1604_K4.8.0_GCC6.2.0/x86_64-native-linuxapp-gcc/4ec513432db04bc2afa739f344a764b0/dpdk/x86_64-native-linuxapp-gcc/include/rte_ring.h:442:0,
                 from /tmp/UB1604_K4.8.0_GCC6.2.0/x86_64-native-linuxapp-gcc/4ec513432db04bc2afa739f344a764b0/dpdk/lib/librte_mempool/rte_mempool.h:50,
                 from /tmp/UB1604_K4.8.0_GCC6.2.0/x86_64-native-linuxapp-gcc/4ec513432db04bc2afa739f344a764b0/dpdk/lib/librte_mempool/rte_mempool.c:34:
/tmp/UB1604_K4.8.0_GCC6.2.0/x86_64-native-linuxapp-gcc/4ec513432db04bc2afa739f344a764b0/dpdk/x86_64-native-linuxapp-gcc/include/rte_ring_generic.h: In function ‘__rte_ring_do_nb_enqueue_mp’:
/tmp/UB1604_K4.8.0_GCC6.2.0/x86_64-native-linuxapp-gcc/4ec513432db04bc2afa739f344a764b0/dpdk/x86_64-native-linuxapp-gcc/include/rte_ring_generic.h:440:7: warning: implicit declaration of function ‘rte_atomic128_cmpset’ [-Wimplicit-function-declaration]
   if (rte_atomic128_cmpset((volatile rte_int128_t *)ring_ptr,
       ^~~~~~~~~~~~~~~~~~~~
/tmp/UB1604_K4.8.0_GCC6.2.0/x86_64-native-linuxapp-gcc/4ec513432db04bc2afa739f344a764b0/dpdk/x86_64-native-linuxapp-gcc/include/rte_ring_generic.h:440:3: warning: nested extern declaration of ‘rte_atomic128_cmpset’ [-Wnested-externs]
   if (rte_atomic128_cmpset((volatile rte_int128_t *)ring_ptr,
   ^~
/tmp/UB1604_K4.8.0_GCC6.2.0/x86_64-native-linuxapp-gcc/4ec513432db04bc2afa739f344a764b0/dpdk/x86_64-native-linuxapp-gcc/include/rte_ring_generic.h:440:38: error: unknown type name ‘rte_int128_t’
   if (rte_atomic128_cmpset((volatile rte_int128_t *)ring_ptr,
                                      ^~~~~~~~~~~~
/tmp/UB1604_K4.8.0_GCC6.2.0/x86_64-native-linuxapp-gcc/4ec513432db04bc2afa739f344a764b0/dpdk/x86_64-native-linuxapp-gcc/include/rte_ring_generic.h:441:8: error: ‘rte_int128_t’ undeclared (first use in this function)
       (rte_int128_t *)&old_value,
        ^~~~~~~~~~~~
/tmp/UB1604_K4.8.0_GCC6.2.0/x86_64-native-linuxapp-gcc/4ec513432db04bc2afa739f344a764b0/dpdk/x86_64-native-linuxapp-gcc/include/rte_ring_generic.h:441:8: note: each undeclared identifier is reported only once for each function it appears in
/tmp/UB1604_K4.8.0_GCC6.2.0/x86_64-native-linuxapp-gcc/4ec513432db04bc2afa739f344a764b0/dpdk/x86_64-native-linuxapp-gcc/include/rte_ring_generic.h:441:22: error: expected expression before ‘)’ token
       (rte_int128_t *)&old_value,
                      ^
/tmp/UB1604_K4.8.0_GCC6.2.0/x86_64-native-linuxapp-gcc/4ec513432db04bc2afa739f344a764b0/dpdk/x86_64-native-linuxapp-gcc/include/rte_ring_generic.h:403:35: warning: variable ‘new_value’ set but not used [-Wunused-but-set-variable]
   struct nb_ring_entry old_value, new_value;
                                   ^~~~~~~~~
  SYMLINK-FILE include/rte_efd.h
  CC rte_efd.o
/tmp/UB1604_K4.8.0_GCC6.2.0/x86_64-native-linuxapp-gcc/4ec513432db04bc2afa739f344a764b0/dpdk/mk/internal/rte.compile-pre.mk:114: recipe for target 'rte_mempool.o' failed
make[5]: *** [rte_mempool.o] Error 1
/tmp/UB1604_K4.8.0_GCC6.2.0/x86_64-native-linuxapp-gcc/4ec513432db04bc2afa739f344a764b0/dpdk/mk/rte.subdir.mk:35: recipe for target 'librte_mempool' failed
make[4]: *** [librte_mempool] Error 2
make[4]: *** Waiting for unfinished jobs....
  AR librte_efd.a
  INSTALL-LIB librte_efd.a
/tmp/UB1604_K4.8.0_GCC6.2.0/x86_64-native-linuxapp-gcc/4ec513432db04bc2afa739f344a764b0/dpdk/mk/rte.sdkbuild.mk:49: recipe for target 'lib' failed
make[3]: *** [lib] Error 2
/tmp/UB1604_K4.8.0_GCC6.2.0/x86_64-native-linuxapp-gcc/4ec513432db04bc2afa739f344a764b0/dpdk/mk/rte.sdkroot.mk:100: recipe for target 'all' failed
make[2]: *** [all] Error 2
/tmp/UB1604_K4.8.0_GCC6.2.0/x86_64-native-linuxapp-gcc/4ec513432db04bc2afa739f344a764b0/dpdk/mk/rte.sdkinstall.mk:57: recipe for target 'pre_install' failed
make[1]: *** [pre_install] Error 2
/tmp/UB1604_K4.8.0_GCC6.2.0/x86_64-native-linuxapp-gcc/4ec513432db04bc2afa739f344a764b0/dpdk/mk/rte.sdkroot.mk:79: recipe for target 'install' failed
make: *** [install] Error 2

*Failed Build #3:
OS: CENTOS
Target: x86_64-native-linuxapp-clang
  CC rte_mempool.o
  CC power_pstate_cpufreq.o
In file included from /tmp/CENTOS_K3.10.0_GCC4.8.5/x86_64-native-linuxapp-clang/4ec513432db04bc2afa739f344a764b0/dpdk/lib/librte_mempool/rte_mempool.c:34:
In file included from /tmp/CENTOS_K3.10.0_GCC4.8.5/x86_64-native-linuxapp-clang/4ec513432db04bc2afa739f344a764b0/dpdk/lib/librte_mempool/rte_mempool.h:50:
In file included from /tmp/CENTOS_K3.10.0_GCC4.8.5/x86_64-native-linuxapp-clang/4ec513432db04bc2afa739f344a764b0/dpdk/x86_64-native-linuxapp-clang/include/rte_ring.h:442:
/tmp/CENTOS_K3.10.0_GCC4.8.5/x86_64-native-linuxapp-clang/4ec513432db04bc2afa739f344a764b0/dpdk/x86_64-native-linuxapp-clang/include/rte_ring_generic.h:440:7: warning: implicit declaration of function 'rte_atomic128_cmpset' is invalid in C99 [-Wimplicit-function-declaration]
                if (rte_atomic128_cmpset((volatile rte_int128_t *)ring_ptr,
                    ^
/tmp/CENTOS_K3.10.0_GCC4.8.5/x86_64-native-linuxapp-clang/4ec513432db04bc2afa739f344a764b0/dpdk/x86_64-native-linuxapp-clang/include/rte_ring_generic.h:440:38: error: unknown type name 'rte_int128_t'; did you mean '__int128_t'?
                if (rte_atomic128_cmpset((volatile rte_int128_t *)ring_ptr,
                                                   ^~~~~~~~~~~~
                                                   __int128_t
note: '__int128_t' declared here
/tmp/CENTOS_K3.10.0_GCC4.8.5/x86_64-native-linuxapp-clang/4ec513432db04bc2afa739f344a764b0/dpdk/x86_64-native-linuxapp-clang/include/rte_ring_generic.h:441:8: error: use of undeclared identifier 'rte_int128_t'; did you mean '__int128_t'?
                                         (rte_int128_t *)&old_value,
                                          ^
note: '__int128_t' declared here
/tmp/CENTOS_K3.10.0_GCC4.8.5/x86_64-native-linuxapp-clang/4ec513432db04bc2afa739f344a764b0/dpdk/x86_64-native-linuxapp-clang/include/rte_ring_generic.h:441:22: error: expected expression
                                         (rte_int128_t *)&old_value,
                                                        ^
1 warning and 3 errors generated.
make[5]: *** [rte_mempool.o] Error 1
make[4]: *** [librte_mempool] Error 2
make[4]: *** Waiting for unfinished jobs....
  AR librte_power.a
  INSTALL-LIB librte_power.a

*Failed Build #4:
OS: UB1604
Target: x86_64-native-linuxapp-clang
  CC rte_mempool.o
  CC power_pstate_cpufreq.o
In file included from /tmp/UB1604_K4.4.0_GCC5.4.0/x86_64-native-linuxapp-clang/4ec513432db04bc2afa739f344a764b0/dpdk/lib/librte_mempool/rte_mempool.c:34:
In file included from /tmp/UB1604_K4.4.0_GCC5.4.0/x86_64-native-linuxapp-clang/4ec513432db04bc2afa739f344a764b0/dpdk/lib/librte_mempool/rte_mempool.h:50:
In file included from /tmp/UB1604_K4.4.0_GCC5.4.0/x86_64-native-linuxapp-clang/4ec513432db04bc2afa739f344a764b0/dpdk/x86_64-native-linuxapp-clang/include/rte_ring.h:442:
/tmp/UB1604_K4.4.0_GCC5.4.0/x86_64-native-linuxapp-clang/4ec513432db04bc2afa739f344a764b0/dpdk/x86_64-native-linuxapp-clang/include/rte_ring_generic.h:440:7: warning: implicit declaration of function 'rte_atomic128_cmpset' is invalid in C99 [-Wimplicit-function-declaration]
  AR librte_power.a
  INSTALL-LIB librte_power.a
== Build lib/librte_efd
                if (rte_atomic128_cmpset((volatile rte_int128_t *)ring_ptr,
                    ^
  SYMLINK-FILE include/rte_efd.h
  CC rte_efd.o
/tmp/UB1604_K4.4.0_GCC5.4.0/x86_64-native-linuxapp-clang/4ec513432db04bc2afa739f344a764b0/dpdk/x86_64-native-linuxapp-clang/include/rte_ring_generic.h:440:38: error: unknown type name 'rte_int128_t'; did you mean '__int128_t'?
                if (rte_atomic128_cmpset((volatile rte_int128_t *)ring_ptr,
                                                   ^~~~~~~~~~~~
                                                   __int128_t
note: '__int128_t' declared here
/tmp/UB1604_K4.4.0_GCC5.4.0/x86_64-native-linuxapp-clang/4ec513432db04bc2afa739f344a764b0/dpdk/x86_64-native-linuxapp-clang/include/rte_ring_generic.h:441:22: error: expected expression
                                         (rte_int128_t *)&old_value,
                                                        ^
  AR librte_efd.a
  INSTALL-LIB librte_efd.a
  CC rte_mempool_ops.o
In file included from /tmp/UB1604_K4.4.0_GCC5.4.0/x86_64-native-linuxapp-clang/4ec513432db04bc2afa739f344a764b0/dpdk/lib/librte_mempool/rte_mempool_ops.c:9:
In file included from /tmp/UB1604_K4.4.0_GCC5.4.0/x86_64-native-linuxapp-clang/4ec513432db04bc2afa739f344a764b0/dpdk/x86_64-native-linuxapp-clang/include/rte_mempool.h:50:
In file included from /tmp/UB1604_K4.4.0_GCC5.4.0/x86_64-native-linuxapp-clang/4ec513432db04bc2afa739f344a764b0/dpdk/x86_64-native-linuxapp-clang/include/rte_ring.h:442:
/tmp/UB1604_K4.4.0_GCC5.4.0/x86_64-native-linuxapp-clang/4ec513432db04bc2afa739f344a764b0/dpdk/x86_64-native-linuxapp-clang/include/rte_ring_generic.h:440:7: warning: implicit declaration of function 'rte_atomic128_cmpset' is invalid in C99 [-Wimplicit-function-declaration]
                if (rte_atomic128_cmpset((volatile rte_int128_t *)ring_ptr,
                    ^
/tmp/UB1604_K4.4.0_GCC5.4.0/x86_64-native-linuxapp-clang/4ec513432db04bc2afa739f344a764b0/dpdk/x86_64-native-linuxapp-clang/include/rte_ring_generic.h:440:38: error: unknown type name 'rte_int128_t'; did you mean '__int128_t'?
                if (rte_atomic128_cmpset((volatile rte_int128_t *)ring_ptr,
                                                   ^~~~~~~~~~~~
                                                   __int128_t
note: '__int128_t' declared here
/tmp/UB1604_K4.4.0_GCC5.4.0/x86_64-native-linuxapp-clang/4ec513432db04bc2afa739f344a764b0/dpdk/x86_64-native-linuxapp-clang/include/rte_ring_generic.h:441:22: error: expected expression
                                         (rte_int128_t *)&old_value,
                                                        ^
/tmp/UB1604_K4.4.0_GCC5.4.0/x86_64-native-linuxapp-clang/4ec513432db04bc2afa739f344a764b0/dpdk/x86_64-native-linuxapp-clang/include/rte_ring_generic.h/tmp/UB1604_K4.4.0_GCC5.4.0/x86_64-native-linuxapp-clang/4ec513432db04bc2afa739f344a764b0/dpdk/x86_64-native-linuxapp-clang/include/rte_ring_generic.h::441441::88: : errorerror: : use of undeclared identifier 'rte_int128_t'use of undeclared identifier 'rte_int128_t'

                                         (rte_int128_t *)&old_value,
                                          ^
                                         (rte_int128_t *)&old_value,
                                          ^
/tmp/UB1604_K4.4.0_GCC5.4.0/x86_64-native-linuxapp-clang/4ec513432db04bc2afa739f344a764b0/dpdk/x86_64-native-linuxapp-clang/include/rte_ring_generic.h:442:22: error: expected expression
                                         (rte_int128_t *)&new_value,
                                                        ^
/tmp/UB1604_K4.4.0_GCC5.4.0/x86_64-native-linuxapp-clang/4ec513432db04bc2afa739f344a764b0/dpdk/x86_64-native-linuxapp-clang/include/rte_ring_generic.h:442:8: error: use of undeclared identifier 'rte_int128_t'
                                         (rte_int128_t *)&new_value,
                                          ^
/tmp/UB1604_K4.4.0_GCC5.4.0/x86_64-native-linuxapp-clang/4ec513432db04bc2afa739f344a764b0/dpdk/x86_64-native-linuxapp-clang/include/rte_ring_generic.h:442:22: error: expected expression
                                         (rte_int128_t *)&new_value,
                                                        ^
/tmp/UB1604_K4.4.0_GCC5.4.0/x86_64-native-linuxapp-clang/4ec513432db04bc2afa739f344a764b0/dpdk/x86_64-native-linuxapp-clang/include/rte_ring_generic.h:442:8: error: use of undeclared identifier 'rte_int128_t'
                                         (rte_int128_t *)&new_value,
                                          ^
/tmp/UB1604_K4.4.0_GCC5.4.0/x86_64-native-linuxapp-clang/4ec513432db04bc2afa739f344a764b0/dpdk/x86_64-native-linuxapp-clang/include/rte_ring_generic.h:443:10: error: use of undeclared identifier 'RTE_ATOMIC_RELAXED'
                                         0, RTE_ATOMIC_RELAXED,
                                            ^
/tmp/UB1604_K4.4.0_GCC5.4.0/x86_64-native-linuxapp-clang/4ec513432db04bc2afa739f344a764b0/dpdk/x86_64-native-linuxapp-clang/include/rte_ring_generic.h:444:7: error: use of undeclared identifier 'RTE_ATOMIC_RELAXED'
                                         RTE_ATOMIC_RELAXED))
                                         ^
/tmp/UB1604_K4.4.0_GCC5.4.0/x86_64-native-linuxapp-clang/4ec513432db04bc2afa739f344a764b0/dpdk/x86_64-native-linuxapp-clang/include/rte_ring_generic.h:443:10: error: use of undeclared identifier 'RTE_ATOMIC_RELAXED'
                                         0, RTE_ATOMIC_RELAXED,
                                            ^
/tmp/UB1604_K4.4.0_GCC5.4.0/x86_64-native-linuxapp-clang/4ec513432db04bc2afa739f344a764b0/dpdk/x86_64-native-linuxapp-clang/include/rte_ring_generic.h:444:7: error: use of undeclared identifier 'RTE_ATOMIC_RELAXED'
                                         RTE_ATOMIC_RELAXED))
                                         ^
1 warning and 7 errors generated.
/tmp/UB1604_K4.4.0_GCC5.4.0/x86_64-native-linuxapp-clang/4ec513432db04bc2afa739f344a764b0/dpdk/mk/internal/rte.compile-pre.mk:114: recipe for target 'rte_mempool_ops.o' failed
make[5]: *** [rte_mempool_ops.o] Error 1
make[5]: *** Waiting for unfinished jobs....
== Build lib/librte_lpm
1 warning and 7 errors generated.
/tmp/UB1604_K4.4.0_GCC5.4.0/x86_64-native-linuxapp-clang/4ec513432db04bc2afa739f344a764b0/dpdk/mk/internal/rte.compile-pre.mk:114: recipe for target 'rte_mempool.o' failed
make[5]: *** [rte_mempool.o] Error 1
/tmp/UB1604_K4.4.0_GCC5.4.0/x86_64-native-linuxapp-clang/4ec513432db04bc2afa739f344a764b0/dpdk/mk/rte.subdir.mk:35: recipe for target 'librte_mempool' failed
make[4]: *** [librte_mempool] Error 2
make[4]: *** Waiting for unfinished jobs....
  SYMLINK-FILE include/rte_lpm.h
  SYMLINK-FILE include/rte_lpm6.h
  SYMLINK-FILE include/rte_lpm_sse.h
  CC rte_lpm.o
  CC rte_lpm6.o
  AR librte_lpm.a
  INSTALL-LIB librte_lpm.a
/tmp/UB1604_K4.4.0_GCC5.4.0/x86_64-native-linuxapp-clang/4ec513432db04bc2afa739f344a764b0/dpdk/mk/rte.sdkbuild.mk:49: recipe for target 'lib' failed
make[3]: *** [lib] Error 2
/tmp/UB1604_K4.4.0_GCC5.4.0/x86_64-native-linuxapp-clang/4ec513432db04bc2afa739f344a764b0/dpdk/mk/rte.sdkroot.mk:100: recipe for target 'all' failed
make[2]: *** [all] Error 2
/tmp/UB1604_K4.4.0_GCC5.4.0/x86_64-native-linuxapp-clang/4ec513432db04bc2afa739f344a764b0/dpdk/mk/rte.sdkinstall.mk:57: recipe for target 'pre_install' failed
make[1]: *** [pre_install] Error 2
/tmp/UB1604_K4.4.0_GCC5.4.0/x86_64-native-linuxapp-clang/4ec513432db04bc2afa739f344a764b0/dpdk/mk/rte.sdkroot.mk:79: recipe for target 'install' failed
make: *** [install] Error 2

*Failed Build #5:
OS: UB1604
Target: x86_64-native-linuxapp-gcc-shared
  CC guest_channel.o
In file included from /tmp/UB1604_K4.4.0_GCC5.4.0/x86_64-native-linuxapp-gcc-shared/4ec513432db04bc2afa739f344a764b0/dpdk/x86_64-native-linuxapp-gcc/include/rte_ring.h:442:0,
                 from /tmp/UB1604_K4.4.0_GCC5.4.0/x86_64-native-linuxapp-gcc-shared/4ec513432db04bc2afa739f344a764b0/dpdk/lib/librte_mempool/rte_mempool.h:50,
                 from /tmp/UB1604_K4.4.0_GCC5.4.0/x86_64-native-linuxapp-gcc-shared/4ec513432db04bc2afa739f344a764b0/dpdk/lib/librte_mempool/rte_mempool.c:34:
/tmp/UB1604_K4.4.0_GCC5.4.0/x86_64-native-linuxapp-gcc-shared/4ec513432db04bc2afa739f344a764b0/dpdk/x86_64-native-linuxapp-gcc/include/rte_ring_generic.h: In function ‘__rte_ring_do_nb_enqueue_mp’:
/tmp/UB1604_K4.4.0_GCC5.4.0/x86_64-native-linuxapp-gcc-shared/4ec513432db04bc2afa739f344a764b0/dpdk/x86_64-native-linuxapp-gcc/include/rte_ring_generic.h:440:7: warning: implicit declaration of function ‘rte_atomic128_cmpset’ [-Wimplicit-function-declaration]
   if (rte_atomic128_cmpset((volatile rte_int128_t *)ring_ptr,
       ^
/tmp/UB1604_K4.4.0_GCC5.4.0/x86_64-native-linuxapp-gcc-shared/4ec513432db04bc2afa739f344a764b0/dpdk/x86_64-native-linuxapp-gcc/include/rte_ring_generic.h:440:3: warning: nested extern declaration of ‘rte_atomic128_cmpset’ [-Wnested-externs]
   if (rte_atomic128_cmpset((volatile rte_int128_t *)ring_ptr,
   ^
/tmp/UB1604_K4.4.0_GCC5.4.0/x86_64-native-linuxapp-gcc-shared/4ec513432db04bc2afa739f344a764b0/dpdk/x86_64-native-linuxapp-gcc/include/rte_ring_generic.h:440:38: error: unknown type name ‘rte_int128_t’
   if (rte_atomic128_cmpset((volatile rte_int128_t *)ring_ptr,
                                      ^
/tmp/UB1604_K4.4.0_GCC5.4.0/x86_64-native-linuxapp-gcc-shared/4ec513432db04bc2afa739f344a764b0/dpdk/x86_64-native-linuxapp-gcc/include/rte_ring_generic.h:441:8: error: ‘rte_int128_t’ undeclared (first use in this function)
       (rte_int128_t *)&old_value,
        ^
/tmp/UB1604_K4.4.0_GCC5.4.0/x86_64-native-linuxapp-gcc-shared/4ec513432db04bc2afa739f344a764b0/dpdk/x86_64-native-linuxapp-gcc/include/rte_ring_generic.h:441:8: note: each undeclared identifier is reported only once for each function it appears in
/tmp/UB1604_K4.4.0_GCC5.4.0/x86_64-native-linuxapp-gcc-shared/4ec513432db04bc2afa739f344a764b0/dpdk/x86_64-native-linuxapp-gcc/include/rte_ring_generic.h:441:22: error: expected expression before ‘)’ token
       (rte_int128_t *)&old_value,
                      ^
/tmp/UB1604_K4.4.0_GCC5.4.0/x86_64-native-linuxapp-gcc-shared/4ec513432db04bc2afa739f344a764b0/dpdk/x86_64-native-linuxapp-gcc/include/rte_ring_generic.h:403:35: warning: variable ‘new_value’ set but not used [-Wunused-but-set-variable]
   struct nb_ring_entry old_value, new_value;
                                   ^
  CC rte_power_empty_poll.o
/tmp/UB1604_K4.4.0_GCC5.4.0/x86_64-native-linuxapp-gcc-shared/4ec513432db04bc2afa739f344a764b0/dpdk/mk/internal/rte.compile-pre.mk:114: recipe for target 'rte_mempool.o' failed
make[5]: *** [rte_mempool.o] Error 1
/tmp/UB1604_K4.4.0_GCC5.4.0/x86_64-native-linuxapp-gcc-shared/4ec513432db04bc2afa739f344a764b0/dpdk/mk/rte.subdir.mk:35: recipe for target 'librte_mempool' failed
make[4]: *** [librte_mempool] Error 2
make[4]: *** Waiting for unfinished jobs....
  CC power_pstate_cpufreq.o
  LD librte_power.so.1.1
  INSTALL-LIB librte_power.so.1.1
/tmp/UB1604_K4.4.0_GCC5.4.0/x86_64-native-linuxapp-gcc-shared/4ec513432db04bc2afa739f344a764b0/dpdk/mk/rte.sdkbuild.mk:49: recipe for target 'lib' failed
make[3]: *** [lib] Error 2
/tmp/UB1604_K4.4.0_GCC5.4.0/x86_64-native-linuxapp-gcc-shared/4ec513432db04bc2afa739f344a764b0/dpdk/mk/rte.sdkroot.mk:100: recipe for target 'all' failed
make[2]: *** [all] Error 2
/tmp/UB1604_K4.4.0_GCC5.4.0/x86_64-native-linuxapp-gcc-shared/4ec513432db04bc2afa739f344a764b0/dpdk/mk/rte.sdkinstall.mk:57: recipe for target 'pre_install' failed
make[1]: *** [pre_install] Error 2
/tmp/UB1604_K4.4.0_GCC5.4.0/x86_64-native-linuxapp-gcc-shared/4ec513432db04bc2afa739f344a764b0/dpdk/mk/rte.sdkroot.mk:79: recipe for target 'install' failed
make: *** [install] Error 2

*Failed Build #6:
OS: CENTOS
Target: x86_64-native-linuxapp-gcc-shared
  CC power_acpi_cpufreq.o
In file included from /tmp/CENTOS_K3.10.0_GCC4.8.5/x86_64-native-linuxapp-gcc-shared/4ec513432db04bc2afa739f344a764b0/dpdk/x86_64-native-linuxapp-gcc/include/rte_ring.h:442:0,
                 from /tmp/CENTOS_K3.10.0_GCC4.8.5/x86_64-native-linuxapp-gcc-shared/4ec513432db04bc2afa739f344a764b0/dpdk/lib/librte_mempool/rte_mempool.h:50,
                 from /tmp/CENTOS_K3.10.0_GCC4.8.5/x86_64-native-linuxapp-gcc-shared/4ec513432db04bc2afa739f344a764b0/dpdk/lib/librte_mempool/rte_mempool.c:34:
/tmp/CENTOS_K3.10.0_GCC4.8.5/x86_64-native-linuxapp-gcc-shared/4ec513432db04bc2afa739f344a764b0/dpdk/x86_64-native-linuxapp-gcc/include/rte_ring_generic.h: In function ‘__rte_ring_do_nb_enqueue_mp’:
/tmp/CENTOS_K3.10.0_GCC4.8.5/x86_64-native-linuxapp-gcc-shared/4ec513432db04bc2afa739f344a764b0/dpdk/x86_64-native-linuxapp-gcc/include/rte_ring_generic.h:440:3: warning: implicit declaration of function ‘rte_atomic128_cmpset’ [-Wimplicit-function-declaration]
   if (rte_atomic128_cmpset((volatile rte_int128_t *)ring_ptr,
   ^
/tmp/CENTOS_K3.10.0_GCC4.8.5/x86_64-native-linuxapp-gcc-shared/4ec513432db04bc2afa739f344a764b0/dpdk/x86_64-native-linuxapp-gcc/include/rte_ring_generic.h:440:3: warning: nested extern declaration of ‘rte_atomic128_cmpset’ [-Wnested-externs]
/tmp/CENTOS_K3.10.0_GCC4.8.5/x86_64-native-linuxapp-gcc-shared/4ec513432db04bc2afa739f344a764b0/dpdk/x86_64-native-linuxapp-gcc/include/rte_ring_generic.h:440:3: error: unknown type name ‘rte_int128_t’
/tmp/CENTOS_K3.10.0_GCC4.8.5/x86_64-native-linuxapp-gcc-shared/4ec513432db04bc2afa739f344a764b0/dpdk/x86_64-native-linuxapp-gcc/include/rte_ring_generic.h:441:8: error: ‘rte_int128_t’ undeclared (first use in this function)
       (rte_int128_t *)&old_value,
        ^
/tmp/CENTOS_K3.10.0_GCC4.8.5/x86_64-native-linuxapp-gcc-shared/4ec513432db04bc2afa739f344a764b0/dpdk/x86_64-native-linuxapp-gcc/include/rte_ring_generic.h:441:8: note: each undeclared identifier is reported only once for each function it appears in
/tmp/CENTOS_K3.10.0_GCC4.8.5/x86_64-native-linuxapp-gcc-shared/4ec513432db04bc2afa739f344a764b0/dpdk/x86_64-native-linuxapp-gcc/include/rte_ring_generic.h:441:22: error: expected expression before ‘)’ token
       (rte_int128_t *)&old_value,
                      ^
/tmp/CENTOS_K3.10.0_GCC4.8.5/x86_64-native-linuxapp-gcc-shared/4ec513432db04bc2afa739f344a764b0/dpdk/x86_64-native-linuxapp-gcc/include/rte_ring_generic.h:403:35: warning: variable ‘new_value’ set but not used [-Wunused-but-set-variable]
   struct nb_ring_entry old_value, new_value;
                                   ^
make[5]: *** [rte_mempool.o] Error 1
make[4]: *** [librte_mempool] Error 2
make[4]: *** Waiting for unfinished jobs....

*Failed Build #7:
OS: CENTOS
Target: x86_64-native-linuxapp-gcc
  CC power_acpi_cpufreq.o
In file included from /tmp/CENTOS_K3.10.0_GCC4.8.5/x86_64-native-linuxapp-gcc/4ec513432db04bc2afa739f344a764b0/dpdk/x86_64-native-linuxapp-gcc/include/rte_ring.h:442:0,
                 from /tmp/CENTOS_K3.10.0_GCC4.8.5/x86_64-native-linuxapp-gcc/4ec513432db04bc2afa739f344a764b0/dpdk/lib/librte_mempool/rte_mempool.h:50,
                 from /tmp/CENTOS_K3.10.0_GCC4.8.5/x86_64-native-linuxapp-gcc/4ec513432db04bc2afa739f344a764b0/dpdk/lib/librte_mempool/rte_mempool.c:34:
/tmp/CENTOS_K3.10.0_GCC4.8.5/x86_64-native-linuxapp-gcc/4ec513432db04bc2afa739f344a764b0/dpdk/x86_64-native-linuxapp-gcc/include/rte_ring_generic.h: In function ‘__rte_ring_do_nb_enqueue_mp’:
/tmp/CENTOS_K3.10.0_GCC4.8.5/x86_64-native-linuxapp-gcc/4ec513432db04bc2afa739f344a764b0/dpdk/x86_64-native-linuxapp-gcc/include/rte_ring_generic.h:440:3: warning: implicit declaration of function ‘rte_atomic128_cmpset’ [-Wimplicit-function-declaration]
   if (rte_atomic128_cmpset((volatile rte_int128_t *)ring_ptr,
   ^
/tmp/CENTOS_K3.10.0_GCC4.8.5/x86_64-native-linuxapp-gcc/4ec513432db04bc2afa739f344a764b0/dpdk/x86_64-native-linuxapp-gcc/include/rte_ring_generic.h:440:3: warning: nested extern declaration of ‘rte_atomic128_cmpset’ [-Wnested-externs]
/tmp/CENTOS_K3.10.0_GCC4.8.5/x86_64-native-linuxapp-gcc/4ec513432db04bc2afa739f344a764b0/dpdk/x86_64-native-linuxapp-gcc/include/rte_ring_generic.h:440:3: error: unknown type name ‘rte_int128_t’
/tmp/CENTOS_K3.10.0_GCC4.8.5/x86_64-native-linuxapp-gcc/4ec513432db04bc2afa739f344a764b0/dpdk/x86_64-native-linuxapp-gcc/include/rte_ring_generic.h:441:8: error: ‘rte_int128_t’ undeclared (first use in this function)
       (rte_int128_t *)&old_value,
        ^
/tmp/CENTOS_K3.10.0_GCC4.8.5/x86_64-native-linuxapp-gcc/4ec513432db04bc2afa739f344a764b0/dpdk/x86_64-native-linuxapp-gcc/include/rte_ring_generic.h:441:8: note: each undeclared identifier is reported only once for each function it appears in
/tmp/CENTOS_K3.10.0_GCC4.8.5/x86_64-native-linuxapp-gcc/4ec513432db04bc2afa739f344a764b0/dpdk/x86_64-native-linuxapp-gcc/include/rte_ring_generic.h:441:22: error: expected expression before ‘)’ token
       (rte_int128_t *)&old_value,
                      ^
/tmp/CENTOS_K3.10.0_GCC4.8.5/x86_64-native-linuxapp-gcc/4ec513432db04bc2afa739f344a764b0/dpdk/x86_64-native-linuxapp-gcc/include/rte_ring_generic.h:403:35: warning: variable ‘new_value’ set but not used [-Wunused-but-set-variable]
   struct nb_ring_entry old_value, new_value;
                                   ^
make[5]: *** [rte_mempool.o] Error 1
make[4]: *** [librte_mempool] Error 2
make[4]: *** Waiting for unfinished jobs....

*Failed Build #8:
OS: FC25
Target: x86_64-native-linuxapp-gcc-debug
  CC rte_mempool.o
In file included from /tmp/FC25_K4.8.6_GCC6.3.1/x86_64-native-linuxapp-gcc-debug/4ec513432db04bc2afa739f344a764b0/dpdk/x86_64-native-linuxapp-gcc/include/rte_ring.h:442:0,
                 from /tmp/FC25_K4.8.6_GCC6.3.1/x86_64-native-linuxapp-gcc-debug/4ec513432db04bc2afa739f344a764b0/dpdk/lib/librte_mempool/rte_mempool.h:50,
                 from /tmp/FC25_K4.8.6_GCC6.3.1/x86_64-native-linuxapp-gcc-debug/4ec513432db04bc2afa739f344a764b0/dpdk/lib/librte_mempool/rte_mempool.c:34:
/tmp/FC25_K4.8.6_GCC6.3.1/x86_64-native-linuxapp-gcc-debug/4ec513432db04bc2afa739f344a764b0/dpdk/x86_64-native-linuxapp-gcc/include/rte_ring_generic.h: In function ‘__rte_ring_do_nb_enqueue_mp’:
/tmp/FC25_K4.8.6_GCC6.3.1/x86_64-native-linuxapp-gcc-debug/4ec513432db04bc2afa739f344a764b0/dpdk/x86_64-native-linuxapp-gcc/include/rte_ring_generic.h:440:7: warning: implicit declaration of function ‘rte_atomic128_cmpset’ [-Wimplicit-function-declaration]
   if (rte_atomic128_cmpset((volatile rte_int128_t *)ring_ptr,
       ^~~~~~~~~~~~~~~~~~~~
/tmp/FC25_K4.8.6_GCC6.3.1/x86_64-native-linuxapp-gcc-debug/4ec513432db04bc2afa739f344a764b0/dpdk/x86_64-native-linuxapp-gcc/include/rte_ring_generic.h:440:3: warning: nested extern declaration of ‘rte_atomic128_cmpset’ [-Wnested-externs]
   if (rte_atomic128_cmpset((volatile rte_int128_t *)ring_ptr,
   ^~
/tmp/FC25_K4.8.6_GCC6.3.1/x86_64-native-linuxapp-gcc-debug/4ec513432db04bc2afa739f344a764b0/dpdk/x86_64-native-linuxapp-gcc/include/rte_ring_generic.h:440:38: error: unknown type name ‘rte_int128_t’
   if (rte_atomic128_cmpset((volatile rte_int128_t *)ring_ptr,
                                      ^~~~~~~~~~~~
/tmp/FC25_K4.8.6_GCC6.3.1/x86_64-native-linuxapp-gcc-debug/4ec513432db04bc2afa739f344a764b0/dpdk/x86_64-native-linuxapp-gcc/include/rte_ring_generic.h:441:8: error: ‘rte_int128_t’ undeclared (first use in this function)
       (rte_int128_t *)&old_value,
        ^~~~~~~~~~~~
/tmp/FC25_K4.8.6_GCC6.3.1/x86_64-native-linuxapp-gcc-debug/4ec513432db04bc2afa739f344a764b0/dpdk/x86_64-native-linuxapp-gcc/include/rte_ring_generic.h:441:8: note: each undeclared identifier is reported only once for each function it appears in
/tmp/FC25_K4.8.6_GCC6.3.1/x86_64-native-linuxapp-gcc-debug/4ec513432db04bc2afa739f344a764b0/dpdk/x86_64-native-linuxapp-gcc/include/rte_ring_generic.h:441:22: error: expected expression before ‘)’ token
       (rte_int128_t *)&old_value,
                      ^
/tmp/FC25_K4.8.6_GCC6.3.1/x86_64-native-linuxapp-gcc-debug/4ec513432db04bc2afa739f344a764b0/dpdk/x86_64-native-linuxapp-gcc/include/rte_ring_generic.h:403:35: warning: variable ‘new_value’ set but not used [-Wunused-but-set-variable]
   struct nb_ring_entry old_value, new_value;
                                   ^~~~~~~~~
  SYMLINK-FILE include/rte_efd.h
  CC rte_efd.o
/tmp/FC25_K4.8.6_GCC6.3.1/x86_64-native-linuxapp-gcc-debug/4ec513432db04bc2afa739f344a764b0/dpdk/mk/internal/rte.compile-pre.mk:114: recipe for target 'rte_mempool.o' failed
make[5]: *** [rte_mempool.o] Error 1
/tmp/FC25_K4.8.6_GCC6.3.1/x86_64-native-linuxapp-gcc-debug/4ec513432db04bc2afa739f344a764b0/dpdk/mk/rte.subdir.mk:35: recipe for target 'librte_mempool' failed
make[4]: *** [librte_mempool] Error 2
make[4]: *** Waiting for unfinished jobs....
  AR librte_efd.a
  INSTALL-LIB librte_efd.a
/tmp/FC25_K4.8.6_GCC6.3.1/x86_64-native-linuxapp-gcc-debug/4ec513432db04bc2afa739f344a764b0/dpdk/mk/rte.sdkbuild.mk:49: recipe for target 'lib' failed
make[3]: *** [lib] Error 2
/tmp/FC25_K4.8.6_GCC6.3.1/x86_64-native-linuxapp-gcc-debug/4ec513432db04bc2afa739f344a764b0/dpdk/mk/rte.sdkroot.mk:100: recipe for target 'all' failed
make[2]: *** [all] Error 2
/tmp/FC25_K4.8.6_GCC6.3.1/x86_64-native-linuxapp-gcc-debug/4ec513432db04bc2afa739f344a764b0/dpdk/mk/rte.sdkinstall.mk:57: recipe for target 'pre_install' failed
make[1]: *** [pre_install] Error 2
/tmp/FC25_K4.8.6_GCC6.3.1/x86_64-native-linuxapp-gcc-debug/4ec513432db04bc2afa739f344a764b0/dpdk/mk/rte.sdkroot.mk:79: recipe for target 'install' failed
make: *** [install] Error 2

*Failed Build #9:
OS: FreeBSD
Target: x86_64-native-bsdapp-clang
  SYMLINK-FILE include/rte_efd.h
  CC rte_efd.o
In file included from /tmp/FreeBSD_K10.3_GCC4.8.5/x86_64-native-bsdapp-clang/4ec513432db04bc2afa739f344a764b0/dpdk/lib/librte_mempool/rte_mempool.c:34:
In file included from /tmp/FreeBSD_K10.3_GCC4.8.5/x86_64-native-bsdapp-clang/4ec513432db04bc2afa739f344a764b0/dpdk/lib/librte_mempool/rte_mempool.h:50:
In file included from /tmp/FreeBSD_K10.3_GCC4.8.5/x86_64-native-bsdapp-clang/4ec513432db04bc2afa739f344a764b0/dpdk/x86_64-native-bsdapp-clang/include/rte_ring.h:442:
/tmp/FreeBSD_K10.3_GCC4.8.5/x86_64-native-bsdapp-clang/4ec513432db04bc2afa739f344a764b0/dpdk/x86_64-native-bsdapp-clang/include/rte_ring_generic.h:440:7: warning: implicit declaration of function 'rte_atomic128_cmpset' is invalid in C99 [-Wimplicit-function-declaration]
                if (rte_atomic128_cmpset((volatile rte_int128_t *)ring_ptr,
                    ^
/tmp/FreeBSD_K10.3_GCC4.8.5/x86_64-native-bsdapp-clang/4ec513432db04bc2afa739f344a764b0/dpdk/x86_64-native-bsdapp-clang/include/rte_ring_generic.h:440:38: error: unknown type name 'rte_int128_t'; did you mean '__int128_t'?
                if (rte_atomic128_cmpset((volatile rte_int128_t *)ring_ptr,
                                                   ^~~~~~~~~~~~
                                                   __int128_t
note: '__int128_t' declared here
/tmp/FreeBSD_K10.3_GCC4.8.5/x86_64-native-bsdapp-clang/4ec513432db04bc2afa739f344a764b0/dpdk/x86_64-native-bsdapp-clang/include/rte_ring_generic.h:441:8: error: use of undeclared identifier 'rte_int128_t'; did you mean '__int128_t'?
                                         (rte_int128_t *)&old_value,
                                          ^
note: '__int128_t' declared here
/tmp/FreeBSD_K10.3_GCC4.8.5/x86_64-native-bsdapp-clang/4ec513432db04bc2afa739f344a764b0/dpdk/x86_64-native-bsdapp-clang/include/rte_ring_generic.h:441:22: error: expected expression
                                         (rte_int128_t *)&old_value,
                                                        ^
1 warning and 3 errors generated.
gmake[5]: *** [/tmp/FreeBSD_K10.3_GCC4.8.5/x86_64-native-bsdapp-clang/4ec513432db04bc2afa739f344a764b0/dpdk/mk/internal/rte.compile-pre.mk:116: rte_mempool.o] Error 1
gmake[4]: *** [/tmp/FreeBSD_K10.3_GCC4.8.5/x86_64-native-bsdapp-clang/4ec513432db04bc2afa739f344a764b0/dpdk/mk/rte.subdir.mk:37: librte_mempool] Error 2
gmake[4]: *** Waiting for unfinished jobs....
  AR librte_efd.a
  INSTALL-LIB librte_efd.a

*Failed Build #10:
OS: FC24
Target: x86_64-native-linuxapp-clang
  SYMLINK-FILE include/rte_mempool.h
  CC rte_mempool.o
In file included from /tmp/FC24_K4.9.13_GCC6.2.1/x86_64-native-linuxapp-clang/4ec513432db04bc2afa739f344a764b0/dpdk/lib/librte_mempool/rte_mempool.c:34:
In file included from /tmp/FC24_K4.9.13_GCC6.2.1/x86_64-native-linuxapp-clang/4ec513432db04bc2afa739f344a764b0/dpdk/lib/librte_mempool/rte_mempool.h:50:
In file included from /tmp/FC24_K4.9.13_GCC6.2.1/x86_64-native-linuxapp-clang/4ec513432db04bc2afa739f344a764b0/dpdk/x86_64-native-linuxapp-clang/include/rte_ring.h:442:
/tmp/FC24_K4.9.13_GCC6.2.1/x86_64-native-linuxapp-clang/4ec513432db04bc2afa739f344a764b0/dpdk/x86_64-native-linuxapp-clang/include/rte_ring_generic.h:440:7: warning: implicit declaration of function 'rte_atomic128_cmpset' is invalid in C99 [-Wimplicit-function-declaration]
                if (rte_atomic128_cmpset((volatile rte_int128_t *)ring_ptr,
                    ^
  AR librte_power.a
  INSTALL-LIB librte_power.a
== Build lib/librte_efd
/tmp/FC24_K4.9.13_GCC6.2.1/x86_64-native-linuxapp-clang/4ec513432db04bc2afa739f344a764b0/dpdk/x86_64-native-linuxapp-clang/include/rte_ring_generic.h:440:38: error: unknown type name 'rte_int128_t'; did you mean '__int128_t'?
                if (rte_atomic128_cmpset((volatile rte_int128_t *)ring_ptr,
                                                   ^~~~~~~~~~~~
                                                   __int128_t
note: '__int128_t' declared here
/tmp/FC24_K4.9.13_GCC6.2.1/x86_64-native-linuxapp-clang/4ec513432db04bc2afa739f344a764b0/dpdk/x86_64-native-linuxapp-clang/include/rte_ring_generic.h:441:22: error: expected expression
                                         (rte_int128_t *)&old_value,
                                                        ^
/tmp/FC24_K4.9.13_GCC6.2.1/x86_64-native-linuxapp-clang/4ec513432db04bc2afa739f344a764b0/dpdk/x86_64-native-linuxapp-clang/include/rte_ring_generic.h:441:8: error: use of undeclared identifier 'rte_int128_t'
                                         (rte_int128_t *)&old_value,
                                          ^
/tmp/FC24_K4.9.13_GCC6.2.1/x86_64-native-linuxapp-clang/4ec513432db04bc2afa739f344a764b0/dpdk/x86_64-native-linuxapp-clang/include/rte_ring_generic.h:442:22: error: expected expression
                                         (rte_int128_t *)&new_value,
                                                        ^
/tmp/FC24_K4.9.13_GCC6.2.1/x86_64-native-linuxapp-clang/4ec513432db04bc2afa739f344a764b0/dpdk/x86_64-native-linuxapp-clang/include/rte_ring_generic.h:442:8: error: use of undeclared identifier 'rte_int128_t'
                                         (rte_int128_t *)&new_value,
                                          ^
/tmp/FC24_K4.9.13_GCC6.2.1/x86_64-native-linuxapp-clang/4ec513432db04bc2afa739f344a764b0/dpdk/x86_64-native-linuxapp-clang/include/rte_ring_generic.h:443:10: error: use of undeclared identifier 'RTE_ATOMIC_RELAXED'
                                         0, RTE_ATOMIC_RELAXED,
                                            ^
/tmp/FC24_K4.9.13_GCC6.2.1/x86_64-native-linuxapp-clang/4ec513432db04bc2afa739f344a764b0/dpdk/x86_64-native-linuxapp-clang/include/rte_ring_generic.h:444:7: error: use of undeclared identifier 'RTE_ATOMIC_RELAXED'
                                         RTE_ATOMIC_RELAXED))
                                         ^
  SYMLINK-FILE include/rte_efd.h
  CC rte_efd.o
1 warning and 7 errors generated.
/tmp/FC24_K4.9.13_GCC6.2.1/x86_64-native-linuxapp-clang/4ec513432db04bc2afa739f344a764b0/dpdk/mk/internal/rte.compile-pre.mk:114: recipe for target 'rte_mempool.o' failed
make[5]: *** [rte_mempool.o] Error 1
/tmp/FC24_K4.9.13_GCC6.2.1/x86_64-native-linuxapp-clang/4ec513432db04bc2afa739f344a764b0/dpdk/mk/rte.subdir.mk:35: recipe for target 'librte_mempool' failed
make[4]: *** [librte_mempool] Error 2
make[4]: *** Waiting for unfinished jobs....
  AR librte_efd.a
  INSTALL-LIB librte_efd.a
/tmp/FC24_K4.9.13_GCC6.2.1/x86_64-native-linuxapp-clang/4ec513432db04bc2afa739f344a764b0/dpdk/mk/rte.sdkbuild.mk:49: recipe for target 'lib' failed
make[3]: *** [lib] Error 2
/tmp/FC24_K4.9.13_GCC6.2.1/x86_64-native-linuxapp-clang/4ec513432db04bc2afa739f344a764b0/dpdk/mk/rte.sdkroot.mk:100: recipe for target 'all' failed
make[2]: *** [all] Error 2
/tmp/FC24_K4.9.13_GCC6.2.1/x86_64-native-linuxapp-clang/4ec513432db04bc2afa739f344a764b0/dpdk/mk/rte.sdkinstall.mk:57: recipe for target 'pre_install' failed
make[1]: *** [pre_install] Error 2
/tmp/FC24_K4.9.13_GCC6.2.1/x86_64-native-linuxapp-clang/4ec513432db04bc2afa739f344a764b0/dpdk/mk/rte.sdkroot.mk:79: recipe for target 'install' failed
make: *** [install] Error 2

*Failed Build #11:
OS: FC24
Target: x86_64-native-linuxapp-gcc-shared
  CC rte_efd.o
In file included from /tmp/FC24_K4.9.13_GCC6.2.1/x86_64-native-linuxapp-gcc-shared/4ec513432db04bc2afa739f344a764b0/dpdk/x86_64-native-linuxapp-gcc/include/rte_ring.h:442:0,
                 from /tmp/FC24_K4.9.13_GCC6.2.1/x86_64-native-linuxapp-gcc-shared/4ec513432db04bc2afa739f344a764b0/dpdk/lib/librte_mempool/rte_mempool.h:50,
                 from /tmp/FC24_K4.9.13_GCC6.2.1/x86_64-native-linuxapp-gcc-shared/4ec513432db04bc2afa739f344a764b0/dpdk/lib/librte_mempool/rte_mempool.c:34:
/tmp/FC24_K4.9.13_GCC6.2.1/x86_64-native-linuxapp-gcc-shared/4ec513432db04bc2afa739f344a764b0/dpdk/x86_64-native-linuxapp-gcc/include/rte_ring_generic.h: In function ‘__rte_ring_do_nb_enqueue_mp’:
/tmp/FC24_K4.9.13_GCC6.2.1/x86_64-native-linuxapp-gcc-shared/4ec513432db04bc2afa739f344a764b0/dpdk/x86_64-native-linuxapp-gcc/include/rte_ring_generic.h:440:7: warning: implicit declaration of function ‘rte_atomic128_cmpset’ [-Wimplicit-function-declaration]
   if (rte_atomic128_cmpset((volatile rte_int128_t *)ring_ptr,
       ^~~~~~~~~~~~~~~~~~~~
/tmp/FC24_K4.9.13_GCC6.2.1/x86_64-native-linuxapp-gcc-shared/4ec513432db04bc2afa739f344a764b0/dpdk/x86_64-native-linuxapp-gcc/include/rte_ring_generic.h:440:3: warning: nested extern declaration of ‘rte_atomic128_cmpset’ [-Wnested-externs]
   if (rte_atomic128_cmpset((volatile rte_int128_t *)ring_ptr,
   ^~
/tmp/FC24_K4.9.13_GCC6.2.1/x86_64-native-linuxapp-gcc-shared/4ec513432db04bc2afa739f344a764b0/dpdk/x86_64-native-linuxapp-gcc/include/rte_ring_generic.h:440:38: error: unknown type name ‘rte_int128_t’
   if (rte_atomic128_cmpset((volatile rte_int128_t *)ring_ptr,
                                      ^~~~~~~~~~~~
/tmp/FC24_K4.9.13_GCC6.2.1/x86_64-native-linuxapp-gcc-shared/4ec513432db04bc2afa739f344a764b0/dpdk/x86_64-native-linuxapp-gcc/include/rte_ring_generic.h:441:8: error: ‘rte_int128_t’ undeclared (first use in this function)
       (rte_int128_t *)&old_value,
        ^~~~~~~~~~~~
/tmp/FC24_K4.9.13_GCC6.2.1/x86_64-native-linuxapp-gcc-shared/4ec513432db04bc2afa739f344a764b0/dpdk/x86_64-native-linuxapp-gcc/include/rte_ring_generic.h:441:8: note: each undeclared identifier is reported only once for each function it appears in
/tmp/FC24_K4.9.13_GCC6.2.1/x86_64-native-linuxapp-gcc-shared/4ec513432db04bc2afa739f344a764b0/dpdk/x86_64-native-linuxapp-gcc/include/rte_ring_generic.h:441:22: error: expected expression before ‘)’ token
       (rte_int128_t *)&old_value,
                      ^
/tmp/FC24_K4.9.13_GCC6.2.1/x86_64-native-linuxapp-gcc-shared/4ec513432db04bc2afa739f344a764b0/dpdk/x86_64-native-linuxapp-gcc/include/rte_ring_generic.h:403:35: warning: variable ‘new_value’ set but not used [-Wunused-but-set-variable]
   struct nb_ring_entry old_value, new_value;
                                   ^~~~~~~~~
/tmp/FC24_K4.9.13_GCC6.2.1/x86_64-native-linuxapp-gcc-shared/4ec513432db04bc2afa739f344a764b0/dpdk/mk/internal/rte.compile-pre.mk:114: recipe for target 'rte_mempool.o' failed
make[5]: *** [rte_mempool.o] Error 1
/tmp/FC24_K4.9.13_GCC6.2.1/x86_64-native-linuxapp-gcc-shared/4ec513432db04bc2afa739f344a764b0/dpdk/mk/rte.subdir.mk:35: recipe for target 'librte_mempool' failed
make[4]: *** [librte_mempool] Error 2
make[4]: *** Waiting for unfinished jobs....
  LD librte_efd.so.1.1
  INSTALL-LIB librte_efd.so.1.1
/tmp/FC24_K4.9.13_GCC6.2.1/x86_64-native-linuxapp-gcc-shared/4ec513432db04bc2afa739f344a764b0/dpdk/mk/rte.sdkbuild.mk:49: recipe for target 'lib' failed
make[3]: *** [lib] Error 2
/tmp/FC24_K4.9.13_GCC6.2.1/x86_64-native-linuxapp-gcc-shared/4ec513432db04bc2afa739f344a764b0/dpdk/mk/rte.sdkroot.mk:100: recipe for target 'all' failed
make[2]: *** [all] Error 2
/tmp/FC24_K4.9.13_GCC6.2.1/x86_64-native-linuxapp-gcc-shared/4ec513432db04bc2afa739f344a764b0/dpdk/mk/rte.sdkinstall.mk:57: recipe for target 'pre_install' failed
make[1]: *** [pre_install] Error 2
/tmp/FC24_K4.9.13_GCC6.2.1/x86_64-native-linuxapp-gcc-shared/4ec513432db04bc2afa739f344a764b0/dpdk/mk/rte.sdkroot.mk:79: recipe for target 'install' failed
make: *** [install] Error 2

*Failed Build #12:
OS: FreeBSD
Target: x86_64-native-bsdapp-gcc
  CC rte_mempool.o
In file included from /tmp/FreeBSD_K10.3_GCC4.8.5/x86_64-native-bsdapp-gcc/4ec513432db04bc2afa739f344a764b0/dpdk/x86_64-native-bsdapp-gcc/include/rte_ring.h:442:0,
                 from /tmp/FreeBSD_K10.3_GCC4.8.5/x86_64-native-bsdapp-gcc/4ec513432db04bc2afa739f344a764b0/dpdk/lib/librte_mempool/rte_mempool.h:50,
                 from /tmp/FreeBSD_K10.3_GCC4.8.5/x86_64-native-bsdapp-gcc/4ec513432db04bc2afa739f344a764b0/dpdk/lib/librte_mempool/rte_mempool.c:34:
/tmp/FreeBSD_K10.3_GCC4.8.5/x86_64-native-bsdapp-gcc/4ec513432db04bc2afa739f344a764b0/dpdk/x86_64-native-bsdapp-gcc/include/rte_ring_generic.h: In function '__rte_ring_do_nb_enqueue_mp':
/tmp/FreeBSD_K10.3_GCC4.8.5/x86_64-native-bsdapp-gcc/4ec513432db04bc2afa739f344a764b0/dpdk/x86_64-native-bsdapp-gcc/include/rte_ring_generic.h:440:7: warning: implicit declaration of function 'rte_atomic128_cmpset'; did you mean 'rte_atomic32_cmpset'? [-Wimplicit-function-declaration]
   if (rte_atomic128_cmpset((volatile rte_int128_t *)ring_ptr,
       ^~~~~~~~~~~~~~~~~~~~
       rte_atomic32_cmpset
/tmp/FreeBSD_K10.3_GCC4.8.5/x86_64-native-bsdapp-gcc/4ec513432db04bc2afa739f344a764b0/dpdk/x86_64-native-bsdapp-gcc/include/rte_ring_generic.h:440:7: warning: nested extern declaration of 'rte_atomic128_cmpset' [-Wnested-externs]
/tmp/FreeBSD_K10.3_GCC4.8.5/x86_64-native-bsdapp-gcc/4ec513432db04bc2afa739f344a764b0/dpdk/x86_64-native-bsdapp-gcc/include/rte_ring_generic.h:440:38: error: unknown type name 'rte_int128_t'
   if (rte_atomic128_cmpset((volatile rte_int128_t *)ring_ptr,
                                      ^~~~~~~~~~~~
/tmp/FreeBSD_K10.3_GCC4.8.5/x86_64-native-bsdapp-gcc/4ec513432db04bc2afa739f344a764b0/dpdk/x86_64-native-bsdapp-gcc/include/rte_ring_generic.h:441:8: error: 'rte_int128_t' undeclared (first use in this function); did you mean '__int128_t'?
       (rte_int128_t *)&old_value,
        ^~~~~~~~~~~~
        __int128_t
/tmp/FreeBSD_K10.3_GCC4.8.5/x86_64-native-bsdapp-gcc/4ec513432db04bc2afa739f344a764b0/dpdk/x86_64-native-bsdapp-gcc/include/rte_ring_generic.h:441:8: note: each undeclared identifier is reported only once for each function it appears in
/tmp/FreeBSD_K10.3_GCC4.8.5/x86_64-native-bsdapp-gcc/4ec513432db04bc2afa739f344a764b0/dpdk/x86_64-native-bsdapp-gcc/include/rte_ring_generic.h:441:22: error: expected expression before ')' token
       (rte_int128_t *)&old_value,
                      ^
/tmp/FreeBSD_K10.3_GCC4.8.5/x86_64-native-bsdapp-gcc/4ec513432db04bc2afa739f344a764b0/dpdk/x86_64-native-bsdapp-gcc/include/rte_ring_generic.h:403:35: warning: variable 'new_value' set but not used [-Wunused-but-set-variable]
   struct nb_ring_entry old_value, new_value;
                                   ^~~~~~~~~
gmake[5]: *** [/tmp/FreeBSD_K10.3_GCC4.8.5/x86_64-native-bsdapp-gcc/4ec513432db04bc2afa739f344a764b0/dpdk/mk/internal/rte.compile-pre.mk:116: rte_mempool.o] Error 1
gmake[4]: *** [/tmp/FreeBSD_K10.3_GCC4.8.5/x86_64-native-bsdapp-gcc/4ec513432db04bc2afa739f344a764b0/dpdk/mk/rte.subdir.mk:37: librte_mempool] Error 2
gmake[4]: *** Waiting for unfinished jobs....

DPDK STV team


More information about the test-report mailing list