[dpdk-test-report] |FAILURE| pw56170[v2] compress/qat: fixed overflow status return from qat pmd

sys_stv at intel.com sys_stv at intel.com
Mon Jul 8 15:22:05 CEST 2019


Test-Label: Intel-compilation
Test-Status: FAILURE
http://dpdk.org/patch/56170

_Compilation issues_

Submitter: Fiona Trahe <fiona.trahe at intel.com>
Date: 2019-07-05 17:15:51
Reply_mail: 1562346951-18190-1-git-send-email-fiona.trahe at intel.com
DPDK git baseline: Repo:dpdk-next-crypto, CommitID: 4dc797d3baeb6e06c1e085eab5cf1508dc4b10e8

Build Summary: 22 Builds Done, 22 Successful, 0 Failures

Meson Summary: 8 Builds Done, 7 Successful, 1 Failures



Test environment and configuration as below:

**Make Build**


OS: RHEL76-64
	Kernel Version: 3.10.0-957.el7.x86_64
	CPU info: Intel(R) Xeon(R) CPU E5-2699 v4 @ 2.20GHz
	GCC Version: gcc (GCC) 4.8.5 20150623 (Red Hat 4.8.5-36)
	Clang Version: NA
	x86_64-native-linuxapp-gcc


OS: CENTOS76-64
	Kernel Version: 3.10.0-957.10.1.el7.x86_64
	CPU info: Intel(R) Xeon(R) CPU E5-2699 v4 @ 2.20GHz
	GCC Version: gcc (GCC) 4.8.5 20150623 (Red Hat 4.8.5-36)
	Clang Version: 3.4.2 (tags/RELEASE_34/dot2-final)
	x86_64-native-linuxapp-gcc


OS: UB1804-64
	Kernel Version: 4.15.0-20-generic
	CPU info: Intel(R) Xeon(R) CPU E5-2699 v3 @ 2.30GHz
	GCC Version: gcc (Ubuntu 7.3.0-16ubuntu3) 7.3.0
	Clang Version: 6.0.0-1ubuntu2 (tags/RELEASE_600/final)
	x86_64-native-linuxapp-clang
	x86_64-native-linuxapp-icc
	x86_64-native-linuxapp-gcc


OS: UB1904-64
	Kernel Version: 5.0.0-13-generic
	CPU info: Intel(R) Xeon(R) CPU E5-2699 v3 @ 2.30GHz
	GCC Version: gcc (Ubuntu 8.3.0-6ubuntu1) 8.3.0
	Clang Version: 8.0.0-3 (tags/RELEASE_800/final)
	x86_64-native-linuxapp-gcc


OS: UB1604-32
	Kernel Version: 4.4.0-131-generic
	CPU info: Intel(R) Xeon(R) CPU E5-2699 v3 @ 2.30GHz
	GCC Version: gcc (Ubuntu 5.4.0-6ubuntu1~16.04.11) 5.4.0 20160609
	Clang Version: 3.8.0-2ubuntu4 (tags/RELEASE_380/final)
	i686-native-linuxapp-gcc


OS: UB1604-64
	Kernel Version: 4.4.0-47-generic
	CPU info: Intel(R) Xeon(R) CPU E5-2699 v3 @ 2.30GHz
	GCC Version: gcc (Ubuntu 5.4.0-6ubuntu1~16.04.10) 5.4.0 20160609
	Clang Version: 3.8.0-2ubuntu4 (tags/RELEASE_380/final)
	x86_64-native-linuxapp-clang
	x86_64-native-linuxapp-gcc


OS: FreeBSD12-64
	Kernel Version: 12.0-RC3
	CPU info: Intel(R) Xeon(R) CPU E5-2699 v4 @ 2.20GHz (2194.98-MHz K8-class CPU)
	GCC Version: gcc (FreeBSD Ports Collection) 7.3.0
	Clang Version: 6.0.1 (tags/RELEASE_601/final 335540) (based on LLVM 6.0.1)
	x86_64-native-bsdapp-gcc+debug
	x86_64-native-bsdapp-gcc
	x86_64-native-bsdapp-gcc+shared
	x86_64-native-bsdapp-clang


OS: RHEL80-64
	Kernel Version: 4.18.0-80.el8.x86_64
	CPU info: Intel(R) Xeon(R) CPU E5-2699 v4 @ 2.20GHz
	GCC Version: gcc (GCC) 8.2.1 20180905 (Red Hat 8.2.1-3)
	Clang Version: NA
	x86_64-native-linuxapp-gcc+debug
	x86_64-native-linuxapp-clang
	x86_64-native-linuxapp-gcc+shared
	x86_64-native-linuxapp-icc
	x86_64-native-linuxapp-gcc


OS: SUSE15-64
	Kernel Version: 4.12.14-lp150.11-default
	CPU info: Intel(R) Xeon(R) CPU E5-2699 v4 @ 2.20GHz
	GCC Version: gcc (SUSE Linux) 7.3.1 20180323 [gcc-7-branch revision 258812]
	Clang Version: 5.0.1 (tags/RELEASE_501/final 312548)
	x86_64-native-linuxapp-gcc
	x86_64-native-linuxapp-clang


OS: FD30-64
	Kernel Version: 5.1.7-300.fc30.x86_64
	CPU info: Intel(R) Xeon(R) CPU E5-2699 v4 @ 2.20GHz
	GCC Version: gcc (GCC) 9.1.1 20190503 (Red Hat 9.1.1-1)
	Clang Version: 8.0.0 (Fedora 8.0.0-1.fc30)
	x86_64-native-linuxapp-gcc
	x86_64-native-linuxapp-clang


**Meson Build**


OS: UB1804-64
	Kernel Version: 4.15.0-20-generic
	CPU info: Intel(R) Xeon(R) CPU E5-2699 v4 @ 2.20GHz
	GCC Version: gcc (Ubuntu 7.3.0-27ubuntu1~18.04) 7.3.0
	Clang Version: 6.0.0-1ubuntu2 (tags/RELEASE_600/final)
	x86_64-native-linuxapp-doc
	build-gcc-static
	build-gcc-shared
	build-clang-static
	build-clang-shared
	build-x86-default


OS: UB1604-32
	Kernel Version: 4.4.0-131-generic
	CPU info: Intel(R) Xeon(R) CPU E5-2699 v4 @ 2.20GHz
	GCC Version: gcc (Ubuntu 5.4.0-6ubuntu1~16.04.11) 5.4.0 20160609
	Clang Version: 3.8.0-2ubuntu4 (tags/RELEASE_380/final)
	build-gcc-static
	build-gcc-shared
	build-clang-static
	build-clang-shared
	build-x86-default


OS: WIN10-64
	Kernel Version: N/A
	CPU info: N/A
	GCC Version: N/A
	Clang Version: Clang 8.0.0
	x86_64-windows-clang


OS: FreeBSD12-64
	Kernel Version: 12.0-RC3
	CPU info: Intel(R) Xeon(R) CPU E5-2699 v4 @ 2.20GHz (2194.99-MHz K8-class CPU)
	GCC Version: gcc (FreeBSD Ports Collection) 7.3.0
	Clang Version: 6.0.1 (tags/RELEASE_601/final 335540) (based on LLVM 6.0.1)
	build-gcc-static
	build-gcc-shared
	build-clang-static
	build-clang-shared
	build-x86-default


OS: RHEL80-64
	Kernel Version: 4.18.0-80.el8.x86_64
	CPU info: Intel(R) Xeon(R) CPU E5-2699 v4 @ 2.20GHz
	GCC Version: gcc (GCC) 8.2.1 20180905 (Red Hat 8.2.1-3)
	Clang Version: NA
	build-gcc-static
	build-gcc-shared
	build-x86-default


OS: SUSE15-64
	Kernel Version: 4.12.14-lp150.11-default
	CPU info: Intel(R) Xeon(R) CPU E5-2699 v4 @ 2.20GHz
	GCC Version: gcc (SUSE Linux) 7.3.1 20180323 [gcc-7-branch revision 258812]
	Clang Version: 5.0.1 (tags/RELEASE_501/final 312548)
	build-gcc-static
	build-gcc-shared
	build-clang-static
	build-clang-shared
	build-x86-default


OS: FD30-64
	Kernel Version: 5.0.9-301.fc30.x86_64
	CPU info: Intel(R) Xeon(R) CPU E5-2699 v4 @ 2.20GHz
	GCC Version: gcc (GCC) 9.1.1 20190503 (Red Hat 9.1.1-1)
	Clang Version: 8.0.0 (Fedora 8.0.0-1.fc30)
	build-gcc-static
	build-gcc-shared
	build-clang-static
	build-clang-shared
	build-x86-default


*Meson Build Failed #1:
OS: FreeBSD12-64
Target:build-gcc-static
Has header "linux/virtio_scsi.h" : NO
Message: Skipping example "vhost_scsi"
Library virt found: YES
Dependency jansson found: NO (tried pkgconfig and cmake)

examples/meson.build:88:4: ERROR: Problem encountered: Missing dependency "power" for example "vm_power_manager"

A full log can be found at /tmp/FreeBSD12-64_K19.02_GCC7.3.0/x86_64-native-bsdapp-gcc/0717b48a769b4114a7f05779d534adc0/dpdk/build-gcc-static/meson-logs/meson-log.txt
ninja -C build-gcc-static
ninja: Entering directory `build-gcc-static'
ninja: error: loading 'build.ninja': No such file or directory
--
Has header "linux/virtio_scsi.h" : NO
Message: Skipping example "vhost_scsi"
Library virt found: YES
Dependency jansson found: NO (tried pkgconfig and cmake)

examples/meson.build:88:4: ERROR: Problem encountered: Missing dependency "power" for example "vm_power_manager"

A full log can be found at /tmp/FreeBSD12-64_K19.02_GCC7.3.0/x86_64-native-bsdapp-gcc/0717b48a769b4114a7f05779d534adc0/dpdk/build-gcc-shared/meson-logs/meson-log.txt
ninja -C build-gcc-shared
ninja: Entering directory `build-gcc-shared'
ninja: error: loading 'build.ninja': No such file or directory
--
[839/1431] Compiling C object 'drivers/a715181@@tmp_rte_pmd_ixgbe at sta/net_ixgbe_rte_pmd_ixgbe.c.o'.
[840/1431] Linking static target drivers/librte_pmd_liquidio.a.
[841/1431] Compiling C object 'drivers/a715181@@rte_pmd_liquidio at sha/meson-generated_.._rte_pmd_liquidio.pmd.c.o'.
[842/1431] Linking target drivers/librte_pmd_liquidio.so.1.1.
[843/1431] Compiling C object 'drivers/a715181@@tmp_rte_pmd_mlx5 at sta/net_mlx5_mlx5.c.o'.
FAILED: drivers/a715181@@tmp_rte_pmd_mlx5 at sta/net_mlx5_mlx5.c.o 
ccache clang -Idrivers/a715181@@tmp_rte_pmd_mlx5 at sta -Idrivers -I../drivers -Idrivers/net/mlx5 -I../drivers/net/mlx5 -Ilib/librte_ethdev -I../lib/librte_ethdev -I. -I../ -Iconfig -I../config -Ilib/librte_eal/common/include -I../lib/librte_eal/common/include -I../lib/librte_eal/freebsd/eal/include -Ilib/librte_eal/common -I../lib/librte_eal/common -Ilib/librte_eal/common/include/arch/x86 -I../lib/librte_eal/common/include/arch/x86 -Ilib/librte_eal -I../lib/librte_eal -Ilib/librte_kvargs -I../lib/librte_kvargs -Ilib/librte_net -I../lib/librte_net -Ilib/librte_mbuf -I../lib/librte_mbuf -Ilib/librte_mempool -I../lib/librte_mempool -Ilib/librte_ring -I../lib/librte_ring -Ilib/librte_cmdline -I../lib/librte_cmdline -Ilib/librte_meter -I../lib/librte_meter -Idrivers/bus/pci -I../drivers/bus/pci -I../drivers/bus/pci/bsd -Ilib/librte_pci -I../lib/librte_pci -Idrivers/bus/vdev -I../drivers/bus/vdev -Xclang -fcolor-diagnostics -pipe -D_FILE_OFFSET_BITS=64 -Wall -Winvalid-pch -Werror -O3 -include rte_config.h -Wunused-parameter -Wsign-compare -Wcast-qual -Wno-address-of-packed-member -D_GNU_SOURCE -D__BSD_VISIBLE -fPIC -march=native -Wextra -std=c11 -Wno-strict-prototypes -D_BSD_SOURCE -D_DEFAULT_SOURCE -D_XOPEN_SOURCE=600 -DNDEBUG -UPEDANTIC -DALLOW_EXPERIMENTAL_API -MD -MQ 'drivers/a715181@@tmp_rte_pmd_mlx5 at sta/net_mlx5_mlx5.c.o' -MF 'drivers/a715181@@tmp_rte_pmd_mlx5 at sta/net_mlx5_mlx5.c.o.d' -o 'drivers/a715181@@tmp_rte_pmd_mlx5 at sta/net_mlx5_mlx5.c.o' -c ../drivers/net/mlx5/mlx5.c
../drivers/net/mlx5/mlx5.c:16:10: fatal error: 'linux/rtnetlink.h' file not found
#include <linux/rtnetlink.h>
         ^~~~~~~~~~~~~~~~~~~
1 error generated.
[844/1431] Compiling C object 'drivers/a715181@@tmp_rte_pmd_ixgbe at sta/net_ixgbe_ixgbe_rxtx.c.o'.
[845/1431] Compiling C object 'drivers/a715181@@tmp_rte_pmd_ixgbe at sta/net_ixgbe_ixgbe_rxtx_vec_sse.c.o'.
[846/1431] Compiling C object 'drivers/a715181@@tmp_rte_pmd_mlx5 at sta/net_mlx5_mlx5_ethdev.c.o'.
FAILED: drivers/a715181@@tmp_rte_pmd_mlx5 at sta/net_mlx5_mlx5_ethdev.c.o 
ccache clang -Idrivers/a715181@@tmp_rte_pmd_mlx5 at sta -Idrivers -I../drivers -Idrivers/net/mlx5 -I../drivers/net/mlx5 -Ilib/librte_ethdev -I../lib/librte_ethdev -I. -I../ -Iconfig -I../config -Ilib/librte_eal/common/include -I../lib/librte_eal/common/include -I../lib/librte_eal/freebsd/eal/include -Ilib/librte_eal/common -I../lib/librte_eal/common -Ilib/librte_eal/common/include/arch/x86 -I../lib/librte_eal/common/include/arch/x86 -Ilib/librte_eal -I../lib/librte_eal -Ilib/librte_kvargs -I../lib/librte_kvargs -Ilib/librte_net -I../lib/librte_net -Ilib/librte_mbuf -I../lib/librte_mbuf -Ilib/librte_mempool -I../lib/librte_mempool -Ilib/librte_ring -I../lib/librte_ring -Ilib/librte_cmdline -I../lib/librte_cmdline -Ilib/librte_meter -I../lib/librte_meter -Idrivers/bus/pci -I../drivers/bus/pci -I../drivers/bus/pci/bsd -Ilib/librte_pci -I../lib/librte_pci -Idrivers/bus/vdev -I../drivers/bus/vdev -Xclang -fcolor-diagnostics -pipe -D_FILE_OFFSET_BITS=64 -Wall -Winvalid-pch -Werror -O3 -include rte_config.h -Wunused-parameter -Wsign-compare -Wcast-qual -Wno-address-of-packed-member -D_GNU_SOURCE -D__BSD_VISIBLE -fPIC -march=native -Wextra -std=c11 -Wno-strict-prototypes -D_BSD_SOURCE -D_DEFAULT_SOURCE -D_XOPEN_SOURCE=600 -DNDEBUG -UPEDANTIC -DALLOW_EXPERIMENTAL_API -MD -MQ 'drivers/a715181@@tmp_rte_pmd_mlx5 at sta/net_mlx5_mlx5_ethdev.c.o' -MF 'drivers/a715181@@tmp_rte_pmd_mlx5 at sta/net_mlx5_mlx5_ethdev.c.o.d' -o 'drivers/a715181@@tmp_rte_pmd_mlx5 at sta/net_mlx5_mlx5_ethdev.c.o' -c ../drivers/net/mlx5/mlx5_ethdev.c
../drivers/net/mlx5/mlx5_ethdev.c:21:10: fatal error: 'linux/ethtool.h' file not found
#include <linux/ethtool.h>
         ^~~~~~~~~~~~~~~~~
1 error generated.
[847/1431] Compiling C object 'drivers/a715181@@tmp_rte_pmd_mlx5 at sta/net_mlx5_mlx5_flow.c.o'.
FAILED: drivers/a715181@@tmp_rte_pmd_mlx5 at sta/net_mlx5_mlx5_flow.c.o 
ccache clang -Idrivers/a715181@@tmp_rte_pmd_mlx5 at sta -Idrivers -I../drivers -Idrivers/net/mlx5 -I../drivers/net/mlx5 -Ilib/librte_ethdev -I../lib/librte_ethdev -I. -I../ -Iconfig -I../config -Ilib/librte_eal/common/include -I../lib/librte_eal/common/include -I../lib/librte_eal/freebsd/eal/include -Ilib/librte_eal/common -I../lib/librte_eal/common -Ilib/librte_eal/common/include/arch/x86 -I../lib/librte_eal/common/include/arch/x86 -Ilib/librte_eal -I../lib/librte_eal -Ilib/librte_kvargs -I../lib/librte_kvargs -Ilib/librte_net -I../lib/librte_net -Ilib/librte_mbuf -I../lib/librte_mbuf -Ilib/librte_mempool -I../lib/librte_mempool -Ilib/librte_ring -I../lib/librte_ring -Ilib/librte_cmdline -I../lib/librte_cmdline -Ilib/librte_meter -I../lib/librte_meter -Idrivers/bus/pci -I../drivers/bus/pci -I../drivers/bus/pci/bsd -Ilib/librte_pci -I../lib/librte_pci -Idrivers/bus/vdev -I../drivers/bus/vdev -Xclang -fcolor-diagnostics -pipe -D_FILE_OFFSET_BITS=64 -Wall -Winvalid-pch -Werror -O3 -include rte_config.h -Wunused-parameter -Wsign-compare -Wcast-qual -Wno-address-of-packed-member -D_GNU_SOURCE -D__BSD_VISIBLE -fPIC -march=native -Wextra -std=c11 -Wno-strict-prototypes -D_BSD_SOURCE -D_DEFAULT_SOURCE -D_XOPEN_SOURCE=600 -DNDEBUG -UPEDANTIC -DALLOW_EXPERIMENTAL_API -MD -MQ 'drivers/a715181@@tmp_rte_pmd_mlx5 at sta/net_mlx5_mlx5_flow.c.o' -MF 'drivers/a715181@@tmp_rte_pmd_mlx5 at sta/net_mlx5_mlx5_flow.c.o.d' -o 'drivers/a715181@@tmp_rte_pmd_mlx5 at sta/net_mlx5_mlx5_flow.c.o' -c ../drivers/net/mlx5/mlx5_flow.c
In file included from ../drivers/net/mlx5/mlx5_flow.c:30:
In file included from ../drivers/net/mlx5/mlx5.h:36:
../drivers/net/mlx5/mlx5_mr.h:19:10: fatal error: 'infiniband/mlx5dv.h' file not found
#include <infiniband/mlx5dv.h>
         ^~~~~~~~~~~~~~~~~~~~~
1 error generated.
[848/1431] Compiling C object 'lib/76b5a35@@rte_pipeline at sta/librte_pipeline_rte_table_action.c.o'.
ninja: build stopped: subcommand failed.
meson --werror -Dexamples=all --default-library=shared /tmp/FreeBSD12-64_K19.02_GCC7.3.0/x86_64-native-bsdapp-gcc/0717b48a769b4114a7f05779d534adc0/dpdk/devtools/.. build-clang-shared
The Meson build system
Version: 0.50.1
Source dir: /tmp/FreeBSD12-64_K19.02_GCC7.3.0/x86_64-native-bsdapp-gcc/0717b48a769b4114a7f05779d534adc0/dpdk
Build dir: /tmp/FreeBSD12-64_K19.02_GCC7.3.0/x86_64-native-bsdapp-gcc/0717b48a769b4114a7f05779d534adc0/dpdk/build-clang-shared
--
[869/1451] Compiling C object 'drivers/a715181@@rte_pmd_ixgbe at sha/meson-generated_.._rte_pmd_ixgbe.pmd.c.o'.
[870/1451] Linking static target drivers/librte_pmd_ixgbe.a.
[871/1451] Linking target drivers/librte_pmd_liquidio.so.1.1.
[872/1451] Linking target drivers/librte_pmd_ixgbe.so.2.1.
[873/1451] Compiling C object 'drivers/a715181@@tmp_rte_pmd_mlx5 at sta/net_mlx5_mlx5_ethdev.c.o'.
FAILED: drivers/a715181@@tmp_rte_pmd_mlx5 at sta/net_mlx5_mlx5_ethdev.c.o 
ccache clang -Idrivers/a715181@@tmp_rte_pmd_mlx5 at sta -Idrivers -I../drivers -Idrivers/net/mlx5 -I../drivers/net/mlx5 -Ilib/librte_ethdev -I../lib/librte_ethdev -I. -I../ -Iconfig -I../config -Ilib/librte_eal/common/include -I../lib/librte_eal/common/include -I../lib/librte_eal/freebsd/eal/include -Ilib/librte_eal/common -I../lib/librte_eal/common -Ilib/librte_eal/common/include/arch/x86 -I../lib/librte_eal/common/include/arch/x86 -Ilib/librte_eal -I../lib/librte_eal -Ilib/librte_kvargs -I../lib/librte_kvargs -Ilib/librte_net -I../lib/librte_net -Ilib/librte_mbuf -I../lib/librte_mbuf -Ilib/librte_mempool -I../lib/librte_mempool -Ilib/librte_ring -I../lib/librte_ring -Ilib/librte_cmdline -I../lib/librte_cmdline -Ilib/librte_meter -I../lib/librte_meter -Idrivers/bus/pci -I../drivers/bus/pci -I../drivers/bus/pci/bsd -Ilib/librte_pci -I../lib/librte_pci -Idrivers/bus/vdev -I../drivers/bus/vdev -Xclang -fcolor-diagnostics -pipe -D_FILE_OFFSET_BITS=64 -Wall -Winvalid-pch -Werror -O3 -include rte_config.h -Wunused-parameter -Wsign-compare -Wcast-qual -Wno-address-of-packed-member -D_GNU_SOURCE -D__BSD_VISIBLE -fPIC -march=native -Wextra -std=c11 -Wno-strict-prototypes -D_BSD_SOURCE -D_DEFAULT_SOURCE -D_XOPEN_SOURCE=600 -DNDEBUG -UPEDANTIC -DALLOW_EXPERIMENTAL_API -MD -MQ 'drivers/a715181@@tmp_rte_pmd_mlx5 at sta/net_mlx5_mlx5_ethdev.c.o' -MF 'drivers/a715181@@tmp_rte_pmd_mlx5 at sta/net_mlx5_mlx5_ethdev.c.o.d' -o 'drivers/a715181@@tmp_rte_pmd_mlx5 at sta/net_mlx5_mlx5_ethdev.c.o' -c ../drivers/net/mlx5/mlx5_ethdev.c
../drivers/net/mlx5/mlx5_ethdev.c:21:10: fatal error: 'linux/ethtool.h' file not found
#include <linux/ethtool.h>
         ^~~~~~~~~~~~~~~~~
1 error generated.
[874/1451] Compiling C object 'drivers/a715181@@tmp_rte_pmd_mlx5 at sta/net_mlx5_mlx5.c.o'.
FAILED: drivers/a715181@@tmp_rte_pmd_mlx5 at sta/net_mlx5_mlx5.c.o 
ccache clang -Idrivers/a715181@@tmp_rte_pmd_mlx5 at sta -Idrivers -I../drivers -Idrivers/net/mlx5 -I../drivers/net/mlx5 -Ilib/librte_ethdev -I../lib/librte_ethdev -I. -I../ -Iconfig -I../config -Ilib/librte_eal/common/include -I../lib/librte_eal/common/include -I../lib/librte_eal/freebsd/eal/include -Ilib/librte_eal/common -I../lib/librte_eal/common -Ilib/librte_eal/common/include/arch/x86 -I../lib/librte_eal/common/include/arch/x86 -Ilib/librte_eal -I../lib/librte_eal -Ilib/librte_kvargs -I../lib/librte_kvargs -Ilib/librte_net -I../lib/librte_net -Ilib/librte_mbuf -I../lib/librte_mbuf -Ilib/librte_mempool -I../lib/librte_mempool -Ilib/librte_ring -I../lib/librte_ring -Ilib/librte_cmdline -I../lib/librte_cmdline -Ilib/librte_meter -I../lib/librte_meter -Idrivers/bus/pci -I../drivers/bus/pci -I../drivers/bus/pci/bsd -Ilib/librte_pci -I../lib/librte_pci -Idrivers/bus/vdev -I../drivers/bus/vdev -Xclang -fcolor-diagnostics -pipe -D_FILE_OFFSET_BITS=64 -Wall -Winvalid-pch -Werror -O3 -include rte_config.h -Wunused-parameter -Wsign-compare -Wcast-qual -Wno-address-of-packed-member -D_GNU_SOURCE -D__BSD_VISIBLE -fPIC -march=native -Wextra -std=c11 -Wno-strict-prototypes -D_BSD_SOURCE -D_DEFAULT_SOURCE -D_XOPEN_SOURCE=600 -DNDEBUG -UPEDANTIC -DALLOW_EXPERIMENTAL_API -MD -MQ 'drivers/a715181@@tmp_rte_pmd_mlx5 at sta/net_mlx5_mlx5.c.o' -MF 'drivers/a715181@@tmp_rte_pmd_mlx5 at sta/net_mlx5_mlx5.c.o.d' -o 'drivers/a715181@@tmp_rte_pmd_mlx5 at sta/net_mlx5_mlx5.c.o' -c ../drivers/net/mlx5/mlx5.c
../drivers/net/mlx5/mlx5.c:16:10: fatal error: 'linux/rtnetlink.h' file not found
#include <linux/rtnetlink.h>
         ^~~~~~~~~~~~~~~~~~~
1 error generated.
[875/1451] Compiling C object 'drivers/a715181@@tmp_rte_pmd_mlx5 at sta/net_mlx5_mlx5_flow.c.o'.
FAILED: drivers/a715181@@tmp_rte_pmd_mlx5 at sta/net_mlx5_mlx5_flow.c.o 
ccache clang -Idrivers/a715181@@tmp_rte_pmd_mlx5 at sta -Idrivers -I../drivers -Idrivers/net/mlx5 -I../drivers/net/mlx5 -Ilib/librte_ethdev -I../lib/librte_ethdev -I. -I../ -Iconfig -I../config -Ilib/librte_eal/common/include -I../lib/librte_eal/common/include -I../lib/librte_eal/freebsd/eal/include -Ilib/librte_eal/common -I../lib/librte_eal/common -Ilib/librte_eal/common/include/arch/x86 -I../lib/librte_eal/common/include/arch/x86 -Ilib/librte_eal -I../lib/librte_eal -Ilib/librte_kvargs -I../lib/librte_kvargs -Ilib/librte_net -I../lib/librte_net -Ilib/librte_mbuf -I../lib/librte_mbuf -Ilib/librte_mempool -I../lib/librte_mempool -Ilib/librte_ring -I../lib/librte_ring -Ilib/librte_cmdline -I../lib/librte_cmdline -Ilib/librte_meter -I../lib/librte_meter -Idrivers/bus/pci -I../drivers/bus/pci -I../drivers/bus/pci/bsd -Ilib/librte_pci -I../lib/librte_pci -Idrivers/bus/vdev -I../drivers/bus/vdev -Xclang -fcolor-diagnostics -pipe -D_FILE_OFFSET_BITS=64 -Wall -Winvalid-pch -Werror -O3 -include rte_config.h -Wunused-parameter -Wsign-compare -Wcast-qual -Wno-address-of-packed-member -D_GNU_SOURCE -D__BSD_VISIBLE -fPIC -march=native -Wextra -std=c11 -Wno-strict-prototypes -D_BSD_SOURCE -D_DEFAULT_SOURCE -D_XOPEN_SOURCE=600 -DNDEBUG -UPEDANTIC -DALLOW_EXPERIMENTAL_API -MD -MQ 'drivers/a715181@@tmp_rte_pmd_mlx5 at sta/net_mlx5_mlx5_flow.c.o' -MF 'drivers/a715181@@tmp_rte_pmd_mlx5 at sta/net_mlx5_mlx5_flow.c.o.d' -o 'drivers/a715181@@tmp_rte_pmd_mlx5 at sta/net_mlx5_mlx5_flow.c.o' -c ../drivers/net/mlx5/mlx5_flow.c
In file included from ../drivers/net/mlx5/mlx5_flow.c:30:
In file included from ../drivers/net/mlx5/mlx5.h:36:
../drivers/net/mlx5/mlx5_mr.h:19:10: fatal error: 'infiniband/mlx5dv.h' file not found
#include <infiniband/mlx5dv.h>
         ^~~~~~~~~~~~~~~~~~~~~
1 error generated.
[876/1451] Compiling C object 'drivers/a715181@@tmp_rte_pmd_mlx5 at sta/net_mlx5_mlx5_flow_dv.c.o'.
FAILED: drivers/a715181@@tmp_rte_pmd_mlx5 at sta/net_mlx5_mlx5_flow_dv.c.o 
ccache clang -Idrivers/a715181@@tmp_rte_pmd_mlx5 at sta -Idrivers -I../drivers -Idrivers/net/mlx5 -I../drivers/net/mlx5 -Ilib/librte_ethdev -I../lib/librte_ethdev -I. -I../ -Iconfig -I../config -Ilib/librte_eal/common/include -I../lib/librte_eal/common/include -I../lib/librte_eal/freebsd/eal/include -Ilib/librte_eal/common -I../lib/librte_eal/common -Ilib/librte_eal/common/include/arch/x86 -I../lib/librte_eal/common/include/arch/x86 -Ilib/librte_eal -I../lib/librte_eal -Ilib/librte_kvargs -I../lib/librte_kvargs -Ilib/librte_net -I../lib/librte_net -Ilib/librte_mbuf -I../lib/librte_mbuf -Ilib/librte_mempool -I../lib/librte_mempool -Ilib/librte_ring -I../lib/librte_ring -Ilib/librte_cmdline -I../lib/librte_cmdline -Ilib/librte_meter -I../lib/librte_meter -Idrivers/bus/pci -I../drivers/bus/pci -I../drivers/bus/pci/bsd -Ilib/librte_pci -I../lib/librte_pci -Idrivers/bus/vdev -I../drivers/bus/vdev -Xclang -fcolor-diagnostics -pipe -D_FILE_OFFSET_BITS=64 -Wall -Winvalid-pch -Werror -O3 -include rte_config.h -Wunused-parameter -Wsign-compare -Wcast-qual -Wno-address-of-packed-member -D_GNU_SOURCE -D__BSD_VISIBLE -fPIC -march=native -Wextra -std=c11 -Wno-strict-prototypes -D_BSD_SOURCE -D_DEFAULT_SOURCE -D_XOPEN_SOURCE=600 -DNDEBUG -UPEDANTIC -DALLOW_EXPERIMENTAL_API -MD -MQ 'drivers/a715181@@tmp_rte_pmd_mlx5 at sta/net_mlx5_mlx5_flow_dv.c.o' -MF 'drivers/a715181@@tmp_rte_pmd_mlx5 at sta/net_mlx5_mlx5_flow_dv.c.o.d' -o 'drivers/a715181@@tmp_rte_pmd_mlx5 at sta/net_mlx5_mlx5_flow_dv.c.o' -c ../drivers/net/mlx5/mlx5_flow_dv.c
In file included from ../drivers/net/mlx5/mlx5_flow_dv.c:29:
In file included from ../drivers/net/mlx5/mlx5.h:36:
../drivers/net/mlx5/mlx5_mr.h:19:10: fatal error: 'infiniband/mlx5dv.h' file not found
#include <infiniband/mlx5dv.h>
         ^~~~~~~~~~~~~~~~~~~~~
1 error generated.
[877/1451] Generating symbol file 'drivers/a715181@@rte_pmd_ixgbe at sha/librte_pmd_ixgbe.so.2.1.symbols'.
[878/1451] Compiling C object 'drivers/a715181@@tmp_rte_pmd_mlx5 at sta/net_mlx5_mlx5_flow_verbs.c.o'.
FAILED: drivers/a715181@@tmp_rte_pmd_mlx5 at sta/net_mlx5_mlx5_flow_verbs.c.o 
ccache clang -Idrivers/a715181@@tmp_rte_pmd_mlx5 at sta -Idrivers -I../drivers -Idrivers/net/mlx5 -I../drivers/net/mlx5 -Ilib/librte_ethdev -I../lib/librte_ethdev -I. -I../ -Iconfig -I../config -Ilib/librte_eal/common/include -I../lib/librte_eal/common/include -I../lib/librte_eal/freebsd/eal/include -Ilib/librte_eal/common -I../lib/librte_eal/common -Ilib/librte_eal/common/include/arch/x86 -I../lib/librte_eal/common/include/arch/x86 -Ilib/librte_eal -I../lib/librte_eal -Ilib/librte_kvargs -I../lib/librte_kvargs -Ilib/librte_net -I../lib/librte_net -Ilib/librte_mbuf -I../lib/librte_mbuf -Ilib/librte_mempool -I../lib/librte_mempool -Ilib/librte_ring -I../lib/librte_ring -Ilib/librte_cmdline -I../lib/librte_cmdline -Ilib/librte_meter -I../lib/librte_meter -Idrivers/bus/pci -I../drivers/bus/pci -I../drivers/bus/pci/bsd -Ilib/librte_pci -I../lib/librte_pci -Idrivers/bus/vdev -I../drivers/bus/vdev -Xclang -fcolor-diagnostics -pipe -D_FILE_OFFSET_BITS=64 -Wall -Winvalid-pch -Werror -O3 -include rte_config.h -Wunused-parameter -Wsign-compare -Wcast-qual -Wno-address-of-packed-member -D_GNU_SOURCE -D__BSD_VISIBLE -fPIC -march=native -Wextra -std=c11 -Wno-strict-prototypes -D_BSD_SOURCE -D_DEFAULT_SOURCE -D_XOPEN_SOURCE=600 -DNDEBUG -UPEDANTIC -DALLOW_EXPERIMENTAL_API -MD -MQ 'drivers/a715181@@tmp_rte_pmd_mlx5 at sta/net_mlx5_mlx5_flow_verbs.c.o' -MF 'drivers/a715181@@tmp_rte_pmd_mlx5 at sta/net_mlx5_mlx5_flow_verbs.c.o.d' -o 'drivers/a715181@@tmp_rte_pmd_mlx5 at sta/net_mlx5_mlx5_flow_verbs.c.o' -c ../drivers/net/mlx5/mlx5_flow_verbs.c
In file included from ../drivers/net/mlx5/mlx5_flow_verbs.c:29:
In file included from ../drivers/net/mlx5/mlx5.h:36:
../drivers/net/mlx5/mlx5_mr.h:19:10: fatal error: 'infiniband/mlx5dv.h' file not found
#include <infiniband/mlx5dv.h>
         ^~~~~~~~~~~~~~~~~~~~~
1 error generated.
ninja: build stopped: subcommand failed.
meson --werror -Dexamples=all -Dlibdir=lib -Dmachine=nehalem --default-library=shared /tmp/FreeBSD12-64_K19.02_GCC7.3.0/x86_64-native-bsdapp-gcc/0717b48a769b4114a7f05779d534adc0/dpdk/devtools/.. build-x86-default
The Meson build system
Version: 0.50.1
Source dir: /tmp/FreeBSD12-64_K19.02_GCC7.3.0/x86_64-native-bsdapp-gcc/0717b48a769b4114a7f05779d534adc0/dpdk
Build dir: /tmp/FreeBSD12-64_K19.02_GCC7.3.0/x86_64-native-bsdapp-gcc/0717b48a769b4114a7f05779d534adc0/dpdk/build-x86-default
--
[857/1455] Generating rte_pmd_liquidio.pmd.c with a custom command.
[858/1455] Compiling C object 'drivers/a715181@@rte_pmd_liquidio at sta/meson-generated_.._rte_pmd_liquidio.pmd.c.o'.
[859/1455] Linking static target drivers/librte_pmd_liquidio.a.
[860/1455] Compiling C object 'drivers/a715181@@rte_pmd_liquidio at sha/meson-generated_.._rte_pmd_liquidio.pmd.c.o'.
[861/1455] Compiling C object 'drivers/a715181@@tmp_rte_pmd_mlx5 at sta/net_mlx5_mlx5.c.o'.
FAILED: drivers/a715181@@tmp_rte_pmd_mlx5 at sta/net_mlx5_mlx5.c.o 
ccache cc -Idrivers/a715181@@tmp_rte_pmd_mlx5 at sta -Idrivers -I../drivers -Idrivers/net/mlx5 -I../drivers/net/mlx5 -Ilib/librte_ethdev -I../lib/librte_ethdev -I. -I../ -Iconfig -I../config -Ilib/librte_eal/common/include -I../lib/librte_eal/common/include -I../lib/librte_eal/freebsd/eal/include -Ilib/librte_eal/common -I../lib/librte_eal/common -Ilib/librte_eal/common/include/arch/x86 -I../lib/librte_eal/common/include/arch/x86 -Ilib/librte_eal -I../lib/librte_eal -Ilib/librte_kvargs -I../lib/librte_kvargs -Ilib/librte_net -I../lib/librte_net -Ilib/librte_mbuf -I../lib/librte_mbuf -Ilib/librte_mempool -I../lib/librte_mempool -Ilib/librte_ring -I../lib/librte_ring -Ilib/librte_cmdline -I../lib/librte_cmdline -Ilib/librte_meter -I../lib/librte_meter -Idrivers/bus/pci -I../drivers/bus/pci -I../drivers/bus/pci/bsd -Ilib/librte_pci -I../lib/librte_pci -Idrivers/bus/vdev -I../drivers/bus/vdev -Xclang -fcolor-diagnostics -pipe -D_FILE_OFFSET_BITS=64 -Wall -Winvalid-pch -Werror -O3 -include rte_config.h -Wunused-parameter -Wsign-compare -Wcast-qual -Wno-address-of-packed-member -D_GNU_SOURCE -D__BSD_VISIBLE -fPIC -march=nehalem -Wextra -std=c11 -Wno-strict-prototypes -D_BSD_SOURCE -D_DEFAULT_SOURCE -D_XOPEN_SOURCE=600 -DNDEBUG -UPEDANTIC -DALLOW_EXPERIMENTAL_API -MD -MQ 'drivers/a715181@@tmp_rte_pmd_mlx5 at sta/net_mlx5_mlx5.c.o' -MF 'drivers/a715181@@tmp_rte_pmd_mlx5 at sta/net_mlx5_mlx5.c.o.d' -o 'drivers/a715181@@tmp_rte_pmd_mlx5 at sta/net_mlx5_mlx5.c.o' -c ../drivers/net/mlx5/mlx5.c
../drivers/net/mlx5/mlx5.c:16:10: fatal error: 'linux/rtnetlink.h' file not found
#include <linux/rtnetlink.h>
         ^~~~~~~~~~~~~~~~~~~
1 error generated.
[862/1455] Compiling C object 'drivers/a715181@@tmp_rte_pmd_mlx5 at sta/net_mlx5_mlx5_ethdev.c.o'.
FAILED: drivers/a715181@@tmp_rte_pmd_mlx5 at sta/net_mlx5_mlx5_ethdev.c.o 
ccache cc -Idrivers/a715181@@tmp_rte_pmd_mlx5 at sta -Idrivers -I../drivers -Idrivers/net/mlx5 -I../drivers/net/mlx5 -Ilib/librte_ethdev -I../lib/librte_ethdev -I. -I../ -Iconfig -I../config -Ilib/librte_eal/common/include -I../lib/librte_eal/common/include -I../lib/librte_eal/freebsd/eal/include -Ilib/librte_eal/common -I../lib/librte_eal/common -Ilib/librte_eal/common/include/arch/x86 -I../lib/librte_eal/common/include/arch/x86 -Ilib/librte_eal -I../lib/librte_eal -Ilib/librte_kvargs -I../lib/librte_kvargs -Ilib/librte_net -I../lib/librte_net -Ilib/librte_mbuf -I../lib/librte_mbuf -Ilib/librte_mempool -I../lib/librte_mempool -Ilib/librte_ring -I../lib/librte_ring -Ilib/librte_cmdline -I../lib/librte_cmdline -Ilib/librte_meter -I../lib/librte_meter -Idrivers/bus/pci -I../drivers/bus/pci -I../drivers/bus/pci/bsd -Ilib/librte_pci -I../lib/librte_pci -Idrivers/bus/vdev -I../drivers/bus/vdev -Xclang -fcolor-diagnostics -pipe -D_FILE_OFFSET_BITS=64 -Wall -Winvalid-pch -Werror -O3 -include rte_config.h -Wunused-parameter -Wsign-compare -Wcast-qual -Wno-address-of-packed-member -D_GNU_SOURCE -D__BSD_VISIBLE -fPIC -march=nehalem -Wextra -std=c11 -Wno-strict-prototypes -D_BSD_SOURCE -D_DEFAULT_SOURCE -D_XOPEN_SOURCE=600 -DNDEBUG -UPEDANTIC -DALLOW_EXPERIMENTAL_API -MD -MQ 'drivers/a715181@@tmp_rte_pmd_mlx5 at sta/net_mlx5_mlx5_ethdev.c.o' -MF 'drivers/a715181@@tmp_rte_pmd_mlx5 at sta/net_mlx5_mlx5_ethdev.c.o.d' -o 'drivers/a715181@@tmp_rte_pmd_mlx5 at sta/net_mlx5_mlx5_ethdev.c.o' -c ../drivers/net/mlx5/mlx5_ethdev.c
../drivers/net/mlx5/mlx5_ethdev.c:21:10: fatal error: 'linux/ethtool.h' file not found
#include <linux/ethtool.h>
         ^~~~~~~~~~~~~~~~~
1 error generated.
[863/1455] Linking target drivers/librte_pmd_liquidio.so.1.1.
[864/1455] Compiling C object 'drivers/a715181@@tmp_rte_pmd_ixgbe at sta/net_ixgbe_ixgbe_rxtx_vec_sse.c.o'.
[865/1455] Compiling C object 'drivers/a715181@@tmp_rte_pmd_ixgbe at sta/net_ixgbe_ixgbe_rxtx.c.o'.
[866/1455] Compiling C object 'lib/76b5a35@@rte_pipeline at sta/librte_pipeline_rte_table_action.c.o'.
ninja: build stopped: subcommand failed.
ninja: Entering directory `build-x86-default'
[1/592] Linking static target lib/librte_pipeline.a.
[2/592] Linking static target drivers/libtmp_rte_pmd_ixgbe.a.
[3/592] Linking target lib/librte_pipeline.so.3.1.
[4/592] Generating rte_pmd_ixgbe.pmd.c with a custom command.
[5/592] Compiling C object 'drivers/a715181@@rte_pmd_ixgbe at sta/meson-generated_.._rte_pmd_ixgbe.pmd.c.o'.
[6/592] Linking static target drivers/librte_pmd_ixgbe.a.
[7/592] Compiling C object 'drivers/a715181@@tmp_rte_pmd_mlx5 at sta/net_mlx5_mlx5_flow.c.o'.
FAILED: drivers/a715181@@tmp_rte_pmd_mlx5 at sta/net_mlx5_mlx5_flow.c.o 
ccache cc -Idrivers/a715181@@tmp_rte_pmd_mlx5 at sta -Idrivers -I../drivers -Idrivers/net/mlx5 -I../drivers/net/mlx5 -Ilib/librte_ethdev -I../lib/librte_ethdev -I. -I../ -Iconfig -I../config -Ilib/librte_eal/common/include -I../lib/librte_eal/common/include -I../lib/librte_eal/freebsd/eal/include -Ilib/librte_eal/common -I../lib/librte_eal/common -Ilib/librte_eal/common/include/arch/x86 -I../lib/librte_eal/common/include/arch/x86 -Ilib/librte_eal -I../lib/librte_eal -Ilib/librte_kvargs -I../lib/librte_kvargs -Ilib/librte_net -I../lib/librte_net -Ilib/librte_mbuf -I../lib/librte_mbuf -Ilib/librte_mempool -I../lib/librte_mempool -Ilib/librte_ring -I../lib/librte_ring -Ilib/librte_cmdline -I../lib/librte_cmdline -Ilib/librte_meter -I../lib/librte_meter -Idrivers/bus/pci -I../drivers/bus/pci -I../drivers/bus/pci/bsd -Ilib/librte_pci -I../lib/librte_pci -Idrivers/bus/vdev -I../drivers/bus/vdev -Xclang -fcolor-diagnostics -pipe -D_FILE_OFFSET_BITS=64 -Wall -Winvalid-pch -Werror -O3 -include rte_config.h -Wunused-parameter -Wsign-compare -Wcast-qual -Wno-address-of-packed-member -D_GNU_SOURCE -D__BSD_VISIBLE -fPIC -march=nehalem -Wextra -std=c11 -Wno-strict-prototypes -D_BSD_SOURCE -D_DEFAULT_SOURCE -D_XOPEN_SOURCE=600 -DNDEBUG -UPEDANTIC -DALLOW_EXPERIMENTAL_API -MD -MQ 'drivers/a715181@@tmp_rte_pmd_mlx5 at sta/net_mlx5_mlx5_flow.c.o' -MF 'drivers/a715181@@tmp_rte_pmd_mlx5 at sta/net_mlx5_mlx5_flow.c.o.d' -o 'drivers/a715181@@tmp_rte_pmd_mlx5 at sta/net_mlx5_mlx5_flow.c.o' -c ../drivers/net/mlx5/mlx5_flow.c
In file included from ../drivers/net/mlx5/mlx5_flow.c:30:
In file included from ../drivers/net/mlx5/mlx5.h:36:
../drivers/net/mlx5/mlx5_mr.h:19:10: fatal error: 'infiniband/mlx5dv.h' file not found
#include <infiniband/mlx5dv.h>
         ^~~~~~~~~~~~~~~~~~~~~
1 error generated.
[8/592] Compiling C object 'drivers/a715181@@rte_pmd_ixgbe at sha/meson-generated_.._rte_pmd_ixgbe.pmd.c.o'.
[9/592] Compiling C object 'drivers/a715181@@tmp_rte_pmd_mlx5 at sta/net_mlx5_mlx5.c.o'.
FAILED: drivers/a715181@@tmp_rte_pmd_mlx5 at sta/net_mlx5_mlx5.c.o 
ccache cc -Idrivers/a715181@@tmp_rte_pmd_mlx5 at sta -Idrivers -I../drivers -Idrivers/net/mlx5 -I../drivers/net/mlx5 -Ilib/librte_ethdev -I../lib/librte_ethdev -I. -I../ -Iconfig -I../config -Ilib/librte_eal/common/include -I../lib/librte_eal/common/include -I../lib/librte_eal/freebsd/eal/include -Ilib/librte_eal/common -I../lib/librte_eal/common -Ilib/librte_eal/common/include/arch/x86 -I../lib/librte_eal/common/include/arch/x86 -Ilib/librte_eal -I../lib/librte_eal -Ilib/librte_kvargs -I../lib/librte_kvargs -Ilib/librte_net -I../lib/librte_net -Ilib/librte_mbuf -I../lib/librte_mbuf -Ilib/librte_mempool -I../lib/librte_mempool -Ilib/librte_ring -I../lib/librte_ring -Ilib/librte_cmdline -I../lib/librte_cmdline -Ilib/librte_meter -I../lib/librte_meter -Idrivers/bus/pci -I../drivers/bus/pci -I../drivers/bus/pci/bsd -Ilib/librte_pci -I../lib/librte_pci -Idrivers/bus/vdev -I../drivers/bus/vdev -Xclang -fcolor-diagnostics -pipe -D_FILE_OFFSET_BITS=64 -Wall -Winvalid-pch -Werror -O3 -include rte_config.h -Wunused-parameter -Wsign-compare -Wcast-qual -Wno-address-of-packed-member -D_GNU_SOURCE -D__BSD_VISIBLE -fPIC -march=nehalem -Wextra -std=c11 -Wno-strict-prototypes -D_BSD_SOURCE -D_DEFAULT_SOURCE -D_XOPEN_SOURCE=600 -DNDEBUG -UPEDANTIC -DALLOW_EXPERIMENTAL_API -MD -MQ 'drivers/a715181@@tmp_rte_pmd_mlx5 at sta/net_mlx5_mlx5.c.o' -MF 'drivers/a715181@@tmp_rte_pmd_mlx5 at sta/net_mlx5_mlx5.c.o.d' -o 'drivers/a715181@@tmp_rte_pmd_mlx5 at sta/net_mlx5_mlx5.c.o' -c ../drivers/net/mlx5/mlx5.c
../drivers/net/mlx5/mlx5.c:16:10: fatal error: 'linux/rtnetlink.h' file not found
#include <linux/rtnetlink.h>
         ^~~~~~~~~~~~~~~~~~~
1 error generated.
[10/592] Compiling C object 'drivers/a715181@@tmp_rte_pmd_mlx5 at sta/net_mlx5_mlx5_ethdev.c.o'.
FAILED: drivers/a715181@@tmp_rte_pmd_mlx5 at sta/net_mlx5_mlx5_ethdev.c.o 
ccache cc -Idrivers/a715181@@tmp_rte_pmd_mlx5 at sta -Idrivers -I../drivers -Idrivers/net/mlx5 -I../drivers/net/mlx5 -Ilib/librte_ethdev -I../lib/librte_ethdev -I. -I../ -Iconfig -I../config -Ilib/librte_eal/common/include -I../lib/librte_eal/common/include -I../lib/librte_eal/freebsd/eal/include -Ilib/librte_eal/common -I../lib/librte_eal/common -Ilib/librte_eal/common/include/arch/x86 -I../lib/librte_eal/common/include/arch/x86 -Ilib/librte_eal -I../lib/librte_eal -Ilib/librte_kvargs -I../lib/librte_kvargs -Ilib/librte_net -I../lib/librte_net -Ilib/librte_mbuf -I../lib/librte_mbuf -Ilib/librte_mempool -I../lib/librte_mempool -Ilib/librte_ring -I../lib/librte_ring -Ilib/librte_cmdline -I../lib/librte_cmdline -Ilib/librte_meter -I../lib/librte_meter -Idrivers/bus/pci -I../drivers/bus/pci -I../drivers/bus/pci/bsd -Ilib/librte_pci -I../lib/librte_pci -Idrivers/bus/vdev -I../drivers/bus/vdev -Xclang -fcolor-diagnostics -pipe -D_FILE_OFFSET_BITS=64 -Wall -Winvalid-pch -Werror -O3 -include rte_config.h -Wunused-parameter -Wsign-compare -Wcast-qual -Wno-address-of-packed-member -D_GNU_SOURCE -D__BSD_VISIBLE -fPIC -march=nehalem -Wextra -std=c11 -Wno-strict-prototypes -D_BSD_SOURCE -D_DEFAULT_SOURCE -D_XOPEN_SOURCE=600 -DNDEBUG -UPEDANTIC -DALLOW_EXPERIMENTAL_API -MD -MQ 'drivers/a715181@@tmp_rte_pmd_mlx5 at sta/net_mlx5_mlx5_ethdev.c.o' -MF 'drivers/a715181@@tmp_rte_pmd_mlx5 at sta/net_mlx5_mlx5_ethdev.c.o.d' -o 'drivers/a715181@@tmp_rte_pmd_mlx5 at sta/net_mlx5_mlx5_ethdev.c.o' -c ../drivers/net/mlx5/mlx5_ethdev.c
../drivers/net/mlx5/mlx5_ethdev.c:21:10: fatal error: 'linux/ethtool.h' file not found
#include <linux/ethtool.h>
         ^~~~~~~~~~~~~~~~~
1 error generated.
[11/592] Compiling C object 'drivers/a715181@@tmp_rte_pmd_mlx5 at sta/net_mlx5_mlx5_flow_dv.c.o'.
FAILED: drivers/a715181@@tmp_rte_pmd_mlx5 at sta/net_mlx5_mlx5_flow_dv.c.o 
ccache cc -Idrivers/a715181@@tmp_rte_pmd_mlx5 at sta -Idrivers -I../drivers -Idrivers/net/mlx5 -I../drivers/net/mlx5 -Ilib/librte_ethdev -I../lib/librte_ethdev -I. -I../ -Iconfig -I../config -Ilib/librte_eal/common/include -I../lib/librte_eal/common/include -I../lib/librte_eal/freebsd/eal/include -Ilib/librte_eal/common -I../lib/librte_eal/common -Ilib/librte_eal/common/include/arch/x86 -I../lib/librte_eal/common/include/arch/x86 -Ilib/librte_eal -I../lib/librte_eal -Ilib/librte_kvargs -I../lib/librte_kvargs -Ilib/librte_net -I../lib/librte_net -Ilib/librte_mbuf -I../lib/librte_mbuf -Ilib/librte_mempool -I../lib/librte_mempool -Ilib/librte_ring -I../lib/librte_ring -Ilib/librte_cmdline -I../lib/librte_cmdline -Ilib/librte_meter -I../lib/librte_meter -Idrivers/bus/pci -I../drivers/bus/pci -I../drivers/bus/pci/bsd -Ilib/librte_pci -I../lib/librte_pci -Idrivers/bus/vdev -I../drivers/bus/vdev -Xclang -fcolor-diagnostics -pipe -D_FILE_OFFSET_BITS=64 -Wall -Winvalid-pch -Werror -O3 -include rte_config.h -Wunused-parameter -Wsign-compare -Wcast-qual -Wno-address-of-packed-member -D_GNU_SOURCE -D__BSD_VISIBLE -fPIC -march=nehalem -Wextra -std=c11 -Wno-strict-prototypes -D_BSD_SOURCE -D_DEFAULT_SOURCE -D_XOPEN_SOURCE=600 -DNDEBUG -UPEDANTIC -DALLOW_EXPERIMENTAL_API -MD -MQ 'drivers/a715181@@tmp_rte_pmd_mlx5 at sta/net_mlx5_mlx5_flow_dv.c.o' -MF 'drivers/a715181@@tmp_rte_pmd_mlx5 at sta/net_mlx5_mlx5_flow_dv.c.o.d' -o 'drivers/a715181@@tmp_rte_pmd_mlx5 at sta/net_mlx5_mlx5_flow_dv.c.o' -c ../drivers/net/mlx5/mlx5_flow_dv.c
In file included from ../drivers/net/mlx5/mlx5_flow_dv.c:29:
In file included from ../drivers/net/mlx5/mlx5.h:36:
../drivers/net/mlx5/mlx5_mr.h:19:10: fatal error: 'infiniband/mlx5dv.h' file not found
#include <infiniband/mlx5dv.h>
         ^~~~~~~~~~~~~~~~~~~~~
1 error generated.
[12/592] Generating symbol file 'lib/76b5a35@@rte_pipeline at sha/librte_pipeline.so.3.1.symbols'.
ninja: build stopped: subcommand failed.
find: /tmp/FreeBSD12-64_K19.02_GCC7.3.0/x86_64-native-bsdapp-gcc/0717b48a769b4114a7f05779d534adc0/dpdk/build-x86-default/install-root: No such file or directory
usage: dirname string [...]
## Building cmdline
gmake: *** /tmp/FreeBSD12-64_K19.02_GCC7.3.0/x86_64-native-bsdapp-gcc/0717b48a769b4114a7f05779d534adc0/dpdk/build-x86-default/install-root/usr/local/share/dpdk/examples/cmdline: No such file or directory.  Stop.
## Building helloworld
gmake: *** /tmp/FreeBSD12-64_K19.02_GCC7.3.0/x86_64-native-bsdapp-gcc/0717b48a769b4114a7f05779d534adc0/dpdk/build-x86-default/install-root/usr/local/share/dpdk/examples/helloworld: No such file or directory.  Stop.
## Building l2fwd
gmake: *** /tmp/FreeBSD12-64_K19.02_GCC7.3.0/x86_64-native-bsdapp-gcc/0717b48a769b4114a7f05779d534adc0/dpdk/build-x86-default/install-root/usr/local/share/dpdk/examples/l2fwd: No such file or directory.  Stop.
## Building l3fwd
gmake: *** /tmp/FreeBSD12-64_K19.02_GCC7.3.0/x86_64-native-bsdapp-gcc/0717b48a769b4114a7f05779d534adc0/dpdk/build-x86-default/install-root/usr/local/share/dpdk/examples/l3fwd: No such file or directory.  Stop.
## Building skeleton
gmake: *** /tmp/FreeBSD12-64_K19.02_GCC7.3.0/x86_64-native-bsdapp-gcc/0717b48a769b4114a7f05779d534adc0/dpdk/build-x86-default/install-root/usr/local/share/dpdk/examples/skeleton: No such file or directory.  Stop.
## Building timer
gmake: *** /tmp/FreeBSD12-64_K19.02_GCC7.3.0/x86_64-native-bsdapp-gcc/0717b48a769b4114a7f05779d534adc0/dpdk/build-x86-default/install-root/usr/local/share/dpdk/examples/timer: No such file or directory.  Stop.

DPDK STV team


More information about the test-report mailing list