[dpdk-test-report] |FAILURE| pw56208[RFC, 01/13] add vhost normal enqueue function

sys_stv at intel.com sys_stv at intel.com
Tue Jul 9 11:24:59 CEST 2019


Test-Label: Intel-compilation
Test-Status: FAILURE
http://dpdk.org/patch/56208

_Compilation issues_

Submitter: Marvin Liu <yong.liu at intel.com>
Date: 2019-07-08 17:13:08
Reply_mail: 20190708171320.38802-2-yong.liu at intel.com
DPDK git baseline: Repo:dpdk-next-virtio, CommitID: 116ca7bbbc94620e93956c158866de7f9574cd24

Build Summary: 22 Builds Done, 20 Successful, 2 Failures

Meson Summary: 8 Builds Done, 7 Successful, 1 Failures



Test environment and configuration as below:

**Make Build**


OS: RHEL76-64
	Kernel Version: 3.10.0-957.el7.x86_64
	CPU info: Intel(R) Xeon(R) CPU E5-2699 v4 @ 2.20GHz
	GCC Version: gcc (GCC) 4.8.5 20150623 (Red Hat 4.8.5-36)
	Clang Version: NA
	x86_64-native-linuxapp-gcc


OS: CENTOS76-64
	Kernel Version: 3.10.0-957.10.1.el7.x86_64
	CPU info: Intel(R) Xeon(R) CPU E5-2699 v4 @ 2.20GHz
	GCC Version: gcc (GCC) 4.8.5 20150623 (Red Hat 4.8.5-36)
	Clang Version: 3.4.2 (tags/RELEASE_34/dot2-final)
	x86_64-native-linuxapp-gcc


OS: UB1804-64
	Kernel Version: 4.15.0-20-generic
	CPU info: Intel(R) Xeon(R) CPU E5-2699 v3 @ 2.30GHz
	GCC Version: gcc (Ubuntu 7.3.0-27ubuntu1~18.04) 7.3.0
	Clang Version: 6.0.0-1ubuntu2 (tags/RELEASE_600/final)
	x86_64-native-linuxapp-icc
	x86_64-native-linuxapp-clang
	x86_64-native-linuxapp-gcc


OS: UB1904-64
	Kernel Version: 5.0.0-13-generic
	CPU info: Intel(R) Xeon(R) CPU E5-2699 v3 @ 2.30GHz
	GCC Version: gcc (Ubuntu 8.3.0-6ubuntu1) 8.3.0
	Clang Version: 8.0.0-3 (tags/RELEASE_800/final)
	x86_64-native-linuxapp-gcc


OS: UB1604-32
	Kernel Version: 4.4.0-131-generic
	CPU info: Intel(R) Xeon(R) CPU E5-2699 v3 @ 2.30GHz
	GCC Version: gcc (Ubuntu 5.4.0-6ubuntu1~16.04.11) 5.4.0 20160609
	Clang Version: 3.8.0-2ubuntu4 (tags/RELEASE_380/final)
	i686-native-linuxapp-gcc


OS: UB1604-64
	Kernel Version: 4.4.0-47-generic
	CPU info: Intel(R) Xeon(R) CPU E5-2699 v3 @ 2.30GHz
	GCC Version: gcc (Ubuntu 5.4.0-6ubuntu1~16.04.10) 5.4.0 20160609
	Clang Version: 3.8.0-2ubuntu4 (tags/RELEASE_380/final)
	x86_64-native-linuxapp-clang
	x86_64-native-linuxapp-gcc


OS: FreeBSD12-64
	Kernel Version: 12.0-RC3
	CPU info: Intel(R) Xeon(R) CPU E5-2699 v4 @ 2.20GHz (2194.98-MHz K8-class CPU)
	GCC Version: gcc (FreeBSD Ports Collection) 7.3.0
	Clang Version: 6.0.1 (tags/RELEASE_601/final 335540) (based on LLVM 6.0.1)
	x86_64-native-bsdapp-gcc+debug
	x86_64-native-bsdapp-gcc+shared
	x86_64-native-bsdapp-gcc
	x86_64-native-bsdapp-clang


OS: RHEL80-64
	Kernel Version: 4.18.0-80.el8.x86_64
	CPU info: Intel(R) Xeon(R) CPU E5-2699 v4 @ 2.20GHz
	GCC Version: gcc (GCC) 8.2.1 20180905 (Red Hat 8.2.1-3)
	Clang Version: NA
	x86_64-native-linuxapp-gcc+debug
	x86_64-native-linuxapp-icc
	x86_64-native-linuxapp-gcc+shared
	x86_64-native-linuxapp-clang
	x86_64-native-linuxapp-gcc


OS: SUSE15-64
	Kernel Version: 4.12.14-lp150.11-default
	CPU info: Intel(R) Xeon(R) CPU E5-2699 v4 @ 2.20GHz
	GCC Version: gcc (SUSE Linux) 7.3.1 20180323 [gcc-7-branch revision 258812]
	Clang Version: 5.0.1 (tags/RELEASE_501/final 312548)
	x86_64-native-linuxapp-gcc
	x86_64-native-linuxapp-clang


OS: FD30-64
	Kernel Version: 5.1.7-300.fc30.x86_64
	CPU info: Intel(R) Xeon(R) CPU E5-2699 v4 @ 2.20GHz
	GCC Version: gcc (GCC) 9.1.1 20190503 (Red Hat 9.1.1-1)
	Clang Version: 8.0.0 (Fedora 8.0.0-1.fc30)
	x86_64-native-linuxapp-gcc
	x86_64-native-linuxapp-clang


**Meson Build**


OS: UB1804-64
	Kernel Version: 4.15.0-20-generic
	CPU info: Intel(R) Xeon(R) CPU E5-2699 v4 @ 2.20GHz
	GCC Version: gcc (Ubuntu 7.3.0-27ubuntu1~18.04) 7.3.0
	Clang Version: 6.0.0-1ubuntu2 (tags/RELEASE_600/final)
	x86_64-native-linuxapp-doc
	build-gcc-static
	build-gcc-shared
	build-clang-static
	build-clang-shared
	build-x86-default


OS: UB1604-32
	Kernel Version: 4.4.0-131-generic
	CPU info: Intel(R) Xeon(R) CPU E5-2699 v4 @ 2.20GHz
	GCC Version: gcc (Ubuntu 5.4.0-6ubuntu1~16.04.11) 5.4.0 20160609
	Clang Version: 3.8.0-2ubuntu4 (tags/RELEASE_380/final)
	build-gcc-static
	build-gcc-shared
	build-clang-static
	build-clang-shared
	build-x86-default


OS: WIN10-64
	Kernel Version: N/A
	CPU info: N/A
	GCC Version: N/A
	Clang Version: Clang 8.0.0
	x86_64-windows-clang


OS: FreeBSD12-64
	Kernel Version: 12.0-RC3
	CPU info: Intel(R) Xeon(R) CPU E5-2699 v4 @ 2.20GHz (2194.99-MHz K8-class CPU)
	GCC Version: gcc (FreeBSD Ports Collection) 7.3.0
	Clang Version: 6.0.1 (tags/RELEASE_601/final 335540) (based on LLVM 6.0.1)
	build-gcc-static
	build-gcc-shared
	build-clang-static
	build-clang-shared
	build-x86-default


OS: RHEL80-64
	Kernel Version: 4.18.0-80.el8.x86_64
	CPU info: Intel(R) Xeon(R) CPU E5-2699 v4 @ 2.20GHz
	GCC Version: gcc (GCC) 8.2.1 20180905 (Red Hat 8.2.1-3)
	Clang Version: NA
	build-gcc-static
	build-gcc-shared
	build-x86-default


OS: SUSE15-64
	Kernel Version: 4.12.14-lp150.11-default
	CPU info: Intel(R) Xeon(R) CPU E5-2699 v4 @ 2.20GHz
	GCC Version: gcc (SUSE Linux) 7.3.1 20180323 [gcc-7-branch revision 258812]
	Clang Version: 5.0.1 (tags/RELEASE_501/final 312548)
	build-gcc-static
	build-gcc-shared
	build-clang-static
	build-clang-shared
	build-x86-default


OS: FD30-64
	Kernel Version: 5.0.9-301.fc30.x86_64
	CPU info: Intel(R) Xeon(R) CPU E5-2699 v4 @ 2.20GHz
	GCC Version: gcc (GCC) 9.1.1 20190503 (Red Hat 9.1.1-1)
	Clang Version: 8.0.0 (Fedora 8.0.0-1.fc30)
	build-gcc-static
	build-gcc-shared
	build-clang-static
	build-clang-shared
	build-x86-default


*Make Build Failed #1:
OS: UB1804-64
Target: x86_64-native-linuxapp-icc
  PMDINFO dpaa2_qdma.o.pmd.c
  CC dpaa2_qdma.o.pmd.o
  CC opae_at24_eeprom.o
  CC opae_eth_group.o
compilation aborted for /tmp/UB1804-64_K4.15.0_ICC19.0.0/x86_64-native-linuxapp-icc/c6cd90584bb04918b9c0355068cea573/dpdk/drivers/raw/ioat/ioat_rawdev_test.c (code 1)
/tmp/UB1804-64_K4.15.0_ICC19.0.0/x86_64-native-linuxapp-icc/c6cd90584bb04918b9c0355068cea573/dpdk/mk/internal/rte.compile-pre.mk:114: recipe for target 'ioat_rawdev_test.o' failed
make[6]: *** [ioat_rawdev_test.o] Error 1
/tmp/UB1804-64_K4.15.0_ICC19.0.0/x86_64-native-linuxapp-icc/c6cd90584bb04918b9c0355068cea573/dpdk/mk/rte.subdir.mk:35: recipe for target 'ioat' failed
make[5]: *** [ioat] Error 2
make[5]: *** Waiting for unfinished jobs....
  CC ifpga_rawdev.o
  LD dpaa2_qdma.o
  AR librte_pmd_dpaa2_qdma.a
  INSTALL-LIB librte_pmd_dpaa2_qdma.a
--
  CC ifpga_rawdev.o.pmd.o
  LD ifpga_rawdev.o
  AR librte_pmd_ifpga_rawdev.a
  INSTALL-LIB librte_pmd_ifpga_rawdev.a
make[6]: warning:  Clock skew detected.  Your build may be incomplete.
/tmp/UB1804-64_K4.15.0_ICC19.0.0/x86_64-native-linuxapp-icc/c6cd90584bb04918b9c0355068cea573/dpdk/mk/rte.subdir.mk:35: recipe for target 'raw' failed
make[4]: *** [raw] Error 2
/tmp/UB1804-64_K4.15.0_ICC19.0.0/x86_64-native-linuxapp-icc/c6cd90584bb04918b9c0355068cea573/dpdk/mk/rte.sdkbuild.mk:46: recipe for target 'drivers' failed
make[3]: *** [drivers] Error 2
/tmp/UB1804-64_K4.15.0_ICC19.0.0/x86_64-native-linuxapp-icc/c6cd90584bb04918b9c0355068cea573/dpdk/mk/rte.sdkroot.mk:98: recipe for target 'all' failed
make[2]: *** [all] Error 2
/tmp/UB1804-64_K4.15.0_ICC19.0.0/x86_64-native-linuxapp-icc/c6cd90584bb04918b9c0355068cea573/dpdk/mk/rte.sdkinstall.mk:60: recipe for target 'pre_install' failed
make[1]: *** [pre_install] Error 2
/tmp/UB1804-64_K4.15.0_ICC19.0.0/x86_64-native-linuxapp-icc/c6cd90584bb04918b9c0355068cea573/dpdk/mk/rte.sdkroot.mk:77: recipe for target 'install' failed
make: *** [install] Error 2


*Make Build Failed #2:
OS: RHEL80-64
Target: x86_64-native-linuxapp-icc
  CC skeleton_rawdev.o.pmd.o
  CC ifpga_fme_iperf.o
  CC ifpga_fme_dperf.o
/tmp/RHEL80-64_K3.10.0_ICC19.0.0/x86_64-native-linuxapp-icc/c6cd90584bb04918b9c0355068cea573/dpdk/drivers/raw/ioat/ioat_rawdev_test.c(27): (col. 9) error #13203: No EMMS instruction before call to function
compilation aborted for /tmp/RHEL80-64_K3.10.0_ICC19.0.0/x86_64-native-linuxapp-icc/c6cd90584bb04918b9c0355068cea573/dpdk/drivers/raw/ioat/ioat_rawdev_test.c (code 1)
make[6]: *** [/tmp/RHEL80-64_K3.10.0_ICC19.0.0/x86_64-native-linuxapp-icc/c6cd90584bb04918b9c0355068cea573/dpdk/mk/internal/rte.compile-pre.mk:116: ioat_rawdev_test.o] Error 1
make[6]: *** Waiting for unfinished jobs....
  CC ifpga_fme_error.o
  LD ioat_rawdev.o
  PMDINFO dpaa2_qdma.o.pmd.c
  CC dpaa2_qdma.o.pmd.o
  CC ifpga_port.o
make[5]: *** [/tmp/RHEL80-64_K3.10.0_ICC19.0.0/x86_64-native-linuxapp-icc/c6cd90584bb04918b9c0355068cea573/dpdk/mk/rte.subdir.mk:37: ioat] Error 2
make[5]: *** Waiting for unfinished jobs....
  LD dpaa2_cmdif.o
  CC ifpga_port_error.o
  CC opae_hw_api.o
  AR librte_pmd_dpaa2_cmdif.a
--
  PMDINFO ifpga_rawdev.o.pmd.c
  CC ifpga_rawdev.o.pmd.o
  LD ifpga_rawdev.o
  AR librte_pmd_ifpga_rawdev.a
  INSTALL-LIB librte_pmd_ifpga_rawdev.a
make[4]: *** [/tmp/RHEL80-64_K3.10.0_ICC19.0.0/x86_64-native-linuxapp-icc/c6cd90584bb04918b9c0355068cea573/dpdk/mk/rte.subdir.mk:37: raw] Error 2
make[3]: *** [/tmp/RHEL80-64_K3.10.0_ICC19.0.0/x86_64-native-linuxapp-icc/c6cd90584bb04918b9c0355068cea573/dpdk/mk/rte.sdkbuild.mk:46: drivers] Error 2
make[2]: *** [/tmp/RHEL80-64_K3.10.0_ICC19.0.0/x86_64-native-linuxapp-icc/c6cd90584bb04918b9c0355068cea573/dpdk/mk/rte.sdkroot.mk:99: all] Error 2
make[1]: *** [/tmp/RHEL80-64_K3.10.0_ICC19.0.0/x86_64-native-linuxapp-icc/c6cd90584bb04918b9c0355068cea573/dpdk/mk/rte.sdkinstall.mk:61: pre_install] Error 2
make: *** [/tmp/RHEL80-64_K3.10.0_ICC19.0.0/x86_64-native-linuxapp-icc/c6cd90584bb04918b9c0355068cea573/dpdk/mk/rte.sdkroot.mk:77: install] Error 2

*Meson Build Failed #1:
OS: FreeBSD12-64
Target:build-gcc-static
Has header "linux/virtio_scsi.h" : NO
Message: Skipping example "vhost_scsi"
Library virt found: YES
Dependency jansson found: YES (cached)

examples/meson.build:88:4: ERROR: Problem encountered: Missing dependency "power" for example "vm_power_manager"

A full log can be found at /tmp/FreeBSD12-64_K19.02_GCC7.3.0/x86_64-native-bsdapp-gcc/c6cd90584bb04918b9c0355068cea573/dpdk/build-gcc-static/meson-logs/meson-log.txt
ninja -C build-gcc-static
ninja: Entering directory `build-gcc-static'
ninja: error: loading 'build.ninja': No such file or directory
--
Has header "linux/virtio_scsi.h" : NO
Message: Skipping example "vhost_scsi"
Library virt found: YES
Dependency jansson found: YES (cached)

examples/meson.build:88:4: ERROR: Problem encountered: Missing dependency "power" for example "vm_power_manager"

A full log can be found at /tmp/FreeBSD12-64_K19.02_GCC7.3.0/x86_64-native-bsdapp-gcc/c6cd90584bb04918b9c0355068cea573/dpdk/build-gcc-shared/meson-logs/meson-log.txt
ninja -C build-gcc-shared
ninja: Entering directory `build-gcc-shared'
ninja: error: loading 'build.ninja': No such file or directory
--
[849/1404] Compiling C object 'drivers/a715181@@rte_pmd_ixgbe at sta/meson-generated_.._rte_pmd_ixgbe.pmd.c.o'.
[850/1404] Linking static target drivers/librte_pmd_ixgbe.a.
[851/1404] Compiling C object 'drivers/a715181@@rte_pmd_ixgbe at sha/meson-generated_.._rte_pmd_ixgbe.pmd.c.o'.
[852/1404] Linking target drivers/librte_pmd_ixgbe.so.2.1.
[853/1404] Compiling C object 'drivers/a715181@@tmp_rte_pmd_mlx5 at sta/net_mlx5_mlx5_flow_dv.c.o'.
FAILED: drivers/a715181@@tmp_rte_pmd_mlx5 at sta/net_mlx5_mlx5_flow_dv.c.o 
ccache clang -Idrivers/a715181@@tmp_rte_pmd_mlx5 at sta -Idrivers -I../drivers -Idrivers/net/mlx5 -I../drivers/net/mlx5 -Ilib/librte_ethdev -I../lib/librte_ethdev -I. -I../ -Iconfig -I../config -Ilib/librte_eal/common/include -I../lib/librte_eal/common/include -I../lib/librte_eal/freebsd/eal/include -Ilib/librte_eal/common -I../lib/librte_eal/common -Ilib/librte_eal/common/include/arch/x86 -I../lib/librte_eal/common/include/arch/x86 -Ilib/librte_eal -I../lib/librte_eal -Ilib/librte_kvargs -I../lib/librte_kvargs -Ilib/librte_net -I../lib/librte_net -Ilib/librte_mbuf -I../lib/librte_mbuf -Ilib/librte_mempool -I../lib/librte_mempool -Ilib/librte_ring -I../lib/librte_ring -Ilib/librte_cmdline -I../lib/librte_cmdline -Ilib/librte_meter -I../lib/librte_meter -Idrivers/bus/pci -I../drivers/bus/pci -I../drivers/bus/pci/bsd -Ilib/librte_pci -I../lib/librte_pci -Idrivers/bus/vdev -I../drivers/bus/vdev -Xclang -fcolor-diagnostics -pipe -D_FILE_OFFSET_BITS=64 -Wall -Winvalid-pch -Werror -O3 -include rte_config.h -Wunused-parameter -Wsign-compare -Wcast-qual -Wno-address-of-packed-member -D_GNU_SOURCE -D__BSD_VISIBLE -fPIC -march=native -Wextra -std=c11 -Wno-strict-prototypes -D_BSD_SOURCE -D_DEFAULT_SOURCE -D_XOPEN_SOURCE=600 -DNDEBUG -UPEDANTIC -DALLOW_EXPERIMENTAL_API -MD -MQ 'drivers/a715181@@tmp_rte_pmd_mlx5 at sta/net_mlx5_mlx5_flow_dv.c.o' -MF 'drivers/a715181@@tmp_rte_pmd_mlx5 at sta/net_mlx5_mlx5_flow_dv.c.o.d' -o 'drivers/a715181@@tmp_rte_pmd_mlx5 at sta/net_mlx5_mlx5_flow_dv.c.o' -c ../drivers/net/mlx5/mlx5_flow_dv.c
In file included from ../drivers/net/mlx5/mlx5_flow_dv.c:29:
In file included from ../drivers/net/mlx5/mlx5.h:35:
../drivers/net/mlx5/mlx5_mr.h:19:10: fatal error: 'infiniband/mlx5dv.h' file not found
#include <infiniband/mlx5dv.h>
         ^~~~~~~~~~~~~~~~~~~~~
1 error generated.
[854/1404] Compiling C object 'drivers/a715181@@tmp_rte_pmd_mlx5 at sta/net_mlx5_mlx5_flow.c.o'.
FAILED: drivers/a715181@@tmp_rte_pmd_mlx5 at sta/net_mlx5_mlx5_flow.c.o 
ccache clang -Idrivers/a715181@@tmp_rte_pmd_mlx5 at sta -Idrivers -I../drivers -Idrivers/net/mlx5 -I../drivers/net/mlx5 -Ilib/librte_ethdev -I../lib/librte_ethdev -I. -I../ -Iconfig -I../config -Ilib/librte_eal/common/include -I../lib/librte_eal/common/include -I../lib/librte_eal/freebsd/eal/include -Ilib/librte_eal/common -I../lib/librte_eal/common -Ilib/librte_eal/common/include/arch/x86 -I../lib/librte_eal/common/include/arch/x86 -Ilib/librte_eal -I../lib/librte_eal -Ilib/librte_kvargs -I../lib/librte_kvargs -Ilib/librte_net -I../lib/librte_net -Ilib/librte_mbuf -I../lib/librte_mbuf -Ilib/librte_mempool -I../lib/librte_mempool -Ilib/librte_ring -I../lib/librte_ring -Ilib/librte_cmdline -I../lib/librte_cmdline -Ilib/librte_meter -I../lib/librte_meter -Idrivers/bus/pci -I../drivers/bus/pci -I../drivers/bus/pci/bsd -Ilib/librte_pci -I../lib/librte_pci -Idrivers/bus/vdev -I../drivers/bus/vdev -Xclang -fcolor-diagnostics -pipe -D_FILE_OFFSET_BITS=64 -Wall -Winvalid-pch -Werror -O3 -include rte_config.h -Wunused-parameter -Wsign-compare -Wcast-qual -Wno-address-of-packed-member -D_GNU_SOURCE -D__BSD_VISIBLE -fPIC -march=native -Wextra -std=c11 -Wno-strict-prototypes -D_BSD_SOURCE -D_DEFAULT_SOURCE -D_XOPEN_SOURCE=600 -DNDEBUG -UPEDANTIC -DALLOW_EXPERIMENTAL_API -MD -MQ 'drivers/a715181@@tmp_rte_pmd_mlx5 at sta/net_mlx5_mlx5_flow.c.o' -MF 'drivers/a715181@@tmp_rte_pmd_mlx5 at sta/net_mlx5_mlx5_flow.c.o.d' -o 'drivers/a715181@@tmp_rte_pmd_mlx5 at sta/net_mlx5_mlx5_flow.c.o' -c ../drivers/net/mlx5/mlx5_flow.c
In file included from ../drivers/net/mlx5/mlx5_flow.c:30:
In file included from ../drivers/net/mlx5/mlx5.h:35:
../drivers/net/mlx5/mlx5_mr.h:19:10: fatal error: 'infiniband/mlx5dv.h' file not found
#include <infiniband/mlx5dv.h>
         ^~~~~~~~~~~~~~~~~~~~~
1 error generated.
[855/1404] Compiling C object 'drivers/a715181@@tmp_rte_pmd_mlx5 at sta/net_mlx5_mlx5.c.o'.
FAILED: drivers/a715181@@tmp_rte_pmd_mlx5 at sta/net_mlx5_mlx5.c.o 
ccache clang -Idrivers/a715181@@tmp_rte_pmd_mlx5 at sta -Idrivers -I../drivers -Idrivers/net/mlx5 -I../drivers/net/mlx5 -Ilib/librte_ethdev -I../lib/librte_ethdev -I. -I../ -Iconfig -I../config -Ilib/librte_eal/common/include -I../lib/librte_eal/common/include -I../lib/librte_eal/freebsd/eal/include -Ilib/librte_eal/common -I../lib/librte_eal/common -Ilib/librte_eal/common/include/arch/x86 -I../lib/librte_eal/common/include/arch/x86 -Ilib/librte_eal -I../lib/librte_eal -Ilib/librte_kvargs -I../lib/librte_kvargs -Ilib/librte_net -I../lib/librte_net -Ilib/librte_mbuf -I../lib/librte_mbuf -Ilib/librte_mempool -I../lib/librte_mempool -Ilib/librte_ring -I../lib/librte_ring -Ilib/librte_cmdline -I../lib/librte_cmdline -Ilib/librte_meter -I../lib/librte_meter -Idrivers/bus/pci -I../drivers/bus/pci -I../drivers/bus/pci/bsd -Ilib/librte_pci -I../lib/librte_pci -Idrivers/bus/vdev -I../drivers/bus/vdev -Xclang -fcolor-diagnostics -pipe -D_FILE_OFFSET_BITS=64 -Wall -Winvalid-pch -Werror -O3 -include rte_config.h -Wunused-parameter -Wsign-compare -Wcast-qual -Wno-address-of-packed-member -D_GNU_SOURCE -D__BSD_VISIBLE -fPIC -march=native -Wextra -std=c11 -Wno-strict-prototypes -D_BSD_SOURCE -D_DEFAULT_SOURCE -D_XOPEN_SOURCE=600 -DNDEBUG -UPEDANTIC -DALLOW_EXPERIMENTAL_API -MD -MQ 'drivers/a715181@@tmp_rte_pmd_mlx5 at sta/net_mlx5_mlx5.c.o' -MF 'drivers/a715181@@tmp_rte_pmd_mlx5 at sta/net_mlx5_mlx5.c.o.d' -o 'drivers/a715181@@tmp_rte_pmd_mlx5 at sta/net_mlx5_mlx5.c.o' -c ../drivers/net/mlx5/mlx5.c
../drivers/net/mlx5/mlx5.c:16:10: fatal error: 'linux/rtnetlink.h' file not found
#include <linux/rtnetlink.h>
         ^~~~~~~~~~~~~~~~~~~
1 error generated.
[856/1404] Compiling C object 'drivers/a715181@@tmp_rte_pmd_mlx5 at sta/net_mlx5_mlx5_ethdev.c.o'.
FAILED: drivers/a715181@@tmp_rte_pmd_mlx5 at sta/net_mlx5_mlx5_ethdev.c.o 
ccache clang -Idrivers/a715181@@tmp_rte_pmd_mlx5 at sta -Idrivers -I../drivers -Idrivers/net/mlx5 -I../drivers/net/mlx5 -Ilib/librte_ethdev -I../lib/librte_ethdev -I. -I../ -Iconfig -I../config -Ilib/librte_eal/common/include -I../lib/librte_eal/common/include -I../lib/librte_eal/freebsd/eal/include -Ilib/librte_eal/common -I../lib/librte_eal/common -Ilib/librte_eal/common/include/arch/x86 -I../lib/librte_eal/common/include/arch/x86 -Ilib/librte_eal -I../lib/librte_eal -Ilib/librte_kvargs -I../lib/librte_kvargs -Ilib/librte_net -I../lib/librte_net -Ilib/librte_mbuf -I../lib/librte_mbuf -Ilib/librte_mempool -I../lib/librte_mempool -Ilib/librte_ring -I../lib/librte_ring -Ilib/librte_cmdline -I../lib/librte_cmdline -Ilib/librte_meter -I../lib/librte_meter -Idrivers/bus/pci -I../drivers/bus/pci -I../drivers/bus/pci/bsd -Ilib/librte_pci -I../lib/librte_pci -Idrivers/bus/vdev -I../drivers/bus/vdev -Xclang -fcolor-diagnostics -pipe -D_FILE_OFFSET_BITS=64 -Wall -Winvalid-pch -Werror -O3 -include rte_config.h -Wunused-parameter -Wsign-compare -Wcast-qual -Wno-address-of-packed-member -D_GNU_SOURCE -D__BSD_VISIBLE -fPIC -march=native -Wextra -std=c11 -Wno-strict-prototypes -D_BSD_SOURCE -D_DEFAULT_SOURCE -D_XOPEN_SOURCE=600 -DNDEBUG -UPEDANTIC -DALLOW_EXPERIMENTAL_API -MD -MQ 'drivers/a715181@@tmp_rte_pmd_mlx5 at sta/net_mlx5_mlx5_ethdev.c.o' -MF 'drivers/a715181@@tmp_rte_pmd_mlx5 at sta/net_mlx5_mlx5_ethdev.c.o.d' -o 'drivers/a715181@@tmp_rte_pmd_mlx5 at sta/net_mlx5_mlx5_ethdev.c.o' -c ../drivers/net/mlx5/mlx5_ethdev.c
../drivers/net/mlx5/mlx5_ethdev.c:20:10: fatal error: 'linux/ethtool.h' file not found
#include <linux/ethtool.h>
         ^~~~~~~~~~~~~~~~~
1 error generated.
[857/1404] Compiling C object 'drivers/a715181@@tmp_rte_pmd_mlx5 at sta/net_mlx5_mlx5_flow_verbs.c.o'.
FAILED: drivers/a715181@@tmp_rte_pmd_mlx5 at sta/net_mlx5_mlx5_flow_verbs.c.o 
ccache clang -Idrivers/a715181@@tmp_rte_pmd_mlx5 at sta -Idrivers -I../drivers -Idrivers/net/mlx5 -I../drivers/net/mlx5 -Ilib/librte_ethdev -I../lib/librte_ethdev -I. -I../ -Iconfig -I../config -Ilib/librte_eal/common/include -I../lib/librte_eal/common/include -I../lib/librte_eal/freebsd/eal/include -Ilib/librte_eal/common -I../lib/librte_eal/common -Ilib/librte_eal/common/include/arch/x86 -I../lib/librte_eal/common/include/arch/x86 -Ilib/librte_eal -I../lib/librte_eal -Ilib/librte_kvargs -I../lib/librte_kvargs -Ilib/librte_net -I../lib/librte_net -Ilib/librte_mbuf -I../lib/librte_mbuf -Ilib/librte_mempool -I../lib/librte_mempool -Ilib/librte_ring -I../lib/librte_ring -Ilib/librte_cmdline -I../lib/librte_cmdline -Ilib/librte_meter -I../lib/librte_meter -Idrivers/bus/pci -I../drivers/bus/pci -I../drivers/bus/pci/bsd -Ilib/librte_pci -I../lib/librte_pci -Idrivers/bus/vdev -I../drivers/bus/vdev -Xclang -fcolor-diagnostics -pipe -D_FILE_OFFSET_BITS=64 -Wall -Winvalid-pch -Werror -O3 -include rte_config.h -Wunused-parameter -Wsign-compare -Wcast-qual -Wno-address-of-packed-member -D_GNU_SOURCE -D__BSD_VISIBLE -fPIC -march=native -Wextra -std=c11 -Wno-strict-prototypes -D_BSD_SOURCE -D_DEFAULT_SOURCE -D_XOPEN_SOURCE=600 -DNDEBUG -UPEDANTIC -DALLOW_EXPERIMENTAL_API -MD -MQ 'drivers/a715181@@tmp_rte_pmd_mlx5 at sta/net_mlx5_mlx5_flow_verbs.c.o' -MF 'drivers/a715181@@tmp_rte_pmd_mlx5 at sta/net_mlx5_mlx5_flow_verbs.c.o.d' -o 'drivers/a715181@@tmp_rte_pmd_mlx5 at sta/net_mlx5_mlx5_flow_verbs.c.o' -c ../drivers/net/mlx5/mlx5_flow_verbs.c
In file included from ../drivers/net/mlx5/mlx5_flow_verbs.c:29:
In file included from ../drivers/net/mlx5/mlx5.h:35:
../drivers/net/mlx5/mlx5_mr.h:19:10: fatal error: 'infiniband/mlx5dv.h' file not found
#include <infiniband/mlx5dv.h>
         ^~~~~~~~~~~~~~~~~~~~~
1 error generated.
[858/1404] Compiling C object 'drivers/a715181@@tmp_rte_pmd_mlx5 at sta/net_mlx5_mlx5_mac.c.o'.
FAILED: drivers/a715181@@tmp_rte_pmd_mlx5 at sta/net_mlx5_mlx5_mac.c.o 
ccache clang -Idrivers/a715181@@tmp_rte_pmd_mlx5 at sta -Idrivers -I../drivers -Idrivers/net/mlx5 -I../drivers/net/mlx5 -Ilib/librte_ethdev -I../lib/librte_ethdev -I. -I../ -Iconfig -I../config -Ilib/librte_eal/common/include -I../lib/librte_eal/common/include -I../lib/librte_eal/freebsd/eal/include -Ilib/librte_eal/common -I../lib/librte_eal/common -Ilib/librte_eal/common/include/arch/x86 -I../lib/librte_eal/common/include/arch/x86 -Ilib/librte_eal -I../lib/librte_eal -Ilib/librte_kvargs -I../lib/librte_kvargs -Ilib/librte_net -I../lib/librte_net -Ilib/librte_mbuf -I../lib/librte_mbuf -Ilib/librte_mempool -I../lib/librte_mempool -Ilib/librte_ring -I../lib/librte_ring -Ilib/librte_cmdline -I../lib/librte_cmdline -Ilib/librte_meter -I../lib/librte_meter -Idrivers/bus/pci -I../drivers/bus/pci -I../drivers/bus/pci/bsd -Ilib/librte_pci -I../lib/librte_pci -Idrivers/bus/vdev -I../drivers/bus/vdev -Xclang -fcolor-diagnostics -pipe -D_FILE_OFFSET_BITS=64 -Wall -Winvalid-pch -Werror -O3 -include rte_config.h -Wunused-parameter -Wsign-compare -Wcast-qual -Wno-address-of-packed-member -D_GNU_SOURCE -D__BSD_VISIBLE -fPIC -march=native -Wextra -std=c11 -Wno-strict-prototypes -D_BSD_SOURCE -D_DEFAULT_SOURCE -D_XOPEN_SOURCE=600 -DNDEBUG -UPEDANTIC -DALLOW_EXPERIMENTAL_API -MD -MQ 'drivers/a715181@@tmp_rte_pmd_mlx5 at sta/net_mlx5_mlx5_mac.c.o' -MF 'drivers/a715181@@tmp_rte_pmd_mlx5 at sta/net_mlx5_mlx5_mac.c.o.d' -o 'drivers/a715181@@tmp_rte_pmd_mlx5 at sta/net_mlx5_mlx5_mac.c.o' -c ../drivers/net/mlx5/mlx5_mac.c
In file included from ../drivers/net/mlx5/mlx5_mac.c:30:
In file included from ../drivers/net/mlx5/mlx5.h:35:
../drivers/net/mlx5/mlx5_mr.h:19:10: fatal error: 'infiniband/mlx5dv.h' file not found
#include <infiniband/mlx5dv.h>
         ^~~~~~~~~~~~~~~~~~~~~
1 error generated.
ninja: build stopped: subcommand failed.
meson --werror -Dexamples=all --default-library=shared /tmp/FreeBSD12-64_K19.02_GCC7.3.0/x86_64-native-bsdapp-gcc/c6cd90584bb04918b9c0355068cea573/dpdk/devtools/.. build-clang-shared
The Meson build system
Version: 0.50.1
Source dir: /tmp/FreeBSD12-64_K19.02_GCC7.3.0/x86_64-native-bsdapp-gcc/c6cd90584bb04918b9c0355068cea573/dpdk
Build dir: /tmp/FreeBSD12-64_K19.02_GCC7.3.0/x86_64-native-bsdapp-gcc/c6cd90584bb04918b9c0355068cea573/dpdk/build-clang-shared
--
[869/1425] Generating symbol file 'drivers/a715181@@rte_pmd_i40e at sha/librte_pmd_i40e.so.2.1.symbols'.
[870/1425] Compiling C object 'drivers/a715181@@rte_pmd_ixgbe at sha/meson-generated_.._rte_pmd_ixgbe.pmd.c.o'.
[871/1425] Linking target drivers/librte_pmd_liquidio.so.1.1.
[872/1425] Linking target drivers/librte_pmd_ixgbe.so.2.1.
[873/1425] Compiling C object 'drivers/a715181@@tmp_rte_pmd_mlx5 at sta/net_mlx5_mlx5_flow.c.o'.
FAILED: drivers/a715181@@tmp_rte_pmd_mlx5 at sta/net_mlx5_mlx5_flow.c.o 
ccache clang -Idrivers/a715181@@tmp_rte_pmd_mlx5 at sta -Idrivers -I../drivers -Idrivers/net/mlx5 -I../drivers/net/mlx5 -Ilib/librte_ethdev -I../lib/librte_ethdev -I. -I../ -Iconfig -I../config -Ilib/librte_eal/common/include -I../lib/librte_eal/common/include -I../lib/librte_eal/freebsd/eal/include -Ilib/librte_eal/common -I../lib/librte_eal/common -Ilib/librte_eal/common/include/arch/x86 -I../lib/librte_eal/common/include/arch/x86 -Ilib/librte_eal -I../lib/librte_eal -Ilib/librte_kvargs -I../lib/librte_kvargs -Ilib/librte_net -I../lib/librte_net -Ilib/librte_mbuf -I../lib/librte_mbuf -Ilib/librte_mempool -I../lib/librte_mempool -Ilib/librte_ring -I../lib/librte_ring -Ilib/librte_cmdline -I../lib/librte_cmdline -Ilib/librte_meter -I../lib/librte_meter -Idrivers/bus/pci -I../drivers/bus/pci -I../drivers/bus/pci/bsd -Ilib/librte_pci -I../lib/librte_pci -Idrivers/bus/vdev -I../drivers/bus/vdev -Xclang -fcolor-diagnostics -pipe -D_FILE_OFFSET_BITS=64 -Wall -Winvalid-pch -Werror -O3 -include rte_config.h -Wunused-parameter -Wsign-compare -Wcast-qual -Wno-address-of-packed-member -D_GNU_SOURCE -D__BSD_VISIBLE -fPIC -march=native -Wextra -std=c11 -Wno-strict-prototypes -D_BSD_SOURCE -D_DEFAULT_SOURCE -D_XOPEN_SOURCE=600 -DNDEBUG -UPEDANTIC -DALLOW_EXPERIMENTAL_API -MD -MQ 'drivers/a715181@@tmp_rte_pmd_mlx5 at sta/net_mlx5_mlx5_flow.c.o' -MF 'drivers/a715181@@tmp_rte_pmd_mlx5 at sta/net_mlx5_mlx5_flow.c.o.d' -o 'drivers/a715181@@tmp_rte_pmd_mlx5 at sta/net_mlx5_mlx5_flow.c.o' -c ../drivers/net/mlx5/mlx5_flow.c
In file included from ../drivers/net/mlx5/mlx5_flow.c:30:
In file included from ../drivers/net/mlx5/mlx5.h:35:
../drivers/net/mlx5/mlx5_mr.h:19:10: fatal error: 'infiniband/mlx5dv.h' file not found
#include <infiniband/mlx5dv.h>
         ^~~~~~~~~~~~~~~~~~~~~
1 error generated.
[874/1425] Compiling C object 'drivers/a715181@@tmp_rte_pmd_mlx5 at sta/net_mlx5_mlx5.c.o'.
FAILED: drivers/a715181@@tmp_rte_pmd_mlx5 at sta/net_mlx5_mlx5.c.o 
ccache clang -Idrivers/a715181@@tmp_rte_pmd_mlx5 at sta -Idrivers -I../drivers -Idrivers/net/mlx5 -I../drivers/net/mlx5 -Ilib/librte_ethdev -I../lib/librte_ethdev -I. -I../ -Iconfig -I../config -Ilib/librte_eal/common/include -I../lib/librte_eal/common/include -I../lib/librte_eal/freebsd/eal/include -Ilib/librte_eal/common -I../lib/librte_eal/common -Ilib/librte_eal/common/include/arch/x86 -I../lib/librte_eal/common/include/arch/x86 -Ilib/librte_eal -I../lib/librte_eal -Ilib/librte_kvargs -I../lib/librte_kvargs -Ilib/librte_net -I../lib/librte_net -Ilib/librte_mbuf -I../lib/librte_mbuf -Ilib/librte_mempool -I../lib/librte_mempool -Ilib/librte_ring -I../lib/librte_ring -Ilib/librte_cmdline -I../lib/librte_cmdline -Ilib/librte_meter -I../lib/librte_meter -Idrivers/bus/pci -I../drivers/bus/pci -I../drivers/bus/pci/bsd -Ilib/librte_pci -I../lib/librte_pci -Idrivers/bus/vdev -I../drivers/bus/vdev -Xclang -fcolor-diagnostics -pipe -D_FILE_OFFSET_BITS=64 -Wall -Winvalid-pch -Werror -O3 -include rte_config.h -Wunused-parameter -Wsign-compare -Wcast-qual -Wno-address-of-packed-member -D_GNU_SOURCE -D__BSD_VISIBLE -fPIC -march=native -Wextra -std=c11 -Wno-strict-prototypes -D_BSD_SOURCE -D_DEFAULT_SOURCE -D_XOPEN_SOURCE=600 -DNDEBUG -UPEDANTIC -DALLOW_EXPERIMENTAL_API -MD -MQ 'drivers/a715181@@tmp_rte_pmd_mlx5 at sta/net_mlx5_mlx5.c.o' -MF 'drivers/a715181@@tmp_rte_pmd_mlx5 at sta/net_mlx5_mlx5.c.o.d' -o 'drivers/a715181@@tmp_rte_pmd_mlx5 at sta/net_mlx5_mlx5.c.o' -c ../drivers/net/mlx5/mlx5.c
../drivers/net/mlx5/mlx5.c:16:10: fatal error: 'linux/rtnetlink.h' file not found
#include <linux/rtnetlink.h>
         ^~~~~~~~~~~~~~~~~~~
1 error generated.
[875/1425] Compiling C object 'drivers/a715181@@tmp_rte_pmd_mlx5 at sta/net_mlx5_mlx5_ethdev.c.o'.
FAILED: drivers/a715181@@tmp_rte_pmd_mlx5 at sta/net_mlx5_mlx5_ethdev.c.o 
ccache clang -Idrivers/a715181@@tmp_rte_pmd_mlx5 at sta -Idrivers -I../drivers -Idrivers/net/mlx5 -I../drivers/net/mlx5 -Ilib/librte_ethdev -I../lib/librte_ethdev -I. -I../ -Iconfig -I../config -Ilib/librte_eal/common/include -I../lib/librte_eal/common/include -I../lib/librte_eal/freebsd/eal/include -Ilib/librte_eal/common -I../lib/librte_eal/common -Ilib/librte_eal/common/include/arch/x86 -I../lib/librte_eal/common/include/arch/x86 -Ilib/librte_eal -I../lib/librte_eal -Ilib/librte_kvargs -I../lib/librte_kvargs -Ilib/librte_net -I../lib/librte_net -Ilib/librte_mbuf -I../lib/librte_mbuf -Ilib/librte_mempool -I../lib/librte_mempool -Ilib/librte_ring -I../lib/librte_ring -Ilib/librte_cmdline -I../lib/librte_cmdline -Ilib/librte_meter -I../lib/librte_meter -Idrivers/bus/pci -I../drivers/bus/pci -I../drivers/bus/pci/bsd -Ilib/librte_pci -I../lib/librte_pci -Idrivers/bus/vdev -I../drivers/bus/vdev -Xclang -fcolor-diagnostics -pipe -D_FILE_OFFSET_BITS=64 -Wall -Winvalid-pch -Werror -O3 -include rte_config.h -Wunused-parameter -Wsign-compare -Wcast-qual -Wno-address-of-packed-member -D_GNU_SOURCE -D__BSD_VISIBLE -fPIC -march=native -Wextra -std=c11 -Wno-strict-prototypes -D_BSD_SOURCE -D_DEFAULT_SOURCE -D_XOPEN_SOURCE=600 -DNDEBUG -UPEDANTIC -DALLOW_EXPERIMENTAL_API -MD -MQ 'drivers/a715181@@tmp_rte_pmd_mlx5 at sta/net_mlx5_mlx5_ethdev.c.o' -MF 'drivers/a715181@@tmp_rte_pmd_mlx5 at sta/net_mlx5_mlx5_ethdev.c.o.d' -o 'drivers/a715181@@tmp_rte_pmd_mlx5 at sta/net_mlx5_mlx5_ethdev.c.o' -c ../drivers/net/mlx5/mlx5_ethdev.c
../drivers/net/mlx5/mlx5_ethdev.c:20:10: fatal error: 'linux/ethtool.h' file not found
#include <linux/ethtool.h>
         ^~~~~~~~~~~~~~~~~
1 error generated.
[876/1425] Compiling C object 'drivers/a715181@@tmp_rte_pmd_mlx5 at sta/net_mlx5_mlx5_flow_dv.c.o'.
FAILED: drivers/a715181@@tmp_rte_pmd_mlx5 at sta/net_mlx5_mlx5_flow_dv.c.o 
ccache clang -Idrivers/a715181@@tmp_rte_pmd_mlx5 at sta -Idrivers -I../drivers -Idrivers/net/mlx5 -I../drivers/net/mlx5 -Ilib/librte_ethdev -I../lib/librte_ethdev -I. -I../ -Iconfig -I../config -Ilib/librte_eal/common/include -I../lib/librte_eal/common/include -I../lib/librte_eal/freebsd/eal/include -Ilib/librte_eal/common -I../lib/librte_eal/common -Ilib/librte_eal/common/include/arch/x86 -I../lib/librte_eal/common/include/arch/x86 -Ilib/librte_eal -I../lib/librte_eal -Ilib/librte_kvargs -I../lib/librte_kvargs -Ilib/librte_net -I../lib/librte_net -Ilib/librte_mbuf -I../lib/librte_mbuf -Ilib/librte_mempool -I../lib/librte_mempool -Ilib/librte_ring -I../lib/librte_ring -Ilib/librte_cmdline -I../lib/librte_cmdline -Ilib/librte_meter -I../lib/librte_meter -Idrivers/bus/pci -I../drivers/bus/pci -I../drivers/bus/pci/bsd -Ilib/librte_pci -I../lib/librte_pci -Idrivers/bus/vdev -I../drivers/bus/vdev -Xclang -fcolor-diagnostics -pipe -D_FILE_OFFSET_BITS=64 -Wall -Winvalid-pch -Werror -O3 -include rte_config.h -Wunused-parameter -Wsign-compare -Wcast-qual -Wno-address-of-packed-member -D_GNU_SOURCE -D__BSD_VISIBLE -fPIC -march=native -Wextra -std=c11 -Wno-strict-prototypes -D_BSD_SOURCE -D_DEFAULT_SOURCE -D_XOPEN_SOURCE=600 -DNDEBUG -UPEDANTIC -DALLOW_EXPERIMENTAL_API -MD -MQ 'drivers/a715181@@tmp_rte_pmd_mlx5 at sta/net_mlx5_mlx5_flow_dv.c.o' -MF 'drivers/a715181@@tmp_rte_pmd_mlx5 at sta/net_mlx5_mlx5_flow_dv.c.o.d' -o 'drivers/a715181@@tmp_rte_pmd_mlx5 at sta/net_mlx5_mlx5_flow_dv.c.o' -c ../drivers/net/mlx5/mlx5_flow_dv.c
In file included from ../drivers/net/mlx5/mlx5_flow_dv.c:29:
In file included from ../drivers/net/mlx5/mlx5.h:35:
../drivers/net/mlx5/mlx5_mr.h:19:10: fatal error: 'infiniband/mlx5dv.h' file not found
#include <infiniband/mlx5dv.h>
         ^~~~~~~~~~~~~~~~~~~~~
1 error generated.
[877/1425] Generating symbol file 'drivers/a715181@@rte_pmd_ixgbe at sha/librte_pmd_ixgbe.so.2.1.symbols'.
[878/1425] Compiling C object 'drivers/a715181@@tmp_rte_pmd_mlx5 at sta/net_mlx5_mlx5_flow_verbs.c.o'.
FAILED: drivers/a715181@@tmp_rte_pmd_mlx5 at sta/net_mlx5_mlx5_flow_verbs.c.o 
ccache clang -Idrivers/a715181@@tmp_rte_pmd_mlx5 at sta -Idrivers -I../drivers -Idrivers/net/mlx5 -I../drivers/net/mlx5 -Ilib/librte_ethdev -I../lib/librte_ethdev -I. -I../ -Iconfig -I../config -Ilib/librte_eal/common/include -I../lib/librte_eal/common/include -I../lib/librte_eal/freebsd/eal/include -Ilib/librte_eal/common -I../lib/librte_eal/common -Ilib/librte_eal/common/include/arch/x86 -I../lib/librte_eal/common/include/arch/x86 -Ilib/librte_eal -I../lib/librte_eal -Ilib/librte_kvargs -I../lib/librte_kvargs -Ilib/librte_net -I../lib/librte_net -Ilib/librte_mbuf -I../lib/librte_mbuf -Ilib/librte_mempool -I../lib/librte_mempool -Ilib/librte_ring -I../lib/librte_ring -Ilib/librte_cmdline -I../lib/librte_cmdline -Ilib/librte_meter -I../lib/librte_meter -Idrivers/bus/pci -I../drivers/bus/pci -I../drivers/bus/pci/bsd -Ilib/librte_pci -I../lib/librte_pci -Idrivers/bus/vdev -I../drivers/bus/vdev -Xclang -fcolor-diagnostics -pipe -D_FILE_OFFSET_BITS=64 -Wall -Winvalid-pch -Werror -O3 -include rte_config.h -Wunused-parameter -Wsign-compare -Wcast-qual -Wno-address-of-packed-member -D_GNU_SOURCE -D__BSD_VISIBLE -fPIC -march=native -Wextra -std=c11 -Wno-strict-prototypes -D_BSD_SOURCE -D_DEFAULT_SOURCE -D_XOPEN_SOURCE=600 -DNDEBUG -UPEDANTIC -DALLOW_EXPERIMENTAL_API -MD -MQ 'drivers/a715181@@tmp_rte_pmd_mlx5 at sta/net_mlx5_mlx5_flow_verbs.c.o' -MF 'drivers/a715181@@tmp_rte_pmd_mlx5 at sta/net_mlx5_mlx5_flow_verbs.c.o.d' -o 'drivers/a715181@@tmp_rte_pmd_mlx5 at sta/net_mlx5_mlx5_flow_verbs.c.o' -c ../drivers/net/mlx5/mlx5_flow_verbs.c
In file included from ../drivers/net/mlx5/mlx5_flow_verbs.c:29:
In file included from ../drivers/net/mlx5/mlx5.h:35:
../drivers/net/mlx5/mlx5_mr.h:19:10: fatal error: 'infiniband/mlx5dv.h' file not found
#include <infiniband/mlx5dv.h>
         ^~~~~~~~~~~~~~~~~~~~~
1 error generated.
ninja: build stopped: subcommand failed.
meson --werror -Dexamples=all -Dlibdir=lib -Dmachine=nehalem --default-library=shared /tmp/FreeBSD12-64_K19.02_GCC7.3.0/x86_64-native-bsdapp-gcc/c6cd90584bb04918b9c0355068cea573/dpdk/devtools/.. build-x86-default
The Meson build system
Version: 0.50.1
Source dir: /tmp/FreeBSD12-64_K19.02_GCC7.3.0/x86_64-native-bsdapp-gcc/c6cd90584bb04918b9c0355068cea573/dpdk
Build dir: /tmp/FreeBSD12-64_K19.02_GCC7.3.0/x86_64-native-bsdapp-gcc/c6cd90584bb04918b9c0355068cea573/dpdk/build-x86-default
--
[536/1429] Generating symbol file 'drivers/a715181@@rte_bus_vdev at sha/librte_bus_vdev.so.2.1.symbols'.
[537/1429] Linking target lib/librte_pipeline.so.3.1.
[538/1429] Linking target drivers/librte_mempool_ring.so.1.1.
[539/1429] Linking target drivers/librte_pmd_ark.so.1.1.
[540/1429] Compiling C object 'drivers/a715181@@tmp_rte_pmd_mlx5 at sta/net_mlx5_mlx5_devx_cmds.c.o'.
FAILED: drivers/a715181@@tmp_rte_pmd_mlx5 at sta/net_mlx5_mlx5_devx_cmds.c.o 
ccache cc -Idrivers/a715181@@tmp_rte_pmd_mlx5 at sta -Idrivers -I../drivers -Idrivers/net/mlx5 -I../drivers/net/mlx5 -Ilib/librte_ethdev -I../lib/librte_ethdev -I. -I../ -Iconfig -I../config -Ilib/librte_eal/common/include -I../lib/librte_eal/common/include -I../lib/librte_eal/freebsd/eal/include -Ilib/librte_eal/common -I../lib/librte_eal/common -Ilib/librte_eal/common/include/arch/x86 -I../lib/librte_eal/common/include/arch/x86 -Ilib/librte_eal -I../lib/librte_eal -Ilib/librte_kvargs -I../lib/librte_kvargs -Ilib/librte_net -I../lib/librte_net -Ilib/librte_mbuf -I../lib/librte_mbuf -Ilib/librte_mempool -I../lib/librte_mempool -Ilib/librte_ring -I../lib/librte_ring -Ilib/librte_cmdline -I../lib/librte_cmdline -Ilib/librte_meter -I../lib/librte_meter -Idrivers/bus/pci -I../drivers/bus/pci -I../drivers/bus/pci/bsd -Ilib/librte_pci -I../lib/librte_pci -Idrivers/bus/vdev -I../drivers/bus/vdev -Xclang -fcolor-diagnostics -pipe -D_FILE_OFFSET_BITS=64 -Wall -Winvalid-pch -Werror -O3 -include rte_config.h -Wunused-parameter -Wsign-compare -Wcast-qual -Wno-address-of-packed-member -D_GNU_SOURCE -D__BSD_VISIBLE -fPIC -march=nehalem -Wextra -std=c11 -Wno-strict-prototypes -D_BSD_SOURCE -D_DEFAULT_SOURCE -D_XOPEN_SOURCE=600 -DNDEBUG -UPEDANTIC -DALLOW_EXPERIMENTAL_API -MD -MQ 'drivers/a715181@@tmp_rte_pmd_mlx5 at sta/net_mlx5_mlx5_devx_cmds.c.o' -MF 'drivers/a715181@@tmp_rte_pmd_mlx5 at sta/net_mlx5_mlx5_devx_cmds.c.o.d' -o 'drivers/a715181@@tmp_rte_pmd_mlx5 at sta/net_mlx5_mlx5_devx_cmds.c.o' -c ../drivers/net/mlx5/mlx5_devx_cmds.c
In file included from ../drivers/net/mlx5/mlx5_devx_cmds.c:6:
In file included from ../drivers/net/mlx5/mlx5.h:35:
../drivers/net/mlx5/mlx5_mr.h:19:10: fatal error: 'infiniband/mlx5dv.h' file not found
#include <infiniband/mlx5dv.h>
         ^~~~~~~~~~~~~~~~~~~~~
1 error generated.
[541/1429] Linking target drivers/librte_pmd_atlantic.so.1.1.
[542/1429] Linking target drivers/librte_pmd_bond.so.2.1.
[543/1429] Linking target drivers/librte_pmd_bnx2x.so.1.1.
[544/1429] Generating symbol file 'drivers/a715181@@rte_mempool_octeontx at sha/librte_mempool_octeontx.so.1.1.symbols'.
[545/1429] Generating symbol file 'drivers/a715181@@rte_mempool_octeontx2 at sha/librte_mempool_octeontx2.so.1.1.symbols'.
ninja: build stopped: subcommand failed.
ninja: Entering directory `build-x86-default'
[1/886] Linking target lib/librte_flow_classify.so.1.1.
[2/886] Linking target drivers/librte_pmd_bnxt.so.2.1.
[3/886] Linking target drivers/librte_pmd_cxgbe.so.1.1.
[4/886] Compiling C object 'drivers/a715181@@tmp_rte_pmd_mlx5 at sta/net_mlx5_mlx5_devx_cmds.c.o'.
FAILED: drivers/a715181@@tmp_rte_pmd_mlx5 at sta/net_mlx5_mlx5_devx_cmds.c.o 
ccache cc -Idrivers/a715181@@tmp_rte_pmd_mlx5 at sta -Idrivers -I../drivers -Idrivers/net/mlx5 -I../drivers/net/mlx5 -Ilib/librte_ethdev -I../lib/librte_ethdev -I. -I../ -Iconfig -I../config -Ilib/librte_eal/common/include -I../lib/librte_eal/common/include -I../lib/librte_eal/freebsd/eal/include -Ilib/librte_eal/common -I../lib/librte_eal/common -Ilib/librte_eal/common/include/arch/x86 -I../lib/librte_eal/common/include/arch/x86 -Ilib/librte_eal -I../lib/librte_eal -Ilib/librte_kvargs -I../lib/librte_kvargs -Ilib/librte_net -I../lib/librte_net -Ilib/librte_mbuf -I../lib/librte_mbuf -Ilib/librte_mempool -I../lib/librte_mempool -Ilib/librte_ring -I../lib/librte_ring -Ilib/librte_cmdline -I../lib/librte_cmdline -Ilib/librte_meter -I../lib/librte_meter -Idrivers/bus/pci -I../drivers/bus/pci -I../drivers/bus/pci/bsd -Ilib/librte_pci -I../lib/librte_pci -Idrivers/bus/vdev -I../drivers/bus/vdev -Xclang -fcolor-diagnostics -pipe -D_FILE_OFFSET_BITS=64 -Wall -Winvalid-pch -Werror -O3 -include rte_config.h -Wunused-parameter -Wsign-compare -Wcast-qual -Wno-address-of-packed-member -D_GNU_SOURCE -D__BSD_VISIBLE -fPIC -march=nehalem -Wextra -std=c11 -Wno-strict-prototypes -D_BSD_SOURCE -D_DEFAULT_SOURCE -D_XOPEN_SOURCE=600 -DNDEBUG -UPEDANTIC -DALLOW_EXPERIMENTAL_API -MD -MQ 'drivers/a715181@@tmp_rte_pmd_mlx5 at sta/net_mlx5_mlx5_devx_cmds.c.o' -MF 'drivers/a715181@@tmp_rte_pmd_mlx5 at sta/net_mlx5_mlx5_devx_cmds.c.o.d' -o 'drivers/a715181@@tmp_rte_pmd_mlx5 at sta/net_mlx5_mlx5_devx_cmds.c.o' -c ../drivers/net/mlx5/mlx5_devx_cmds.c
In file included from ../drivers/net/mlx5/mlx5_devx_cmds.c:6:
In file included from ../drivers/net/mlx5/mlx5.h:35:
../drivers/net/mlx5/mlx5_mr.h:19:10: fatal error: 'infiniband/mlx5dv.h' file not found
#include <infiniband/mlx5dv.h>
         ^~~~~~~~~~~~~~~~~~~~~
1 error generated.
[5/886] Compiling C object 'drivers/a715181@@tmp_rte_pmd_mlx5 at sta/net_mlx5_mlx5_rxtx_vec.c.o'.
FAILED: drivers/a715181@@tmp_rte_pmd_mlx5 at sta/net_mlx5_mlx5_rxtx_vec.c.o 
ccache cc -Idrivers/a715181@@tmp_rte_pmd_mlx5 at sta -Idrivers -I../drivers -Idrivers/net/mlx5 -I../drivers/net/mlx5 -Ilib/librte_ethdev -I../lib/librte_ethdev -I. -I../ -Iconfig -I../config -Ilib/librte_eal/common/include -I../lib/librte_eal/common/include -I../lib/librte_eal/freebsd/eal/include -Ilib/librte_eal/common -I../lib/librte_eal/common -Ilib/librte_eal/common/include/arch/x86 -I../lib/librte_eal/common/include/arch/x86 -Ilib/librte_eal -I../lib/librte_eal -Ilib/librte_kvargs -I../lib/librte_kvargs -Ilib/librte_net -I../lib/librte_net -Ilib/librte_mbuf -I../lib/librte_mbuf -Ilib/librte_mempool -I../lib/librte_mempool -Ilib/librte_ring -I../lib/librte_ring -Ilib/librte_cmdline -I../lib/librte_cmdline -Ilib/librte_meter -I../lib/librte_meter -Idrivers/bus/pci -I../drivers/bus/pci -I../drivers/bus/pci/bsd -Ilib/librte_pci -I../lib/librte_pci -Idrivers/bus/vdev -I../drivers/bus/vdev -Xclang -fcolor-diagnostics -pipe -D_FILE_OFFSET_BITS=64 -Wall -Winvalid-pch -Werror -O3 -include rte_config.h -Wunused-parameter -Wsign-compare -Wcast-qual -Wno-address-of-packed-member -D_GNU_SOURCE -D__BSD_VISIBLE -fPIC -march=nehalem -Wextra -std=c11 -Wno-strict-prototypes -D_BSD_SOURCE -D_DEFAULT_SOURCE -D_XOPEN_SOURCE=600 -DNDEBUG -UPEDANTIC -DALLOW_EXPERIMENTAL_API -MD -MQ 'drivers/a715181@@tmp_rte_pmd_mlx5 at sta/net_mlx5_mlx5_rxtx_vec.c.o' -MF 'drivers/a715181@@tmp_rte_pmd_mlx5 at sta/net_mlx5_mlx5_rxtx_vec.c.o.d' -o 'drivers/a715181@@tmp_rte_pmd_mlx5 at sta/net_mlx5_mlx5_rxtx_vec.c.o' -c ../drivers/net/mlx5/mlx5_rxtx_vec.c
../drivers/net/mlx5/mlx5_rxtx_vec.c:17:10: fatal error: 'infiniband/mlx5dv.h' file not found
#include <infiniband/mlx5dv.h>
         ^~~~~~~~~~~~~~~~~~~~~
1 error generated.
[6/886] Generating symbol file 'lib/76b5a35@@rte_pipeline at sha/librte_pipeline.so.3.1.symbols'.
[7/886] Generating symbol file 'drivers/a715181@@rte_pmd_bond at sha/librte_pmd_bond.so.2.1.symbols'.
[8/886] Generating symbol file 'lib/76b5a35@@rte_flow_classify at sha/librte_flow_classify.so.1.1.symbols'.
[9/886] Generating symbol file 'drivers/a715181@@rte_pmd_bnxt at sha/librte_pmd_bnxt.so.2.1.symbols'.
ninja: build stopped: subcommand failed.
find: /tmp/FreeBSD12-64_K19.02_GCC7.3.0/x86_64-native-bsdapp-gcc/c6cd90584bb04918b9c0355068cea573/dpdk/build-x86-default/install-root: No such file or directory
usage: dirname string [...]
## Building cmdline
gmake: *** /tmp/FreeBSD12-64_K19.02_GCC7.3.0/x86_64-native-bsdapp-gcc/c6cd90584bb04918b9c0355068cea573/dpdk/build-x86-default/install-root/usr/local/share/dpdk/examples/cmdline: No such file or directory.  Stop.
## Building helloworld
gmake: *** /tmp/FreeBSD12-64_K19.02_GCC7.3.0/x86_64-native-bsdapp-gcc/c6cd90584bb04918b9c0355068cea573/dpdk/build-x86-default/install-root/usr/local/share/dpdk/examples/helloworld: No such file or directory.  Stop.
## Building l2fwd
gmake: *** /tmp/FreeBSD12-64_K19.02_GCC7.3.0/x86_64-native-bsdapp-gcc/c6cd90584bb04918b9c0355068cea573/dpdk/build-x86-default/install-root/usr/local/share/dpdk/examples/l2fwd: No such file or directory.  Stop.
## Building l3fwd
gmake: *** /tmp/FreeBSD12-64_K19.02_GCC7.3.0/x86_64-native-bsdapp-gcc/c6cd90584bb04918b9c0355068cea573/dpdk/build-x86-default/install-root/usr/local/share/dpdk/examples/l3fwd: No such file or directory.  Stop.
## Building skeleton
gmake: *** /tmp/FreeBSD12-64_K19.02_GCC7.3.0/x86_64-native-bsdapp-gcc/c6cd90584bb04918b9c0355068cea573/dpdk/build-x86-default/install-root/usr/local/share/dpdk/examples/skeleton: No such file or directory.  Stop.
## Building timer
gmake: *** /tmp/FreeBSD12-64_K19.02_GCC7.3.0/x86_64-native-bsdapp-gcc/c6cd90584bb04918b9c0355068cea573/dpdk/build-x86-default/install-root/usr/local/share/dpdk/examples/timer: No such file or directory.  Stop.

DPDK STV team


More information about the test-report mailing list