[dpdk-test-report] |FAILURE| pw56320[v7] net/i40e: i40e get link status update from ipn3ke

sys_stv at intel.com sys_stv at intel.com
Thu Jul 11 14:00:23 CEST 2019


Test-Label: Intel-compilation
Test-Status: FAILURE
http://dpdk.org/patch/56320

_Compilation issues_

Submitter: Andy Pei <andy.pei at intel.com>
Date: 2019-07-11 06:39:23
Reply_mail: 1562827163-199199-1-git-send-email-andy.pei at intel.com
DPDK git baseline: Repo:dpdk-next-net-intel, CommitID: ae6a5047c3d8f7cc5765b14553ea11b3d72c6315

Build Summary: 22 Builds Done, 4 Successful, 18 Failures

Meson Summary: 8 Builds Done, 2 Successful, 6 Failures



Test environment and configuration as below:

**Make Build**


OS: RHEL76-64
	Kernel Version: 3.10.0-957.el7.x86_64
	CPU info: Intel(R) Xeon(R) CPU E5-2699 v4 @ 2.20GHz
	GCC Version: gcc (GCC) 4.8.5 20150623 (Red Hat 4.8.5-36)
	Clang Version: NA
	x86_64-native-linuxapp-gcc


OS: CENTOS76-64
	Kernel Version: 3.10.0-957.10.1.el7.x86_64
	CPU info: Intel(R) Xeon(R) CPU E5-2699 v4 @ 2.20GHz
	GCC Version: gcc (GCC) 4.8.5 20150623 (Red Hat 4.8.5-36)
	Clang Version: 3.4.2 (tags/RELEASE_34/dot2-final)
	x86_64-native-linuxapp-gcc


OS: UB1804-64
	Kernel Version: 4.15.0-20-generic
	CPU info: Intel(R) Xeon(R) CPU E5-2699 v3 @ 2.30GHz
	GCC Version: gcc (Ubuntu 7.3.0-27ubuntu1~18.04) 7.3.0
	Clang Version: 6.0.0-1ubuntu2 (tags/RELEASE_600/final)
	x86_64-native-linuxapp-icc
	x86_64-native-linuxapp-clang
	x86_64-native-linuxapp-gcc


OS: UB1904-64
	Kernel Version: 5.0.0-13-generic
	CPU info: Intel(R) Xeon(R) CPU E5-2699 v3 @ 2.30GHz
	GCC Version: gcc (Ubuntu 8.3.0-6ubuntu1) 8.3.0
	Clang Version: 8.0.0-3 (tags/RELEASE_800/final)
	x86_64-native-linuxapp-gcc


OS: UB1604-32
	Kernel Version: 4.4.0-131-generic
	CPU info: Intel(R) Xeon(R) CPU E5-2699 v3 @ 2.30GHz
	GCC Version: gcc (Ubuntu 5.4.0-6ubuntu1~16.04.11) 5.4.0 20160609
	Clang Version: 3.8.0-2ubuntu4 (tags/RELEASE_380/final)
	i686-native-linuxapp-gcc


OS: UB1604-64
	Kernel Version: 4.4.0-47-generic
	CPU info: Intel(R) Xeon(R) CPU E5-2699 v3 @ 2.30GHz
	GCC Version: gcc (Ubuntu 5.4.0-6ubuntu1~16.04.10) 5.4.0 20160609
	Clang Version: 3.8.0-2ubuntu4 (tags/RELEASE_380/final)
	x86_64-native-linuxapp-clang
	x86_64-native-linuxapp-gcc


OS: FreeBSD12-64
	Kernel Version: 12.0-RC3
	CPU info: Intel(R) Xeon(R) CPU E5-2699 v4 @ 2.20GHz (2194.98-MHz K8-class CPU)
	GCC Version: gcc (FreeBSD Ports Collection) 7.3.0
	Clang Version: 6.0.1 (tags/RELEASE_601/final 335540) (based on LLVM 6.0.1)
	x86_64-native-bsdapp-gcc+debug
	x86_64-native-bsdapp-gcc+shared
	x86_64-native-bsdapp-gcc
	x86_64-native-bsdapp-clang


OS: RHEL80-64
	Kernel Version: 4.18.0-80.el8.x86_64
	CPU info: Intel(R) Xeon(R) CPU E5-2699 v4 @ 2.20GHz
	GCC Version: gcc (GCC) 8.2.1 20180905 (Red Hat 8.2.1-3)
	Clang Version: NA
	x86_64-native-linuxapp-gcc+debug
	x86_64-native-linuxapp-icc
	x86_64-native-linuxapp-clang
	x86_64-native-linuxapp-gcc+shared
	x86_64-native-linuxapp-gcc


OS: SUSE15-64
	Kernel Version: 4.12.14-lp150.11-default
	CPU info: Intel(R) Xeon(R) CPU E5-2699 v4 @ 2.20GHz
	GCC Version: gcc (SUSE Linux) 7.3.1 20180323 [gcc-7-branch revision 258812]
	Clang Version: 5.0.1 (tags/RELEASE_501/final 312548)
	x86_64-native-linuxapp-gcc
	x86_64-native-linuxapp-clang


OS: FD30-64
	Kernel Version: 5.1.7-300.fc30.x86_64
	CPU info: Intel(R) Xeon(R) CPU E5-2699 v4 @ 2.20GHz
	GCC Version: gcc (GCC) 9.1.1 20190503 (Red Hat 9.1.1-1)
	Clang Version: 8.0.0 (Fedora 8.0.0-1.fc30)
	x86_64-native-linuxapp-gcc
	x86_64-native-linuxapp-clang


**Meson Build**


OS: UB1804-64
	Kernel Version: 4.15.0-20-generic
	CPU info: Intel(R) Xeon(R) CPU E5-2699 v4 @ 2.20GHz
	GCC Version: gcc (Ubuntu 7.3.0-27ubuntu1~18.04) 7.3.0
	Clang Version: 6.0.0-1ubuntu2 (tags/RELEASE_600/final)
	x86_64-native-linuxapp-doc
	build-gcc-static
	build-gcc-shared
	build-clang-static
	build-clang-shared
	build-x86-default


OS: UB1604-32
	Kernel Version: 4.4.0-131-generic
	CPU info: Intel(R) Xeon(R) CPU E5-2699 v4 @ 2.20GHz
	GCC Version: gcc (Ubuntu 5.4.0-6ubuntu1~16.04.11) 5.4.0 20160609
	Clang Version: 3.8.0-2ubuntu4 (tags/RELEASE_380/final)
	build-gcc-static
	build-gcc-shared
	build-clang-static
	build-clang-shared
	build-x86-default


OS: WIN10-64
	Kernel Version: N/A
	CPU info: N/A
	GCC Version: N/A
	Clang Version: Clang 8.0.0
	x86_64-windows-clang


OS: FreeBSD12-64
	Kernel Version: 12.0-RC3
	CPU info: Intel(R) Xeon(R) CPU E5-2699 v4 @ 2.20GHz (2194.99-MHz K8-class CPU)
	GCC Version: gcc (FreeBSD Ports Collection) 7.3.0
	Clang Version: 6.0.1 (tags/RELEASE_601/final 335540) (based on LLVM 6.0.1)
	build-gcc-static
	build-gcc-shared
	build-clang-static
	build-clang-shared
	build-x86-default


OS: RHEL80-64
	Kernel Version: 4.18.0-80.el8.x86_64
	CPU info: Intel(R) Xeon(R) CPU E5-2699 v4 @ 2.20GHz
	GCC Version: gcc (GCC) 8.2.1 20180905 (Red Hat 8.2.1-3)
	Clang Version: NA
	build-gcc-static
	build-gcc-shared
	build-x86-default


OS: SUSE15-64
	Kernel Version: 4.12.14-lp150.11-default
	CPU info: Intel(R) Xeon(R) CPU E5-2699 v4 @ 2.20GHz
	GCC Version: gcc (SUSE Linux) 7.3.1 20180323 [gcc-7-branch revision 258812]
	Clang Version: 5.0.1 (tags/RELEASE_501/final 312548)
	build-gcc-static
	build-gcc-shared
	build-clang-static
	build-clang-shared
	build-x86-default


OS: FD30-64
	Kernel Version: 5.0.9-301.fc30.x86_64
	CPU info: Intel(R) Xeon(R) CPU E5-2699 v4 @ 2.20GHz
	GCC Version: gcc (GCC) 9.1.1 20190503 (Red Hat 9.1.1-1)
	Clang Version: 8.0.0 (Fedora 8.0.0-1.fc30)
	build-gcc-static
	build-gcc-shared
	build-clang-static
	build-clang-shared
	build-x86-default


*Make Build Failed #1:
OS: UB1604-64
Target: x86_64-native-linuxapp-clang
                     ~~~~^
/tmp/UB1604-64_K4.4.0_Clang3.8.0/x86_64-native-linuxapp-clang/8eb286a0310b4fdeb443d364ee53ad6d/dpdk/x86_64-native-linuxapp-clang/include/rte_eal.h:75:9: note: forward declaration of 'struct rte_mem_config'
        struct rte_mem_config *mem_config;
               ^
1 error generated.
/tmp/UB1604-64_K4.4.0_Clang3.8.0/x86_64-native-linuxapp-clang/8eb286a0310b4fdeb443d364ee53ad6d/dpdk/mk/internal/rte.compile-pre.mk:114: recipe for target 'rte_eth_memif.o' failed
make[6]: *** [rte_eth_memif.o] Error 1
/tmp/UB1604-64_K4.4.0_Clang3.8.0/x86_64-native-linuxapp-clang/8eb286a0310b4fdeb443d364ee53ad6d/dpdk/mk/rte.subdir.mk:35: recipe for target 'memif' failed
make[5]: *** [memif] Error 2
make[5]: *** Waiting for unfinished jobs....
  PMDINFO lio_ethdev.o.pmd.c
  CC lio_ethdev.o.pmd.o
  CC ixgbe_x540.o
  CC virtio_rxtx.o
--
  CC i40e_ethdev_vf.o.pmd.o
  LD i40e_ethdev_vf.o
  AR librte_pmd_i40e.a
  INSTALL-LIB librte_pmd_i40e.a
make[6]: warning:  Clock skew detected.  Your build may be incomplete.
/tmp/UB1604-64_K4.4.0_Clang3.8.0/x86_64-native-linuxapp-clang/8eb286a0310b4fdeb443d364ee53ad6d/dpdk/mk/rte.subdir.mk:35: recipe for target 'net' failed
make[4]: *** [net] Error 2
/tmp/UB1604-64_K4.4.0_Clang3.8.0/x86_64-native-linuxapp-clang/8eb286a0310b4fdeb443d364ee53ad6d/dpdk/mk/rte.sdkbuild.mk:46: recipe for target 'drivers' failed
make[3]: *** [drivers] Error 2
/tmp/UB1604-64_K4.4.0_Clang3.8.0/x86_64-native-linuxapp-clang/8eb286a0310b4fdeb443d364ee53ad6d/dpdk/mk/rte.sdkroot.mk:98: recipe for target 'all' failed
make[2]: *** [all] Error 2
/tmp/UB1604-64_K4.4.0_Clang3.8.0/x86_64-native-linuxapp-clang/8eb286a0310b4fdeb443d364ee53ad6d/dpdk/mk/rte.sdkinstall.mk:60: recipe for target 'pre_install' failed
make[1]: *** [pre_install] Error 2
/tmp/UB1604-64_K4.4.0_Clang3.8.0/x86_64-native-linuxapp-clang/8eb286a0310b4fdeb443d364ee53ad6d/dpdk/mk/rte.sdkroot.mk:77: recipe for target 'install' failed
make: *** [install] Error 2


*Make Build Failed #2:
OS: UB1604-32
Target: i686-native-linuxapp-gcc
   if (!mcfg->single_file_segments) {
            ^
/tmp/UB1604-32_K4.4.0_GCC5.4.0/i686-native-linuxapp-gcc/8eb286a0310b4fdeb443d364ee53ad6d/dpdk/drivers/net/memif/rte_eth_memif.c: At top level:
cc1: error: unrecognized command line option ‘-Wno-address-of-packed-member’ [-Werror]
cc1: all warnings being treated as errors
/tmp/UB1604-32_K4.4.0_GCC5.4.0/i686-native-linuxapp-gcc/8eb286a0310b4fdeb443d364ee53ad6d/dpdk/mk/internal/rte.compile-pre.mk:114: recipe for target 'rte_eth_memif.o' failed
make[6]: *** [rte_eth_memif.o] Error 1
make[6]: *** Waiting for unfinished jobs....
  CC em_rxtx.o
  CC ixgbe_x540.o
  CC ice_nvm.o
  CC lio_mbox.o
  CC ixgbe_x550.o
  CC ice_flex_pipe.o
  CC i40e_rxtx_vec_sse.o
/tmp/UB1604-32_K4.4.0_GCC5.4.0/i686-native-linuxapp-gcc/8eb286a0310b4fdeb443d364ee53ad6d/dpdk/mk/rte.subdir.mk:35: recipe for target 'memif' failed
make[5]: *** [memif] Error 2
make[5]: *** Waiting for unfinished jobs....
  CC i40e_ethdev_vf.o
  PMDINFO hn_ethdev.o.pmd.c
  CC hn_ethdev.o.pmd.o
  LD hn_ethdev.o
--
  CC ixgbe_ethdev.o.pmd.o
  LD ixgbe_ethdev.o
  AR librte_pmd_ixgbe.a
  INSTALL-LIB librte_pmd_ixgbe.a
make[6]: warning:  Clock skew detected.  Your build may be incomplete.
/tmp/UB1604-32_K4.4.0_GCC5.4.0/i686-native-linuxapp-gcc/8eb286a0310b4fdeb443d364ee53ad6d/dpdk/mk/rte.subdir.mk:35: recipe for target 'net' failed
make[4]: *** [net] Error 2
/tmp/UB1604-32_K4.4.0_GCC5.4.0/i686-native-linuxapp-gcc/8eb286a0310b4fdeb443d364ee53ad6d/dpdk/mk/rte.sdkbuild.mk:46: recipe for target 'drivers' failed
make[3]: *** [drivers] Error 2
/tmp/UB1604-32_K4.4.0_GCC5.4.0/i686-native-linuxapp-gcc/8eb286a0310b4fdeb443d364ee53ad6d/dpdk/mk/rte.sdkroot.mk:98: recipe for target 'all' failed
make[2]: *** [all] Error 2
/tmp/UB1604-32_K4.4.0_GCC5.4.0/i686-native-linuxapp-gcc/8eb286a0310b4fdeb443d364ee53ad6d/dpdk/mk/rte.sdkinstall.mk:60: recipe for target 'pre_install' failed
make[1]: *** [pre_install] Error 2
/tmp/UB1604-32_K4.4.0_GCC5.4.0/i686-native-linuxapp-gcc/8eb286a0310b4fdeb443d364ee53ad6d/dpdk/mk/rte.sdkroot.mk:77: recipe for target 'install' failed
make: *** [install] Error 2


*Make Build Failed #3:
OS: UB1904-64
Target: x86_64-native-linuxapp-gcc
   if (!mcfg->single_file_segments) {
            ^~
/tmp/UB1904-64_K4.18.0_GCC8.3.0/x86_64-native-linuxapp-gcc/8eb286a0310b4fdeb443d364ee53ad6d/dpdk/drivers/net/memif/rte_eth_memif.c: At top level:
cc1: error: unrecognized command line option ‘-Wno-address-of-packed-member’ [-Werror]
cc1: all warnings being treated as errors
make[6]: *** [/tmp/UB1904-64_K4.18.0_GCC8.3.0/x86_64-native-linuxapp-gcc/8eb286a0310b4fdeb443d364ee53ad6d/dpdk/mk/internal/rte.compile-pre.mk:116: rte_eth_memif.o] Error 1
make[5]: *** [/tmp/UB1904-64_K4.18.0_GCC8.3.0/x86_64-native-linuxapp-gcc/8eb286a0310b4fdeb443d364ee53ad6d/dpdk/mk/rte.subdir.mk:35: memif] Error 2
make[5]: *** Waiting for unfinished jobs....
  CC lio_mbox.o
  CC ixgbe_82599.o
  AR librte_pmd_ipn3ke.a
  INSTALL-LIB librte_pmd_ipn3ke.a
--
  CC ixgbe_ethdev.o.pmd.o
  LD ixgbe_ethdev.o
  AR librte_pmd_ixgbe.a
  INSTALL-LIB librte_pmd_ixgbe.a
make[6]: warning:  Clock skew detected.  Your build may be incomplete.
make[4]: *** [/tmp/UB1904-64_K4.18.0_GCC8.3.0/x86_64-native-linuxapp-gcc/8eb286a0310b4fdeb443d364ee53ad6d/dpdk/mk/rte.subdir.mk:35: net] Error 2
make[3]: *** [/tmp/UB1904-64_K4.18.0_GCC8.3.0/x86_64-native-linuxapp-gcc/8eb286a0310b4fdeb443d364ee53ad6d/dpdk/mk/rte.sdkbuild.mk:46: drivers] Error 2
make[2]: *** [/tmp/UB1904-64_K4.18.0_GCC8.3.0/x86_64-native-linuxapp-gcc/8eb286a0310b4fdeb443d364ee53ad6d/dpdk/mk/rte.sdkroot.mk:99: all] Error 2
make[1]: *** [/tmp/UB1904-64_K4.18.0_GCC8.3.0/x86_64-native-linuxapp-gcc/8eb286a0310b4fdeb443d364ee53ad6d/dpdk/mk/rte.sdkinstall.mk:61: pre_install] Error 2
make: *** [/tmp/UB1904-64_K4.18.0_GCC8.3.0/x86_64-native-linuxapp-gcc/8eb286a0310b4fdeb443d364ee53ad6d/dpdk/mk/rte.sdkroot.mk:77: install] Error 2


*Make Build Failed #4:
OS: UB1804-64
Target: x86_64-native-linuxapp-icc
/tmp/UB1804-64_K4.15.0_ICC19.0.0/x86_64-native-linuxapp-icc/8eb286a0310b4fdeb443d364ee53ad6d/dpdk/drivers/net/memif/rte_eth_memif.c(972): error: pointer to incomplete class type is not allowed
  		if (!mcfg->single_file_segments) {
  		     ^

compilation aborted for /tmp/UB1804-64_K4.15.0_ICC19.0.0/x86_64-native-linuxapp-icc/8eb286a0310b4fdeb443d364ee53ad6d/dpdk/drivers/net/memif/rte_eth_memif.c (code 2)
/tmp/UB1804-64_K4.15.0_ICC19.0.0/x86_64-native-linuxapp-icc/8eb286a0310b4fdeb443d364ee53ad6d/dpdk/mk/internal/rte.compile-pre.mk:114: recipe for target 'rte_eth_memif.o' failed
make[6]: *** [rte_eth_memif.o] Error 2
/tmp/UB1804-64_K4.15.0_ICC19.0.0/x86_64-native-linuxapp-icc/8eb286a0310b4fdeb443d364ee53ad6d/dpdk/mk/rte.subdir.mk:35: recipe for target 'memif' failed
make[5]: *** [memif] Error 2
make[5]: *** Waiting for unfinished jobs....
  CC em_rxtx.o
  LD lio_ethdev.o
  CC lio_rxtx.o
  CC ice_ethdev.o
--
  CC ixgbe_ethdev.o.pmd.o
  LD ixgbe_ethdev.o
  AR librte_pmd_ixgbe.a
  INSTALL-LIB librte_pmd_ixgbe.a
make[6]: warning:  Clock skew detected.  Your build may be incomplete.
/tmp/UB1804-64_K4.15.0_ICC19.0.0/x86_64-native-linuxapp-icc/8eb286a0310b4fdeb443d364ee53ad6d/dpdk/mk/rte.subdir.mk:35: recipe for target 'net' failed
make[4]: *** [net] Error 2
/tmp/UB1804-64_K4.15.0_ICC19.0.0/x86_64-native-linuxapp-icc/8eb286a0310b4fdeb443d364ee53ad6d/dpdk/mk/rte.sdkbuild.mk:46: recipe for target 'drivers' failed
make[3]: *** [drivers] Error 2
/tmp/UB1804-64_K4.15.0_ICC19.0.0/x86_64-native-linuxapp-icc/8eb286a0310b4fdeb443d364ee53ad6d/dpdk/mk/rte.sdkroot.mk:98: recipe for target 'all' failed
make[2]: *** [all] Error 2
/tmp/UB1804-64_K4.15.0_ICC19.0.0/x86_64-native-linuxapp-icc/8eb286a0310b4fdeb443d364ee53ad6d/dpdk/mk/rte.sdkinstall.mk:60: recipe for target 'pre_install' failed
make[1]: *** [pre_install] Error 2
/tmp/UB1804-64_K4.15.0_ICC19.0.0/x86_64-native-linuxapp-icc/8eb286a0310b4fdeb443d364ee53ad6d/dpdk/mk/rte.sdkroot.mk:77: recipe for target 'install' failed
make: *** [install] Error 2


*Make Build Failed #5:
OS: UB1804-64
Target: x86_64-native-linuxapp-clang
                     ~~~~^
/tmp/UB1804-64_K4.15.0_Clang6.0.0/x86_64-native-linuxapp-clang/8eb286a0310b4fdeb443d364ee53ad6d/dpdk/x86_64-native-linuxapp-clang/include/rte_eal.h:75:9: note: forward declaration of 'struct rte_mem_config'
        struct rte_mem_config *mem_config;
               ^
1 error generated.
/tmp/UB1804-64_K4.15.0_Clang6.0.0/x86_64-native-linuxapp-clang/8eb286a0310b4fdeb443d364ee53ad6d/dpdk/mk/internal/rte.compile-pre.mk:114: recipe for target 'rte_eth_memif.o' failed
make[6]: *** [rte_eth_memif.o] Error 1
make[6]: *** Waiting for unfinished jobs....
  CC hn_rxtx.o
  CC ice_flex_pipe.o
  CC i40e_rxtx.o
  CC ixgbe_x540.o
--
  CC lio_mbox.o
  PMDINFO hn_ethdev.o.pmd.c
  CC hn_ethdev.o.pmd.o
  LD hn_ethdev.o
  CC hn_rndis.o
/tmp/UB1804-64_K4.15.0_Clang6.0.0/x86_64-native-linuxapp-clang/8eb286a0310b4fdeb443d364ee53ad6d/dpdk/mk/rte.subdir.mk:35: recipe for target 'memif' failed
make[5]: *** [memif] Error 2
make[5]: *** Waiting for unfinished jobs....
  CC hn_nvs.o
  CC iavf_rxtx_vec_sse.o
  CC hn_vf.o
  CC ixgbe_x550.o
--
  INSTALL-LIB librte_pmd_ice.a
make[6]: warning:  Clock skew detected.  Your build may be incomplete.
  AR librte_pmd_ixgbe.a
  INSTALL-LIB librte_pmd_ixgbe.a
make[6]: warning:  Clock skew detected.  Your build may be incomplete.
/tmp/UB1804-64_K4.15.0_Clang6.0.0/x86_64-native-linuxapp-clang/8eb286a0310b4fdeb443d364ee53ad6d/dpdk/mk/rte.subdir.mk:35: recipe for target 'net' failed
make[4]: *** [net] Error 2
/tmp/UB1804-64_K4.15.0_Clang6.0.0/x86_64-native-linuxapp-clang/8eb286a0310b4fdeb443d364ee53ad6d/dpdk/mk/rte.sdkbuild.mk:46: recipe for target 'drivers' failed
make[3]: *** [drivers] Error 2
/tmp/UB1804-64_K4.15.0_Clang6.0.0/x86_64-native-linuxapp-clang/8eb286a0310b4fdeb443d364ee53ad6d/dpdk/mk/rte.sdkroot.mk:98: recipe for target 'all' failed
make[2]: *** [all] Error 2
/tmp/UB1804-64_K4.15.0_Clang6.0.0/x86_64-native-linuxapp-clang/8eb286a0310b4fdeb443d364ee53ad6d/dpdk/mk/rte.sdkinstall.mk:60: recipe for target 'pre_install' failed
make[1]: *** [pre_install] Error 2
/tmp/UB1804-64_K4.15.0_Clang6.0.0/x86_64-native-linuxapp-clang/8eb286a0310b4fdeb443d364ee53ad6d/dpdk/mk/rte.sdkroot.mk:77: recipe for target 'install' failed
make: *** [install] Error 2


*Make Build Failed #6:
OS: RHEL80-64
Target: x86_64-native-linuxapp-gcc+debug
   if (!mcfg->single_file_segments) {
            ^~
/tmp/RHEL80-64_K3.10.0_GCC8.2.1/x86_64-native-linuxapp-gcc+debug/8eb286a0310b4fdeb443d364ee53ad6d/dpdk/drivers/net/memif/rte_eth_memif.c: At top level:
cc1: error: unrecognized command line option ‘-Wno-address-of-packed-member’ [-Werror]
cc1: all warnings being treated as errors
make[6]: *** [/tmp/RHEL80-64_K3.10.0_GCC8.2.1/x86_64-native-linuxapp-gcc+debug/8eb286a0310b4fdeb443d364ee53ad6d/dpdk/mk/internal/rte.compile-pre.mk:114: rte_eth_memif.o] Error 1
make[5]: *** [/tmp/RHEL80-64_K3.10.0_GCC8.2.1/x86_64-native-linuxapp-gcc+debug/8eb286a0310b4fdeb443d364ee53ad6d/dpdk/mk/rte.subdir.mk:35: memif] Error 2
make[5]: *** Waiting for unfinished jobs....
  CC iavf_rxtx_vec_sse.o
  CC ipn3ke_tm.o
  CC virtqueue.o
  PMDINFO lio_ethdev.o.pmd.c
--
  CC ixgbe_vf_representor.o
  AR librte_pmd_ixgbe.a
  AR librte_pmd_ice.a
  INSTALL-LIB librte_pmd_ixgbe.a
  INSTALL-LIB librte_pmd_ice.a
make[4]: *** [/tmp/RHEL80-64_K3.10.0_GCC8.2.1/x86_64-native-linuxapp-gcc+debug/8eb286a0310b4fdeb443d364ee53ad6d/dpdk/mk/rte.subdir.mk:35: net] Error 2
make[3]: *** [/tmp/RHEL80-64_K3.10.0_GCC8.2.1/x86_64-native-linuxapp-gcc+debug/8eb286a0310b4fdeb443d364ee53ad6d/dpdk/mk/rte.sdkbuild.mk:46: drivers] Error 2
make[2]: *** [/tmp/RHEL80-64_K3.10.0_GCC8.2.1/x86_64-native-linuxapp-gcc+debug/8eb286a0310b4fdeb443d364ee53ad6d/dpdk/mk/rte.sdkroot.mk:99: all] Error 2
make[1]: *** [/tmp/RHEL80-64_K3.10.0_GCC8.2.1/x86_64-native-linuxapp-gcc+debug/8eb286a0310b4fdeb443d364ee53ad6d/dpdk/mk/rte.sdkinstall.mk:61: pre_install] Error 2
make: *** [/tmp/RHEL80-64_K3.10.0_GCC8.2.1/x86_64-native-linuxapp-gcc+debug/8eb286a0310b4fdeb443d364ee53ad6d/dpdk/mk/rte.sdkroot.mk:77: install] Error 2


*Make Build Failed #7:
OS: RHEL80-64
Target: x86_64-native-linuxapp-icc
/tmp/RHEL80-64_K3.10.0_ICC19.0.0/x86_64-native-linuxapp-icc/8eb286a0310b4fdeb443d364ee53ad6d/dpdk/drivers/net/memif/rte_eth_memif.c(972): error: pointer to incomplete class type is not allowed
  		if (!mcfg->single_file_segments) {
  		     ^

compilation aborted for /tmp/RHEL80-64_K3.10.0_ICC19.0.0/x86_64-native-linuxapp-icc/8eb286a0310b4fdeb443d364ee53ad6d/dpdk/drivers/net/memif/rte_eth_memif.c (code 2)
make[6]: *** [/tmp/RHEL80-64_K3.10.0_ICC19.0.0/x86_64-native-linuxapp-icc/8eb286a0310b4fdeb443d364ee53ad6d/dpdk/mk/internal/rte.compile-pre.mk:114: rte_eth_memif.o] Error 2
make[5]: *** [/tmp/RHEL80-64_K3.10.0_ICC19.0.0/x86_64-native-linuxapp-icc/8eb286a0310b4fdeb443d364ee53ad6d/dpdk/mk/rte.subdir.mk:37: memif] Error 2
make[5]: *** Waiting for unfinished jobs....
  CC ixgbe_82599.o
  CC ice_dcb.o
  LD i40e_ethdev.o
  CC ice_fdir.o
--
  LD ixgbe_ethdev.o
  AR librte_pmd_ixgbe.a
  INSTALL-LIB librte_pmd_ixgbe.a
  AR librte_pmd_i40e.a
  INSTALL-LIB librte_pmd_i40e.a
make[4]: *** [/tmp/RHEL80-64_K3.10.0_ICC19.0.0/x86_64-native-linuxapp-icc/8eb286a0310b4fdeb443d364ee53ad6d/dpdk/mk/rte.subdir.mk:35: net] Error 2
make[3]: *** [/tmp/RHEL80-64_K3.10.0_ICC19.0.0/x86_64-native-linuxapp-icc/8eb286a0310b4fdeb443d364ee53ad6d/dpdk/mk/rte.sdkbuild.mk:46: drivers] Error 2
make[2]: *** [/tmp/RHEL80-64_K3.10.0_ICC19.0.0/x86_64-native-linuxapp-icc/8eb286a0310b4fdeb443d364ee53ad6d/dpdk/mk/rte.sdkroot.mk:99: all] Error 2
make[1]: *** [/tmp/RHEL80-64_K3.10.0_ICC19.0.0/x86_64-native-linuxapp-icc/8eb286a0310b4fdeb443d364ee53ad6d/dpdk/mk/rte.sdkinstall.mk:61: pre_install] Error 2
make: *** [/tmp/RHEL80-64_K3.10.0_ICC19.0.0/x86_64-native-linuxapp-icc/8eb286a0310b4fdeb443d364ee53ad6d/dpdk/mk/rte.sdkroot.mk:77: install] Error 2


*Make Build Failed #8:
OS: RHEL80-64
Target: x86_64-native-linuxapp-clang
                     ~~~~^
/tmp/RHEL80-64_K3.10.0_Clang6.0.1/x86_64-native-linuxapp-clang/8eb286a0310b4fdeb443d364ee53ad6d/dpdk/x86_64-native-linuxapp-clang/include/rte_eal.h:75:9: note: forward declaration of 'struct rte_mem_config'
        struct rte_mem_config *mem_config;
               ^
1 error generated.
make[6]: *** [/tmp/RHEL80-64_K3.10.0_Clang6.0.1/x86_64-native-linuxapp-clang/8eb286a0310b4fdeb443d364ee53ad6d/dpdk/mk/internal/rte.compile-pre.mk:114: rte_eth_memif.o] Error 1
make[5]: *** [/tmp/RHEL80-64_K3.10.0_Clang6.0.1/x86_64-native-linuxapp-clang/8eb286a0310b4fdeb443d364ee53ad6d/dpdk/mk/rte.subdir.mk:35: memif] Error 2
make[5]: *** Waiting for unfinished jobs....
  CC ice_switch.o
  CC ixgbe_x540.o
  CC null_crypto_pmd.o
  CC i40e_ethdev.o
--
  CC virtio_rxtx.o
  CC caam_jr_uio.o
  CC virtio_cryptodev.o
  AR librte_pmd_i40e.a
  INSTALL-LIB librte_pmd_i40e.a
make[4]: *** [/tmp/RHEL80-64_K3.10.0_Clang6.0.1/x86_64-native-linuxapp-clang/8eb286a0310b4fdeb443d364ee53ad6d/dpdk/mk/rte.subdir.mk:35: net] Error 2
make[4]: *** Waiting for unfinished jobs....
  PMDINFO virtio_cryptodev.o.pmd.c
  CC virtio_cryptodev.o.pmd.o
  LD virtio_cryptodev.o
  AR librte_pmd_virtio_crypto.a
--
  PMDINFO caam_jr.o.pmd.c
  CC caam_jr.o.pmd.o
  LD caam_jr.o
  AR librte_pmd_caam_jr.a
  INSTALL-LIB librte_pmd_caam_jr.a
make[3]: *** [/tmp/RHEL80-64_K3.10.0_Clang6.0.1/x86_64-native-linuxapp-clang/8eb286a0310b4fdeb443d364ee53ad6d/dpdk/mk/rte.sdkbuild.mk:46: drivers] Error 2
make[2]: *** [/tmp/RHEL80-64_K3.10.0_Clang6.0.1/x86_64-native-linuxapp-clang/8eb286a0310b4fdeb443d364ee53ad6d/dpdk/mk/rte.sdkroot.mk:99: all] Error 2
make[1]: *** [/tmp/RHEL80-64_K3.10.0_Clang6.0.1/x86_64-native-linuxapp-clang/8eb286a0310b4fdeb443d364ee53ad6d/dpdk/mk/rte.sdkinstall.mk:61: pre_install] Error 2
make: *** [/tmp/RHEL80-64_K3.10.0_Clang6.0.1/x86_64-native-linuxapp-clang/8eb286a0310b4fdeb443d364ee53ad6d/dpdk/mk/rte.sdkroot.mk:77: install] Error 2


*Make Build Failed #9:
OS: RHEL80-64
Target: x86_64-native-linuxapp-gcc+shared
   if (!mcfg->single_file_segments) {
            ^~
/tmp/RHEL80-64_K3.10.0_GCC8.2.1/x86_64-native-linuxapp-gcc+shared/8eb286a0310b4fdeb443d364ee53ad6d/dpdk/drivers/net/memif/rte_eth_memif.c: At top level:
cc1: error: unrecognized command line option ‘-Wno-address-of-packed-member’ [-Werror]
cc1: all warnings being treated as errors
make[6]: *** [/tmp/RHEL80-64_K3.10.0_GCC8.2.1/x86_64-native-linuxapp-gcc+shared/8eb286a0310b4fdeb443d364ee53ad6d/dpdk/mk/internal/rte.compile-pre.mk:116: rte_eth_memif.o] Error 1
make[5]: *** [/tmp/RHEL80-64_K3.10.0_GCC8.2.1/x86_64-native-linuxapp-gcc+shared/8eb286a0310b4fdeb443d364ee53ad6d/dpdk/mk/rte.subdir.mk:35: memif] Error 2
make[5]: *** Waiting for unfinished jobs....
  CC ixgbe_82598.o
  CC ice_switch.o
  CC rte_pmd_i40e.o
  PMDINFO lio_ethdev.o.pmd.c
--
  LD ixgbe_ethdev.o
  LD librte_pmd_ixgbe.so.2.1
  INSTALL-LIB librte_pmd_ixgbe.so.2.1
  LD librte_pmd_ice.so.1.1
  INSTALL-LIB librte_pmd_ice.so.1.1
make[4]: *** [/tmp/RHEL80-64_K3.10.0_GCC8.2.1/x86_64-native-linuxapp-gcc+shared/8eb286a0310b4fdeb443d364ee53ad6d/dpdk/mk/rte.subdir.mk:35: net] Error 2
make[3]: *** [/tmp/RHEL80-64_K3.10.0_GCC8.2.1/x86_64-native-linuxapp-gcc+shared/8eb286a0310b4fdeb443d364ee53ad6d/dpdk/mk/rte.sdkbuild.mk:46: drivers] Error 2
make[2]: *** [/tmp/RHEL80-64_K3.10.0_GCC8.2.1/x86_64-native-linuxapp-gcc+shared/8eb286a0310b4fdeb443d364ee53ad6d/dpdk/mk/rte.sdkroot.mk:99: all] Error 2
make[1]: *** [/tmp/RHEL80-64_K3.10.0_GCC8.2.1/x86_64-native-linuxapp-gcc+shared/8eb286a0310b4fdeb443d364ee53ad6d/dpdk/mk/rte.sdkinstall.mk:61: pre_install] Error 2
make: *** [/tmp/RHEL80-64_K3.10.0_GCC8.2.1/x86_64-native-linuxapp-gcc+shared/8eb286a0310b4fdeb443d364ee53ad6d/dpdk/mk/rte.sdkroot.mk:77: install] Error 2


*Make Build Failed #10:
OS: FD30-64
Target: x86_64-native-linuxapp-gcc
  CC em_rxtx.o
/tmp/FD30-64_K4.20_GCC9.1.1/x86_64-native-linuxapp-gcc/8eb286a0310b4fdeb443d364ee53ad6d/dpdk/drivers/net/memif/rte_eth_memif.c: In function ‘memif_set_zc’:
/tmp/FD30-64_K4.20_GCC9.1.1/x86_64-native-linuxapp-gcc/8eb286a0310b4fdeb443d364ee53ad6d/dpdk/drivers/net/memif/rte_eth_memif.c:972:12: error: dereferencing pointer to incomplete type ‘struct rte_mem_config’
  972 |   if (!mcfg->single_file_segments) {
      |            ^~
make[6]: *** [/tmp/FD30-64_K4.20_GCC9.1.1/x86_64-native-linuxapp-gcc/8eb286a0310b4fdeb443d364ee53ad6d/dpdk/mk/internal/rte.compile-pre.mk:116: rte_eth_memif.o] Error 1
make[5]: *** [/tmp/FD30-64_K4.20_GCC9.1.1/x86_64-native-linuxapp-gcc/8eb286a0310b4fdeb443d364ee53ad6d/dpdk/mk/rte.subdir.mk:35: memif] Error 2
make[5]: *** Waiting for unfinished jobs....
  CC ixgbe_common.o
  CC ipn3ke_tm.o
  CC ice_flow.o
  CC i40e_rxtx.o
--
  PMDINFO ixgbe_ethdev.o.pmd.c
  CC ixgbe_ethdev.o.pmd.o
  LD ixgbe_ethdev.o
  AR librte_pmd_ixgbe.a
  INSTALL-LIB librte_pmd_ixgbe.a
make[4]: *** [/tmp/FD30-64_K4.20_GCC9.1.1/x86_64-native-linuxapp-gcc/8eb286a0310b4fdeb443d364ee53ad6d/dpdk/mk/rte.subdir.mk:35: net] Error 2
make[3]: *** [/tmp/FD30-64_K4.20_GCC9.1.1/x86_64-native-linuxapp-gcc/8eb286a0310b4fdeb443d364ee53ad6d/dpdk/mk/rte.sdkbuild.mk:46: drivers] Error 2
make[2]: *** [/tmp/FD30-64_K4.20_GCC9.1.1/x86_64-native-linuxapp-gcc/8eb286a0310b4fdeb443d364ee53ad6d/dpdk/mk/rte.sdkroot.mk:99: all] Error 2
make[1]: *** [/tmp/FD30-64_K4.20_GCC9.1.1/x86_64-native-linuxapp-gcc/8eb286a0310b4fdeb443d364ee53ad6d/dpdk/mk/rte.sdkinstall.mk:61: pre_install] Error 2
make: *** [/tmp/FD30-64_K4.20_GCC9.1.1/x86_64-native-linuxapp-gcc/8eb286a0310b4fdeb443d364ee53ad6d/dpdk/mk/rte.sdkroot.mk:77: install] Error 2


*Make Build Failed #11:
OS: RHEL80-64
Target: x86_64-native-linuxapp-gcc
   if (!mcfg->single_file_segments) {
            ^~
/tmp/RHEL80-64_K3.10.0_GCC8.2.1/x86_64-native-linuxapp-gcc/8eb286a0310b4fdeb443d364ee53ad6d/dpdk/drivers/net/memif/rte_eth_memif.c: At top level:
cc1: error: unrecognized command line option ‘-Wno-address-of-packed-member’ [-Werror]
cc1: all warnings being treated as errors
make[6]: *** [/tmp/RHEL80-64_K3.10.0_GCC8.2.1/x86_64-native-linuxapp-gcc/8eb286a0310b4fdeb443d364ee53ad6d/dpdk/mk/internal/rte.compile-pre.mk:114: rte_eth_memif.o] Error 1
make[5]: *** [/tmp/RHEL80-64_K3.10.0_GCC8.2.1/x86_64-native-linuxapp-gcc/8eb286a0310b4fdeb443d364ee53ad6d/dpdk/mk/rte.subdir.mk:37: memif] Error 2
make[5]: *** Waiting for unfinished jobs....
  CC ixgbe_82599.o
  CC e1000_vf.o
  CC ice_switch.o
  PMDINFO hinic_pmd_ethdev.o.pmd.c
--
  PMDINFO ixgbe_ethdev.o.pmd.c
  CC ixgbe_ethdev.o.pmd.o
  LD ixgbe_ethdev.o
  AR librte_pmd_ixgbe.a
  INSTALL-LIB librte_pmd_ixgbe.a
make[4]: *** [/tmp/RHEL80-64_K3.10.0_GCC8.2.1/x86_64-native-linuxapp-gcc/8eb286a0310b4fdeb443d364ee53ad6d/dpdk/mk/rte.subdir.mk:35: net] Error 2
make[3]: *** [/tmp/RHEL80-64_K3.10.0_GCC8.2.1/x86_64-native-linuxapp-gcc/8eb286a0310b4fdeb443d364ee53ad6d/dpdk/mk/rte.sdkbuild.mk:46: drivers] Error 2
make[2]: *** [/tmp/RHEL80-64_K3.10.0_GCC8.2.1/x86_64-native-linuxapp-gcc/8eb286a0310b4fdeb443d364ee53ad6d/dpdk/mk/rte.sdkroot.mk:99: all] Error 2
make[1]: *** [/tmp/RHEL80-64_K3.10.0_GCC8.2.1/x86_64-native-linuxapp-gcc/8eb286a0310b4fdeb443d364ee53ad6d/dpdk/mk/rte.sdkinstall.mk:61: pre_install] Error 2
make: *** [/tmp/RHEL80-64_K3.10.0_GCC8.2.1/x86_64-native-linuxapp-gcc/8eb286a0310b4fdeb443d364ee53ad6d/dpdk/mk/rte.sdkroot.mk:77: install] Error 2


*Make Build Failed #12:
OS: SUSE15-64
Target: x86_64-native-linuxapp-gcc
   if (!mcfg->single_file_segments) {
            ^~
/tmp/SUSE15-64_K4.12.14_GCC7.3.1/x86_64-native-linuxapp-gcc/8eb286a0310b4fdeb443d364ee53ad6d/dpdk/drivers/net/memif/rte_eth_memif.c: At top level:
cc1: error: unrecognized command line option ‘-Wno-address-of-packed-member’ [-Werror]
cc1: all warnings being treated as errors
make[6]: *** [/tmp/SUSE15-64_K4.12.14_GCC7.3.1/x86_64-native-linuxapp-gcc/8eb286a0310b4fdeb443d364ee53ad6d/dpdk/mk/internal/rte.compile-pre.mk:116: rte_eth_memif.o] Error 1
make[5]: *** [/tmp/SUSE15-64_K4.12.14_GCC7.3.1/x86_64-native-linuxapp-gcc/8eb286a0310b4fdeb443d364ee53ad6d/dpdk/mk/rte.subdir.mk:37: memif] Error 2
make[5]: *** Waiting for unfinished jobs....
  CC ipn3ke_flow.o
  PMDINFO lio_ethdev.o.pmd.c
  CC lio_ethdev.o.pmd.o
  LD lio_ethdev.o
--
  PMDINFO ixgbe_ethdev.o.pmd.c
  CC ixgbe_ethdev.o.pmd.o
  LD ixgbe_ethdev.o
  AR librte_pmd_ixgbe.a
  INSTALL-LIB librte_pmd_ixgbe.a
make[4]: *** [/tmp/SUSE15-64_K4.12.14_GCC7.3.1/x86_64-native-linuxapp-gcc/8eb286a0310b4fdeb443d364ee53ad6d/dpdk/mk/rte.subdir.mk:35: net] Error 2
make[3]: *** [/tmp/SUSE15-64_K4.12.14_GCC7.3.1/x86_64-native-linuxapp-gcc/8eb286a0310b4fdeb443d364ee53ad6d/dpdk/mk/rte.sdkbuild.mk:46: drivers] Error 2
make[2]: *** [/tmp/SUSE15-64_K4.12.14_GCC7.3.1/x86_64-native-linuxapp-gcc/8eb286a0310b4fdeb443d364ee53ad6d/dpdk/mk/rte.sdkroot.mk:99: all] Error 2
make[1]: *** [/tmp/SUSE15-64_K4.12.14_GCC7.3.1/x86_64-native-linuxapp-gcc/8eb286a0310b4fdeb443d364ee53ad6d/dpdk/mk/rte.sdkinstall.mk:61: pre_install] Error 2
make: *** [/tmp/SUSE15-64_K4.12.14_GCC7.3.1/x86_64-native-linuxapp-gcc/8eb286a0310b4fdeb443d364ee53ad6d/dpdk/mk/rte.sdkroot.mk:77: install] Error 2


*Make Build Failed #13:
OS: SUSE15-64
Target: x86_64-native-linuxapp-clang
                     ~~~~^
/tmp/SUSE15-64_K4.12.14_Clang5.0.1/x86_64-native-linuxapp-clang/8eb286a0310b4fdeb443d364ee53ad6d/dpdk/x86_64-native-linuxapp-clang/include/rte_eal.h:75:9: note: forward declaration of 'struct rte_mem_config'
        struct rte_mem_config *mem_config;
               ^
1 error generated.
make[6]: *** [/tmp/SUSE15-64_K4.12.14_Clang5.0.1/x86_64-native-linuxapp-clang/8eb286a0310b4fdeb443d364ee53ad6d/dpdk/mk/internal/rte.compile-pre.mk:116: rte_eth_memif.o] Error 1
make[6]: *** Waiting for unfinished jobs....
  CC ice_flow.o
  CC hn_ethdev.o
  PMDINFO lio_ethdev.o.pmd.c
  CC lio_ethdev.o.pmd.o
--
  CC ice_dcb.o
  PMDINFO igb_ethdev.o.pmd.c
  CC igb_ethdev.o.pmd.o
  PMDINFO hn_ethdev.o.pmd.c
  CC hn_ethdev.o.pmd.o
make[5]: *** [/tmp/SUSE15-64_K4.12.14_Clang5.0.1/x86_64-native-linuxapp-clang/8eb286a0310b4fdeb443d364ee53ad6d/dpdk/mk/rte.subdir.mk:35: memif] Error 2
make[5]: *** Waiting for unfinished jobs....
  LD igb_ethdev.o
  CC ixgbe_phy.o
  LD hn_ethdev.o
  CC hn_rxtx.o
--
  INSTALL-LIB librte_pmd_e1000.a
  AR librte_pmd_i40e.a
  INSTALL-LIB librte_pmd_i40e.a
  AR librte_pmd_ixgbe.a
  INSTALL-LIB librte_pmd_ixgbe.a
make[4]: *** [/tmp/SUSE15-64_K4.12.14_Clang5.0.1/x86_64-native-linuxapp-clang/8eb286a0310b4fdeb443d364ee53ad6d/dpdk/mk/rte.subdir.mk:35: net] Error 2
make[3]: *** [/tmp/SUSE15-64_K4.12.14_Clang5.0.1/x86_64-native-linuxapp-clang/8eb286a0310b4fdeb443d364ee53ad6d/dpdk/mk/rte.sdkbuild.mk:46: drivers] Error 2
make[2]: *** [/tmp/SUSE15-64_K4.12.14_Clang5.0.1/x86_64-native-linuxapp-clang/8eb286a0310b4fdeb443d364ee53ad6d/dpdk/mk/rte.sdkroot.mk:99: all] Error 2
make[1]: *** [/tmp/SUSE15-64_K4.12.14_Clang5.0.1/x86_64-native-linuxapp-clang/8eb286a0310b4fdeb443d364ee53ad6d/dpdk/mk/rte.sdkinstall.mk:61: pre_install] Error 2
make: *** [/tmp/SUSE15-64_K4.12.14_Clang5.0.1/x86_64-native-linuxapp-clang/8eb286a0310b4fdeb443d364ee53ad6d/dpdk/mk/rte.sdkroot.mk:77: install] Error 2


*Make Build Failed #14:
OS: RHEL76-64
Target: x86_64-native-linuxapp-gcc
   if (!mcfg->single_file_segments) {
            ^
/tmp/RHEL76-64_K3.10.0_GCC4.8.5/x86_64-native-linuxapp-gcc/8eb286a0310b4fdeb443d364ee53ad6d/dpdk/drivers/net/memif/rte_eth_memif.c: At top level:
cc1: error: unrecognized command line option "-Wno-address-of-packed-member" [-Werror]
cc1: all warnings being treated as errors
make[6]: *** [rte_eth_memif.o] Error 1
make[5]: *** [memif] Error 2
make[5]: *** Waiting for unfinished jobs....
  CC iavf_rxtx_vec_sse.o
  CC caam_jr_capabilities.o
  CC caam_jr_hw.o
  CC virtqueue.o
--
  PMDINFO ixgbe_ethdev.o.pmd.c
  CC ixgbe_ethdev.o.pmd.o
  LD ixgbe_ethdev.o
  AR librte_pmd_ixgbe.a
  INSTALL-LIB librte_pmd_ixgbe.a
make[4]: *** [net] Error 2
make[3]: *** [drivers] Error 2
make[2]: *** [all] Error 2
make[1]: *** [pre_install] Error 2
make: *** [install] Error 2


*Make Build Failed #15:
OS: FD30-64
Target: x86_64-native-linuxapp-clang
                     ~~~~^
/tmp/FD30-64_K4.20_Clang8.0.0/x86_64-native-linuxapp-clang/8eb286a0310b4fdeb443d364ee53ad6d/dpdk/x86_64-native-linuxapp-clang/include/rte_eal.h:75:9: note: forward declaration of 'struct rte_mem_config'
        struct rte_mem_config *mem_config;
               ^
1 error generated.
make[6]: *** [/tmp/FD30-64_K4.20_Clang8.0.0/x86_64-native-linuxapp-clang/8eb286a0310b4fdeb443d364ee53ad6d/dpdk/mk/internal/rte.compile-pre.mk:114: rte_eth_memif.o] Error 1
make[5]: *** [/tmp/FD30-64_K4.20_Clang8.0.0/x86_64-native-linuxapp-clang/8eb286a0310b4fdeb443d364ee53ad6d/dpdk/mk/rte.subdir.mk:37: memif] Error 2
make[5]: *** Waiting for unfinished jobs....
== Build drivers/net/netvsc
  CC ixgbe_vf.o
  CC i40e_ethdev.o
  CC i40e_rxtx.o
--
  CC i40e_rxtx_vec_avx2.o
  AR librte_pmd_ice.a
  INSTALL-LIB librte_pmd_ice.a
  AR librte_pmd_i40e.a
  INSTALL-LIB librte_pmd_i40e.a
make[4]: *** [/tmp/FD30-64_K4.20_Clang8.0.0/x86_64-native-linuxapp-clang/8eb286a0310b4fdeb443d364ee53ad6d/dpdk/mk/rte.subdir.mk:35: net] Error 2
make[3]: *** [/tmp/FD30-64_K4.20_Clang8.0.0/x86_64-native-linuxapp-clang/8eb286a0310b4fdeb443d364ee53ad6d/dpdk/mk/rte.sdkbuild.mk:46: drivers] Error 2
make[2]: *** [/tmp/FD30-64_K4.20_Clang8.0.0/x86_64-native-linuxapp-clang/8eb286a0310b4fdeb443d364ee53ad6d/dpdk/mk/rte.sdkroot.mk:99: all] Error 2
make[1]: *** [/tmp/FD30-64_K4.20_Clang8.0.0/x86_64-native-linuxapp-clang/8eb286a0310b4fdeb443d364ee53ad6d/dpdk/mk/rte.sdkinstall.mk:61: pre_install] Error 2
make: *** [/tmp/FD30-64_K4.20_Clang8.0.0/x86_64-native-linuxapp-clang/8eb286a0310b4fdeb443d364ee53ad6d/dpdk/mk/rte.sdkroot.mk:77: install] Error 2


*Make Build Failed #16:
OS: UB1604-64
Target: x86_64-native-linuxapp-gcc
            ^
== Build drivers/net/netvsc
/tmp/UB1604-64_K4.4.0_GCC5.4.0/x86_64-native-linuxapp-gcc/8eb286a0310b4fdeb443d364ee53ad6d/dpdk/drivers/net/memif/rte_eth_memif.c: At top level:
cc1: error: unrecognized command line option ‘-Wno-address-of-packed-member’ [-Werror]
cc1: all warnings being treated as errors
/tmp/UB1604-64_K4.4.0_GCC5.4.0/x86_64-native-linuxapp-gcc/8eb286a0310b4fdeb443d364ee53ad6d/dpdk/mk/internal/rte.compile-pre.mk:114: recipe for target 'rte_eth_memif.o' failed
make[6]: *** [rte_eth_memif.o] Error 1
/tmp/UB1604-64_K4.4.0_GCC5.4.0/x86_64-native-linuxapp-gcc/8eb286a0310b4fdeb443d364ee53ad6d/dpdk/mk/rte.subdir.mk:35: recipe for target 'memif' failed
make[5]: *** [memif] Error 2
make[5]: *** Waiting for unfinished jobs....
  CC i40e_rxtx_vec_sse.o
  PMDINFO lio_ethdev.o.pmd.c
  CC lio_ethdev.o.pmd.o
  LD lio_ethdev.o
--
  PMDINFO ixgbe_ethdev.o.pmd.c
  CC ixgbe_ethdev.o.pmd.o
  LD ixgbe_ethdev.o
  AR librte_pmd_ixgbe.a
  INSTALL-LIB librte_pmd_ixgbe.a
/tmp/UB1604-64_K4.4.0_GCC5.4.0/x86_64-native-linuxapp-gcc/8eb286a0310b4fdeb443d364ee53ad6d/dpdk/mk/rte.subdir.mk:35: recipe for target 'net' failed
make[4]: *** [net] Error 2
/tmp/UB1604-64_K4.4.0_GCC5.4.0/x86_64-native-linuxapp-gcc/8eb286a0310b4fdeb443d364ee53ad6d/dpdk/mk/rte.sdkbuild.mk:46: recipe for target 'drivers' failed
make[3]: *** [drivers] Error 2
/tmp/UB1604-64_K4.4.0_GCC5.4.0/x86_64-native-linuxapp-gcc/8eb286a0310b4fdeb443d364ee53ad6d/dpdk/mk/rte.sdkroot.mk:98: recipe for target 'all' failed
make[2]: *** [all] Error 2
/tmp/UB1604-64_K4.4.0_GCC5.4.0/x86_64-native-linuxapp-gcc/8eb286a0310b4fdeb443d364ee53ad6d/dpdk/mk/rte.sdkinstall.mk:60: recipe for target 'pre_install' failed
make[1]: *** [pre_install] Error 2
/tmp/UB1604-64_K4.4.0_GCC5.4.0/x86_64-native-linuxapp-gcc/8eb286a0310b4fdeb443d364ee53ad6d/dpdk/mk/rte.sdkroot.mk:77: recipe for target 'install' failed
make: *** [install] Error 2


*Make Build Failed #17:
OS: UB1804-64
Target: x86_64-native-linuxapp-gcc
            ^~
/tmp/UB1804-64_K4.15.0_GCC7.3.0/x86_64-native-linuxapp-gcc/8eb286a0310b4fdeb443d364ee53ad6d/dpdk/drivers/net/memif/rte_eth_memif.c: At top level:
cc1: error: unrecognized command line option ‘-Wno-address-of-packed-member’ [-Werror]
cc1: all warnings being treated as errors
  CC ice_flex_pipe.o
/tmp/UB1804-64_K4.15.0_GCC7.3.0/x86_64-native-linuxapp-gcc/8eb286a0310b4fdeb443d364ee53ad6d/dpdk/mk/internal/rte.compile-pre.mk:114: recipe for target 'rte_eth_memif.o' failed
make[6]: *** [rte_eth_memif.o] Error 1
/tmp/UB1804-64_K4.15.0_GCC7.3.0/x86_64-native-linuxapp-gcc/8eb286a0310b4fdeb443d364ee53ad6d/dpdk/mk/rte.subdir.mk:35: recipe for target 'memif' failed
make[5]: *** [memif] Error 2
make[5]: *** Waiting for unfinished jobs....
  CC ice_flow.o
  CC ice_dcb.o
  CC ice_fdir.o
  AR librte_pmd_lio.a
--
  PMDINFO ixgbe_ethdev.o.pmd.c
  CC ixgbe_ethdev.o.pmd.o
  LD ixgbe_ethdev.o
  AR librte_pmd_ixgbe.a
  INSTALL-LIB librte_pmd_ixgbe.a
/tmp/UB1804-64_K4.15.0_GCC7.3.0/x86_64-native-linuxapp-gcc/8eb286a0310b4fdeb443d364ee53ad6d/dpdk/mk/rte.subdir.mk:35: recipe for target 'net' failed
make[4]: *** [net] Error 2
/tmp/UB1804-64_K4.15.0_GCC7.3.0/x86_64-native-linuxapp-gcc/8eb286a0310b4fdeb443d364ee53ad6d/dpdk/mk/rte.sdkbuild.mk:46: recipe for target 'drivers' failed
make[3]: *** [drivers] Error 2
/tmp/UB1804-64_K4.15.0_GCC7.3.0/x86_64-native-linuxapp-gcc/8eb286a0310b4fdeb443d364ee53ad6d/dpdk/mk/rte.sdkroot.mk:98: recipe for target 'all' failed
make[2]: *** [all] Error 2
/tmp/UB1804-64_K4.15.0_GCC7.3.0/x86_64-native-linuxapp-gcc/8eb286a0310b4fdeb443d364ee53ad6d/dpdk/mk/rte.sdkinstall.mk:60: recipe for target 'pre_install' failed
make[1]: *** [pre_install] Error 2
/tmp/UB1804-64_K4.15.0_GCC7.3.0/x86_64-native-linuxapp-gcc/8eb286a0310b4fdeb443d364ee53ad6d/dpdk/mk/rte.sdkroot.mk:77: recipe for target 'install' failed
make: *** [install] Error 2


*Make Build Failed #18:
OS: CENTOS76-64
Target: x86_64-native-linuxapp-gcc
   if (!mcfg->single_file_segments) {
            ^
/tmp/CENTOS76-64_K3.10.0_GCC4.8.5/x86_64-native-linuxapp-gcc/8eb286a0310b4fdeb443d364ee53ad6d/dpdk/drivers/net/memif/rte_eth_memif.c: At top level:
cc1: error: unrecognized command line option "-Wno-address-of-packed-member" [-Werror]
cc1: all warnings being treated as errors
make[6]: *** [rte_eth_memif.o] Error 1
make[5]: *** [memif] Error 2
make[5]: *** Waiting for unfinished jobs....
  CC ixgbe_phy.o
  AR librte_pmd_hinic.a
  PMDINFO lio_ethdev.o.pmd.c
  CC lio_ethdev.o.pmd.o
--
  PMDINFO ixgbe_ethdev.o.pmd.c
  CC ixgbe_ethdev.o.pmd.o
  LD ixgbe_ethdev.o
  AR librte_pmd_ixgbe.a
  INSTALL-LIB librte_pmd_ixgbe.a
make[4]: *** [net] Error 2
make[3]: *** [drivers] Error 2
make[2]: *** [all] Error 2
make[1]: *** [pre_install] Error 2
make: *** [install] Error 2

*Meson Build Failed #1:
OS: RHEL80-64
Target:build-gcc-static
FAILED: drivers/a715181@@tmp_rte_pmd_memif at sta/net_memif_rte_eth_memif.c.o 
gcc -Idrivers/a715181@@tmp_rte_pmd_memif at sta -Idrivers -I../drivers -Idrivers/net/memif -I../drivers/net/memif -Ilib/librte_ethdev -I../lib/librte_ethdev -I. -I../ -Iconfig -I../config -Ilib/librte_eal/common/include -I../lib/librte_eal/common/include -I../lib/librte_eal/linux/eal/include -Ilib/librte_eal/common -I../lib/librte_eal/common -Ilib/librte_eal/common/include/arch/x86 -I../lib/librte_eal/common/include/arch/x86 -Ilib/librte_eal -I../lib/librte_eal -Ilib/librte_kvargs -I../lib/librte_kvargs -Ilib/librte_net -I../lib/librte_net -Ilib/librte_mbuf -I../lib/librte_mbuf -Ilib/librte_mempool -I../lib/librte_mempool -Ilib/librte_ring -I../lib/librte_ring -Ilib/librte_meter -I../lib/librte_meter -Idrivers/bus/pci -I../drivers/bus/pci -I../drivers/bus/pci/linux -Ilib/librte_pci -I../lib/librte_pci -Idrivers/bus/vdev -I../drivers/bus/vdev -Ilib/librte_hash -I../lib/librte_hash -fdiagnostics-color=always -pipe -D_FILE_OFFSET_BITS=64 -Wall -Winvalid-pch -Werror -O3 -include rte_config.h -Wunused-parameter -Wsign-compare -Wcast-qual -D_GNU_SOURCE -fPIC -march=native -mno-avx512f -Wno-format-truncation -DALLOW_EXPERIMENTAL_API -MD -MQ 'drivers/a715181@@tmp_rte_pmd_memif at sta/net_memif_rte_eth_memif.c.o' -MF 'drivers/a715181@@tmp_rte_pmd_memif at sta/net_memif_rte_eth_memif.c.o.d' -o 'drivers/a715181@@tmp_rte_pmd_memif at sta/net_memif_rte_eth_memif.c.o' -c ../drivers/net/memif/rte_eth_memif.c
../drivers/net/memif/rte_eth_memif.c: In function ‘memif_set_zc’:
../drivers/net/memif/rte_eth_memif.c:972:12: error: dereferencing pointer to incomplete type ‘struct rte_mem_config’
   if (!mcfg->single_file_segments) {
            ^~
[457/1824] Compiling C object 'drivers/a715181@@rte_bus_vdev at sta/meson-generated_.._rte_bus_vdev.pmd.c.o'.
[458/1824] Linking target drivers/librte_bus_vdev.so.2.1.
[459/1824] Generating rte_bus_pci.pmd.c with a custom command.
[460/1824] Compiling C object 'drivers/a715181@@tmp_rte_pmd_memif at sta/net_memif_memif_rxtx.c.o'.
[461/1824] Compiling C object 'lib/76b5a35@@rte_pipeline at sta/librte_pipeline_rte_table_action.c.o'.
ninja: build stopped: subcommand failed




*Meson Build Failed #2:
OS: UB1604-32
Target:build-gcc-static
FAILED: drivers/a715181@@tmp_rte_pmd_memif at sta/net_memif_rte_eth_memif.c.o 
gcc -Idrivers/a715181@@tmp_rte_pmd_memif at sta -Idrivers -I../drivers -Idrivers/net/memif -I../drivers/net/memif -Ilib/librte_ethdev -I../lib/librte_ethdev -I. -I../ -Iconfig -I../config -Ilib/librte_eal/common/include -I../lib/librte_eal/common/include -I../lib/librte_eal/linux/eal/include -Ilib/librte_eal/common -I../lib/librte_eal/common -Ilib/librte_eal/common/include/arch/x86 -I../lib/librte_eal/common/include/arch/x86 -Ilib/librte_eal -I../lib/librte_eal -Ilib/librte_kvargs -I../lib/librte_kvargs -Ilib/librte_net -I../lib/librte_net -Ilib/librte_mbuf -I../lib/librte_mbuf -Ilib/librte_mempool -I../lib/librte_mempool -Ilib/librte_ring -I../lib/librte_ring -Ilib/librte_meter -I../lib/librte_meter -Idrivers/bus/pci -I../drivers/bus/pci -I../drivers/bus/pci/linux -Ilib/librte_pci -I../lib/librte_pci -Idrivers/bus/vdev -I../drivers/bus/vdev -Ilib/librte_hash -I../lib/librte_hash -fdiagnostics-color=always -pipe -D_FILE_OFFSET_BITS=64 -Wall -Winvalid-pch -Werror -O3 -include rte_config.h -Wunused-parameter -Wsign-compare -Wcast-qual -Wno-pointer-to-int-cast -D_GNU_SOURCE -fPIC -march=native -DALLOW_EXPERIMENTAL_API -MD -MQ 'drivers/a715181@@tmp_rte_pmd_memif at sta/net_memif_rte_eth_memif.c.o' -MF 'drivers/a715181@@tmp_rte_pmd_memif at sta/net_memif_rte_eth_memif.c.o.d' -o 'drivers/a715181@@tmp_rte_pmd_memif at sta/net_memif_rte_eth_memif.c.o' -c ../drivers/net/memif/rte_eth_memif.c
../drivers/net/memif/rte_eth_memif.c: In function ‘memif_set_zc’:
../drivers/net/memif/rte_eth_memif.c:972:12: error: dereferencing pointer to incomplete type ‘struct rte_mem_config’
   if (!mcfg->single_file_segments) {
            ^
[894/1656] Compiling C object 'drivers/a715181@@tmp_rte_pmd_liquidio at sta/net_liquidio_base_lio_mbox.c.o'.
[895/1656] Compiling C object 'drivers/a715181@@tmp_rte_pmd_ixgbe at sta/net_ixgbe_ixgbe_rxtx.c.o'.
[896/1656] Compiling C object 'drivers/a715181@@tmp_rte_pmd_netvsc at sta/net_netvsc_hn_ethdev.c.o'.
[897/1656] Compiling C object 'drivers/a715181@@tmp_rte_pmd_memif at sta/net_memif_memif_rxtx.c.o'.
[898/1656] Compiling C object 'drivers/a715181@@tmp_rte_pmd_liquidio at sta/net_liquidio_lio_rxtx.c.o'.
ninja: build stopped: subcommand failed




*Meson Build Failed #3:
OS: SUSE15-64
Target:build-gcc-static
FAILED: drivers/a715181@@tmp_rte_pmd_memif at sta/net_memif_rte_eth_memif.c.o 
gcc -Idrivers/a715181@@tmp_rte_pmd_memif at sta -Idrivers -I../drivers -Idrivers/net/memif -I../drivers/net/memif -Ilib/librte_ethdev -I../lib/librte_ethdev -I. -I../ -Iconfig -I../config -Ilib/librte_eal/common/include -I../lib/librte_eal/common/include -I../lib/librte_eal/linux/eal/include -Ilib/librte_eal/common -I../lib/librte_eal/common -Ilib/librte_eal/common/include/arch/x86 -I../lib/librte_eal/common/include/arch/x86 -Ilib/librte_eal -I../lib/librte_eal -Ilib/librte_kvargs -I../lib/librte_kvargs -Ilib/librte_net -I../lib/librte_net -Ilib/librte_mbuf -I../lib/librte_mbuf -Ilib/librte_mempool -I../lib/librte_mempool -Ilib/librte_ring -I../lib/librte_ring -Ilib/librte_meter -I../lib/librte_meter -Idrivers/bus/pci -I../drivers/bus/pci -I../drivers/bus/pci/linux -Ilib/librte_pci -I../lib/librte_pci -Idrivers/bus/vdev -I../drivers/bus/vdev -Ilib/librte_hash -I../lib/librte_hash -fdiagnostics-color=always -pipe -D_FILE_OFFSET_BITS=64 -Wall -Winvalid-pch -Werror -O3 -include rte_config.h -Wunused-parameter -Wsign-compare -Wcast-qual -D_GNU_SOURCE -fPIC -march=native -Wno-format-truncation -DALLOW_EXPERIMENTAL_API -MD -MQ 'drivers/a715181@@tmp_rte_pmd_memif at sta/net_memif_rte_eth_memif.c.o' -MF 'drivers/a715181@@tmp_rte_pmd_memif at sta/net_memif_rte_eth_memif.c.o.d' -o 'drivers/a715181@@tmp_rte_pmd_memif at sta/net_memif_rte_eth_memif.c.o' -c ../drivers/net/memif/rte_eth_memif.c
../drivers/net/memif/rte_eth_memif.c: In function ‘memif_set_zc’:
../drivers/net/memif/rte_eth_memif.c:972:12: error: dereferencing pointer to incomplete type ‘struct rte_mem_config’
   if (!mcfg->single_file_segments) {
            ^~
[463/1831] Linking target drivers/librte_bus_vdev.so.2.1.
[464/1831] Generating symbol file 'drivers/a715181@@rte_bus_fslmc at sha/librte_bus_fslmc.so.2.1.symbols'.
[465/1831] Compiling C object 'drivers/a715181@@tmp_rte_pmd_memif at sta/net_memif_memif_rxtx.c.o'.
[466/1831] Generating symbol file 'drivers/a715181@@rte_bus_pci at sha/librte_bus_pci.so.2.1.symbols'.
[467/1831] Compiling C object 'lib/76b5a35@@rte_pipeline at sta/librte_pipeline_rte_table_action.c.o'.
ninja: build stopped: subcommand failed




*Meson Build Failed #4:
OS: FD30-64
Target:build-gcc-static
FAILED: drivers/a715181@@tmp_rte_pmd_memif at sta/net_memif_rte_eth_memif.c.o 
gcc -Idrivers/a715181@@tmp_rte_pmd_memif at sta -Idrivers -I../drivers -Idrivers/net/memif -I../drivers/net/memif -Ilib/librte_ethdev -I../lib/librte_ethdev -I. -I../ -Iconfig -I../config -Ilib/librte_eal/common/include -I../lib/librte_eal/common/include -I../lib/librte_eal/linux/eal/include -Ilib/librte_eal/common -I../lib/librte_eal/common -Ilib/librte_eal/common/include/arch/x86 -I../lib/librte_eal/common/include/arch/x86 -Ilib/librte_eal -I../lib/librte_eal -Ilib/librte_kvargs -I../lib/librte_kvargs -Ilib/librte_net -I../lib/librte_net -Ilib/librte_mbuf -I../lib/librte_mbuf -Ilib/librte_mempool -I../lib/librte_mempool -Ilib/librte_ring -I../lib/librte_ring -Ilib/librte_meter -I../lib/librte_meter -Idrivers/bus/pci -I../drivers/bus/pci -I../drivers/bus/pci/linux -Ilib/librte_pci -I../lib/librte_pci -Idrivers/bus/vdev -I../drivers/bus/vdev -Ilib/librte_hash -I../lib/librte_hash -fdiagnostics-color=always -pipe -D_FILE_OFFSET_BITS=64 -Wall -Winvalid-pch -Werror -O3 -include rte_config.h -Wunused-parameter -Wsign-compare -Wcast-qual -Wno-address-of-packed-member -D_GNU_SOURCE -fPIC -march=native -mno-avx512f -Wno-format-truncation -DALLOW_EXPERIMENTAL_API -MD -MQ 'drivers/a715181@@tmp_rte_pmd_memif at sta/net_memif_rte_eth_memif.c.o' -MF 'drivers/a715181@@tmp_rte_pmd_memif at sta/net_memif_rte_eth_memif.c.o.d' -o 'drivers/a715181@@tmp_rte_pmd_memif at sta/net_memif_rte_eth_memif.c.o' -c ../drivers/net/memif/rte_eth_memif.c
../drivers/net/memif/rte_eth_memif.c: In function ‘memif_set_zc’:
../drivers/net/memif/rte_eth_memif.c:972:12: error: dereferencing pointer to incomplete type ‘struct rte_mem_config’
  972 |   if (!mcfg->single_file_segments) {
      |            ^~
[916/1784] Compiling C object 'drivers/a715181@@rte_pmd_liquidio at sha/meson-generated_.._rte_pmd_liquidio.pmd.c.o'.
[917/1784] Compiling C object 'drivers/a715181@@tmp_rte_pmd_memif at sta/net_memif_memif_rxtx.c.o'.
[918/1784] Compiling C object 'drivers/a715181@@tmp_rte_pmd_ixgbe at sta/net_ixgbe_ixgbe_rxtx.c.o'.
[919/1784] Compiling C object 'drivers/a715181@@tmp_rte_pmd_netvsc at sta/net_netvsc_hn_ethdev.c.o'.
[920/1784] Compiling C object 'drivers/a715181@@tmp_rte_pmd_netvsc at sta/net_netvsc_hn_rxtx.c.o'.
ninja: build stopped: subcommand failed




*Meson Build Failed #5:
OS: UB1804-64
Target:build-gcc-static
FAILED: drivers/a715181@@tmp_rte_pmd_memif at sta/net_memif_rte_eth_memif.c.o 
gcc -Idrivers/a715181@@tmp_rte_pmd_memif at sta -Idrivers -I../drivers -Idrivers/net/memif -I../drivers/net/memif -Ilib/librte_ethdev -I../lib/librte_ethdev -I. -I../ -Iconfig -I../config -Ilib/librte_eal/common/include -I../lib/librte_eal/common/include -I../lib/librte_eal/linux/eal/include -Ilib/librte_eal/common -I../lib/librte_eal/common -Ilib/librte_eal/common/include/arch/x86 -I../lib/librte_eal/common/include/arch/x86 -Ilib/librte_eal -I../lib/librte_eal -Ilib/librte_kvargs -I../lib/librte_kvargs -Ilib/librte_net -I../lib/librte_net -Ilib/librte_mbuf -I../lib/librte_mbuf -Ilib/librte_mempool -I../lib/librte_mempool -Ilib/librte_ring -I../lib/librte_ring -Ilib/librte_meter -I../lib/librte_meter -Idrivers/bus/pci -I../drivers/bus/pci -I../drivers/bus/pci/linux -Ilib/librte_pci -I../lib/librte_pci -Idrivers/bus/vdev -I../drivers/bus/vdev -Ilib/librte_hash -I../lib/librte_hash -fdiagnostics-color=always -pipe -D_FILE_OFFSET_BITS=64 -Wall -Winvalid-pch -Werror -O3 -include rte_config.h -Wunused-parameter -Wsign-compare -Wcast-qual -D_GNU_SOURCE -fPIC -march=native -mno-avx512f -Wno-format-truncation -DALLOW_EXPERIMENTAL_API -MD -MQ 'drivers/a715181@@tmp_rte_pmd_memif at sta/net_memif_rte_eth_memif.c.o' -MF 'drivers/a715181@@tmp_rte_pmd_memif at sta/net_memif_rte_eth_memif.c.o.d' -o 'drivers/a715181@@tmp_rte_pmd_memif at sta/net_memif_rte_eth_memif.c.o' -c ../drivers/net/memif/rte_eth_memif.c
../drivers/net/memif/rte_eth_memif.c: In function ‘memif_set_zc’:
../drivers/net/memif/rte_eth_memif.c:972:12: error: dereferencing pointer to incomplete type ‘struct rte_mem_config’
   if (!mcfg->single_file_segments) {
            ^~
[458/1791] Compiling C object 'drivers/a715181@@tmp_rte_bus_pci at sta/bus_pci_linux_pci_vfio.c.o'.
[459/1791] Compiling C object 'drivers/a715181@@tmp_rte_bus_vmbus at sta/bus_vmbus_vmbus_channel.c.o'.
[460/1791] Linking target drivers/librte_bus_vdev.so.2.1.
[461/1791] Compiling C object 'drivers/a715181@@tmp_rte_pmd_memif at sta/net_memif_memif_rxtx.c.o'.
[462/1791] Compiling C object 'lib/76b5a35@@rte_pipeline at sta/librte_pipeline_rte_table_action.c.o'.
ninja: build stopped: subcommand failed




*Meson Build Failed #6:
OS: FreeBSD12-64
Target:build-gcc-static
Has header "linux/virtio_scsi.h" : NO
Message: Skipping example "vhost_scsi"
Library virt found: YES
Dependency jansson found: YES (cached)

examples/meson.build:88:4: ERROR: Problem encountered: Missing dependency "power" for example "vm_power_manager"

A full log can be found at /tmp/FreeBSD12-64_K19.02_GCC7.3.0/x86_64-native-bsdapp-gcc/8eb286a0310b4fdeb443d364ee53ad6d/dpdk/build-gcc-static/meson-logs/meson-log.txt
ninja -C build-gcc-static
ninja: Entering directory `build-gcc-static'
ninja: error: loading 'build.ninja': No such file or directory
--
Has header "linux/virtio_scsi.h" : NO
Message: Skipping example "vhost_scsi"
Library virt found: YES
Dependency jansson found: YES (cached)

examples/meson.build:88:4: ERROR: Problem encountered: Missing dependency "power" for example "vm_power_manager"

A full log can be found at /tmp/FreeBSD12-64_K19.02_GCC7.3.0/x86_64-native-bsdapp-gcc/8eb286a0310b4fdeb443d364ee53ad6d/dpdk/build-gcc-shared/meson-logs/meson-log.txt
ninja -C build-gcc-shared
ninja: Entering directory `build-gcc-shared'
ninja: error: loading 'build.ninja': No such file or directory

DPDK STV team


More information about the test-report mailing list