[dpdk-test-report] |FAILURE| pw54727vfio: fix expanding DMA area in ppc64le

sys_stv at intel.com sys_stv at intel.com
Wed Jun 12 12:17:34 CEST 2019


Test-Label: Intel-compilation
Test-Status: FAILURE
http://dpdk.org/patch/54727

_Compilation issues_

Submitter: Takeshi Yoshimura <tyos at jp.ibm.com>
Date: 2019-06-12 06:33:12
Reply_mail: 20190612063313.2729-1-tyos at jp.ibm.com
DPDK git baseline:     Acked-by: Aaron Conole <aconole at redhat.com>Repo:dpdk, CommitID: 557c5cbde374172c7140bc6a7cef2cc81e5a29dc

Build Summary: 22 Builds Done, 6 Successful, 16 Failures

Meson Summary: 8 Builds Done, 3 Successful, 5 Failures



Test environment and configuration as below:

**Make Build**


OS: RHEL76-64
	Kernel Version: 3.10.0-957.el7.x86_64
	CPU info: Intel(R) Xeon(R) CPU E5-2699 v4 @ 2.20GHz
	GCC Version: gcc (GCC) 4.8.5 20150623 (Red Hat 4.8.5-36)
	Clang Version: NA
	x86_64-native-linuxapp-gcc


OS: CENTOS76-64
	Kernel Version: 3.10.0-957.10.1.el7.x86_64
	CPU info: Intel(R) Xeon(R) CPU E5-2699 v4 @ 2.20GHz
	GCC Version: gcc (GCC) 4.8.5 20150623 (Red Hat 4.8.5-36)
	Clang Version: 3.4.2 (tags/RELEASE_34/dot2-final)
	x86_64-native-linuxapp-gcc


OS: UB1804-64
	Kernel Version: 4.15.0-20-generic
	CPU info: Intel(R) Xeon(R) CPU E5-2699 v3 @ 2.30GHz
	GCC Version: gcc (Ubuntu 7.3.0-16ubuntu3) 7.3.0
	Clang Version: 6.0.0-1ubuntu2 (tags/RELEASE_600/final)
	x86_64-native-linuxapp-clang
	x86_64-native-linuxapp-icc
	x86_64-native-linuxapp-gcc


OS: UB1904-64
	Kernel Version: 5.0.0-13-generic
	CPU info: Intel(R) Xeon(R) CPU E5-2699 v3 @ 2.30GHz
	GCC Version: gcc (Ubuntu 8.3.0-6ubuntu1) 8.3.0
	Clang Version: 8.0.0-3 (tags/RELEASE_800/final)
	x86_64-native-linuxapp-gcc


OS: UB1604-32
	Kernel Version: 4.4.0-131-generic
	CPU info: Intel(R) Xeon(R) CPU E5-2699 v3 @ 2.30GHz
	GCC Version: gcc (Ubuntu 5.4.0-6ubuntu1~16.04.11) 5.4.0 20160609
	Clang Version: 3.8.0-2ubuntu4 (tags/RELEASE_380/final)
	i686-native-linuxapp-gcc


OS: UB1604-64
	Kernel Version: 4.4.0-47-generic
	CPU info: Intel(R) Xeon(R) CPU E5-2699 v3 @ 2.30GHz
	GCC Version: gcc (Ubuntu 5.4.0-6ubuntu1~16.04.10) 5.4.0 20160609
	Clang Version: 3.8.0-2ubuntu4 (tags/RELEASE_380/final)
	x86_64-native-linuxapp-clang
	x86_64-native-linuxapp-gcc


OS: FreeBSD12-64
	Kernel Version: 12.0-RC3
	CPU info: Intel(R) Xeon(R) CPU E5-2699 v4 @ 2.20GHz (2194.97-MHz K8-class CPU)
	GCC Version: gcc (FreeBSD Ports Collection) 7.3.0
	Clang Version: 6.0.1 (tags/RELEASE_601/final 335540) (based on LLVM 6.0.1)
	x86_64-native-bsdapp-gcc+shared
	x86_64-native-bsdapp-clang
	x86_64-native-bsdapp-gcc+debug
	x86_64-native-bsdapp-gcc


OS: RHEL80-64
	Kernel Version: 4.18.0-80.el8.x86_64
	CPU info: Intel(R) Xeon(R) CPU E5-2699 v4 @ 2.20GHz
	GCC Version: gcc (GCC) 8.2.1 20180905 (Red Hat 8.2.1-3)
	Clang Version: NA
	x86_64-native-linuxapp-gcc+debug
	x86_64-native-linuxapp-gcc+shared
	x86_64-native-linuxapp-clang
	x86_64-native-linuxapp-icc
	x86_64-native-linuxapp-gcc


OS: SUSE15-64
	Kernel Version: 4.12.14-lp150.11-default
	CPU info: Intel(R) Xeon(R) CPU E5-2699 v4 @ 2.20GHz
	GCC Version: gcc (SUSE Linux) 7.3.1 20180323 [gcc-7-branch revision 258812]
	Clang Version: 5.0.1 (tags/RELEASE_501/final 312548)
	x86_64-native-linuxapp-gcc
	x86_64-native-linuxapp-clang


OS: FD30-64
	Kernel Version: 5.0.9-301.fc30.x86_64
	CPU info: Intel(R) Xeon(R) CPU E5-2699 v4 @ 2.20GHz
	GCC Version: gcc (GCC) 9.1.1 20190503 (Red Hat 9.1.1-1)
	Clang Version: 8.0.0 (Fedora 8.0.0-1.fc30)
	x86_64-native-linuxapp-clang
	x86_64-native-linuxapp-gcc


**Meson Build**


OS: UB1804-64
	Kernel Version: 4.15.0-20-generic
	CPU info: Intel(R) Xeon(R) CPU E5-2699 v4 @ 2.20GHz
	GCC Version: gcc (Ubuntu 7.3.0-27ubuntu1~18.04) 7.3.0
	Clang Version: 6.0.0-1ubuntu2 (tags/RELEASE_600/final)
	build-gcc-static
	build-gcc-shared
	build-clang-static
	build-clang-shared
	build-x86-default
	x86_64-native-linuxapp-doc


OS: UB1604-32
	Kernel Version: 4.4.0-131-generic
	CPU info: Intel(R) Xeon(R) CPU E5-2699 v4 @ 2.20GHz
	GCC Version: gcc (Ubuntu 5.4.0-6ubuntu1~16.04.11) 5.4.0 20160609
	Clang Version: 3.8.0-2ubuntu4 (tags/RELEASE_380/final)
	build-gcc-static
	build-gcc-shared
	build-clang-static
	build-clang-shared
	build-x86-default


OS: WIN10-64
	Kernel Version: N/A
	CPU info: N/A
	GCC Version: N/A
	Clang Version: Clang 8.0.0
	x86_64-windows-clang


OS: FreeBSD12-64
	Kernel Version: 12.0-RC3
	CPU info: Intel(R) Xeon(R) CPU E5-2699 v4 @ 2.20GHz (2194.98-MHz K8-class CPU)
	GCC Version: gcc (FreeBSD Ports Collection) 7.3.0
	Clang Version: 6.0.1 (tags/RELEASE_601/final 335540) (based on LLVM 6.0.1)
	build-gcc-static
	build-gcc-shared
	build-clang-static
	build-clang-shared
	build-x86-default


OS: RHEL80-64
	Kernel Version: 4.18.0-80.el8.x86_64
	CPU info: Intel(R) Xeon(R) CPU E5-2699 v4 @ 2.20GHz
	GCC Version: gcc (GCC) 8.2.1 20180905 (Red Hat 8.2.1-3)
	Clang Version: NA
	build-gcc-static
	build-gcc-shared
	build-x86-default


OS: SUSE15-64
	Kernel Version: 4.12.14-lp150.11-default
	CPU info: Intel(R) Xeon(R) CPU E5-2699 v4 @ 2.20GHz
	GCC Version: gcc (SUSE Linux) 7.3.1 20180323 [gcc-7-branch revision 258812]
	Clang Version: 5.0.1 (tags/RELEASE_501/final 312548)
	build-gcc-static
	build-gcc-shared
	build-clang-static
	build-clang-shared
	build-x86-default


OS: FD30-64
	Kernel Version: 5.0.9-301.fc30.x86_64
	CPU info: Intel(R) Xeon(R) CPU E5-2699 v4 @ 2.20GHz
	GCC Version: gcc (GCC) 9.1.1 20190503 (Red Hat 9.1.1-1)
	Clang Version: 8.0.0 (Fedora 8.0.0-1.fc30)
	build-gcc-static
	build-gcc-shared
	build-clang-static
	build-clang-shared
	build-x86-default

*Build Failed Build #1:
OS: UB1604-32
Target: i686-native-linuxapp-gcc
 vfio_spapr_create_new_dma_window(int vfio_container_fd,
 ^
cc1: error: unrecognized command line option ‘-Wno-address-of-packed-member’ [-Werror]
cc1: all warnings being treated as errors
/tmp/UB1604-32_K4.4.0_GCC5.4.0/i686-native-linuxapp-gcc/04f986c1299a4b308d6c25498815e2ef/dpdk/mk/internal/rte.compile-pre.mk:114: recipe for target 'eal_vfio.o' failed
make[7]: *** [eal_vfio.o] Error 1
make[7]: *** Waiting for unfinished jobs....
/tmp/UB1604-32_K4.4.0_GCC5.4.0/i686-native-linuxapp-gcc/04f986c1299a4b308d6c25498815e2ef/dpdk/mk/rte.subdir.mk:35: recipe for target 'eal' failed
make[6]: *** [eal] Error 2
/tmp/UB1604-32_K4.4.0_GCC5.4.0/i686-native-linuxapp-gcc/04f986c1299a4b308d6c25498815e2ef/dpdk/mk/rte.subdir.mk:35: recipe for target 'linux' failed
make[5]: *** [linux] Error 2
/tmp/UB1604-32_K4.4.0_GCC5.4.0/i686-native-linuxapp-gcc/04f986c1299a4b308d6c25498815e2ef/dpdk/mk/rte.subdir.mk:35: recipe for target 'librte_eal' failed
make[4]: *** [librte_eal] Error 2
/tmp/UB1604-32_K4.4.0_GCC5.4.0/i686-native-linuxapp-gcc/04f986c1299a4b308d6c25498815e2ef/dpdk/mk/rte.sdkbuild.mk:46: recipe for target 'lib' failed
make[3]: *** [lib] Error 2
/tmp/UB1604-32_K4.4.0_GCC5.4.0/i686-native-linuxapp-gcc/04f986c1299a4b308d6c25498815e2ef/dpdk/mk/rte.sdkroot.mk:98: recipe for target 'all' failed
make[2]: *** [all] Error 2
/tmp/UB1604-32_K4.4.0_GCC5.4.0/i686-native-linuxapp-gcc/04f986c1299a4b308d6c25498815e2ef/dpdk/mk/rte.sdkinstall.mk:60: recipe for target 'pre_install' failed
make[1]: *** [pre_install] Error 2
/tmp/UB1604-32_K4.4.0_GCC5.4.0/i686-native-linuxapp-gcc/04f986c1299a4b308d6c25498815e2ef/dpdk/mk/rte.sdkroot.mk:77: recipe for target 'install' failed
make: *** [install] Error 2

*Build Failed Build #2:
OS: UB1604-64
Target: x86_64-native-linuxapp-clang
vfio_spapr_create_new_dma_window(int vfio_container_fd,
^
4 errors generated.
/tmp/UB1604-64_K4.4.0_Clang3.8.0/x86_64-native-linuxapp-clang/04f986c1299a4b308d6c25498815e2ef/dpdk/mk/internal/rte.compile-pre.mk:114: recipe for target 'eal_vfio.o' failed
make[7]: *** [eal_vfio.o] Error 1
make[7]: *** Waiting for unfinished jobs....
/tmp/UB1604-64_K4.4.0_Clang3.8.0/x86_64-native-linuxapp-clang/04f986c1299a4b308d6c25498815e2ef/dpdk/mk/rte.subdir.mk:35: recipe for target 'eal' failed
make[6]: *** [eal] Error 2
/tmp/UB1604-64_K4.4.0_Clang3.8.0/x86_64-native-linuxapp-clang/04f986c1299a4b308d6c25498815e2ef/dpdk/mk/rte.subdir.mk:35: recipe for target 'linux' failed
make[5]: *** [linux] Error 2
/tmp/UB1604-64_K4.4.0_Clang3.8.0/x86_64-native-linuxapp-clang/04f986c1299a4b308d6c25498815e2ef/dpdk/mk/rte.subdir.mk:35: recipe for target 'librte_eal' failed
make[4]: *** [librte_eal] Error 2
/tmp/UB1604-64_K4.4.0_Clang3.8.0/x86_64-native-linuxapp-clang/04f986c1299a4b308d6c25498815e2ef/dpdk/mk/rte.sdkbuild.mk:46: recipe for target 'lib' failed
make[3]: *** [lib] Error 2
/tmp/UB1604-64_K4.4.0_Clang3.8.0/x86_64-native-linuxapp-clang/04f986c1299a4b308d6c25498815e2ef/dpdk/mk/rte.sdkroot.mk:98: recipe for target 'all' failed
make[2]: *** [all] Error 2
/tmp/UB1604-64_K4.4.0_Clang3.8.0/x86_64-native-linuxapp-clang/04f986c1299a4b308d6c25498815e2ef/dpdk/mk/rte.sdkinstall.mk:60: recipe for target 'pre_install' failed
make[1]: *** [pre_install] Error 2
/tmp/UB1604-64_K4.4.0_Clang3.8.0/x86_64-native-linuxapp-clang/04f986c1299a4b308d6c25498815e2ef/dpdk/mk/rte.sdkroot.mk:77: recipe for target 'install' failed
make: *** [install] Error 2

*Build Failed Build #3:
OS: UB1904-64
Target: x86_64-native-linuxapp-gcc
 vfio_spapr_map_walk(const struct rte_memseg_list *msl,
 ^~~~~~~~~~~~~~~~~~~
cc1: error: unrecognized command line option ‘-Wno-address-of-packed-member’ [-Werror]
cc1: all warnings being treated as errors
make[7]: *** [/tmp/UB1904-64_K4.18.0_GCC8.3.0/x86_64-native-linuxapp-gcc/04f986c1299a4b308d6c25498815e2ef/dpdk/mk/internal/rte.compile-pre.mk:114: eal_vfio.o] Error 1
make[7]: *** Waiting for unfinished jobs....
make[6]: *** [/tmp/UB1904-64_K4.18.0_GCC8.3.0/x86_64-native-linuxapp-gcc/04f986c1299a4b308d6c25498815e2ef/dpdk/mk/rte.subdir.mk:37: eal] Error 2
make[5]: *** [/tmp/UB1904-64_K4.18.0_GCC8.3.0/x86_64-native-linuxapp-gcc/04f986c1299a4b308d6c25498815e2ef/dpdk/mk/rte.subdir.mk:37: linux] Error 2
make[4]: *** [/tmp/UB1904-64_K4.18.0_GCC8.3.0/x86_64-native-linuxapp-gcc/04f986c1299a4b308d6c25498815e2ef/dpdk/mk/rte.subdir.mk:35: librte_eal] Error 2
make[3]: *** [/tmp/UB1904-64_K4.18.0_GCC8.3.0/x86_64-native-linuxapp-gcc/04f986c1299a4b308d6c25498815e2ef/dpdk/mk/rte.sdkbuild.mk:48: lib] Error 2
make[2]: *** [/tmp/UB1904-64_K4.18.0_GCC8.3.0/x86_64-native-linuxapp-gcc/04f986c1299a4b308d6c25498815e2ef/dpdk/mk/rte.sdkroot.mk:99: all] Error 2
make[1]: *** [/tmp/UB1904-64_K4.18.0_GCC8.3.0/x86_64-native-linuxapp-gcc/04f986c1299a4b308d6c25498815e2ef/dpdk/mk/rte.sdkinstall.mk:61: pre_install] Error 2
make: *** [/tmp/UB1904-64_K4.18.0_GCC8.3.0/x86_64-native-linuxapp-gcc/04f986c1299a4b308d6c25498815e2ef/dpdk/mk/rte.sdkroot.mk:77: install] Error 2

*Build Failed Build #4:
OS: UB1804-64
Target: x86_64-native-linuxapp-clang
vfio_spapr_create_new_dma_window(int vfio_container_fd,
^
4 errors generated.
/tmp/UB1804-64_K4.15.0_Clang6.0.0/x86_64-native-linuxapp-clang/04f986c1299a4b308d6c25498815e2ef/dpdk/mk/internal/rte.compile-pre.mk:114: recipe for target 'eal_vfio.o' failed
make[7]: *** [eal_vfio.o] Error 1
make[7]: *** Waiting for unfinished jobs....
/tmp/UB1804-64_K4.15.0_Clang6.0.0/x86_64-native-linuxapp-clang/04f986c1299a4b308d6c25498815e2ef/dpdk/mk/rte.subdir.mk:35: recipe for target 'eal' failed
make[6]: *** [eal] Error 2
/tmp/UB1804-64_K4.15.0_Clang6.0.0/x86_64-native-linuxapp-clang/04f986c1299a4b308d6c25498815e2ef/dpdk/mk/rte.subdir.mk:35: recipe for target 'linux' failed
make[5]: *** [linux] Error 2
/tmp/UB1804-64_K4.15.0_Clang6.0.0/x86_64-native-linuxapp-clang/04f986c1299a4b308d6c25498815e2ef/dpdk/mk/rte.subdir.mk:35: recipe for target 'librte_eal' failed
make[4]: *** [librte_eal] Error 2
/tmp/UB1804-64_K4.15.0_Clang6.0.0/x86_64-native-linuxapp-clang/04f986c1299a4b308d6c25498815e2ef/dpdk/mk/rte.sdkbuild.mk:46: recipe for target 'lib' failed
make[3]: *** [lib] Error 2
/tmp/UB1804-64_K4.15.0_Clang6.0.0/x86_64-native-linuxapp-clang/04f986c1299a4b308d6c25498815e2ef/dpdk/mk/rte.sdkroot.mk:98: recipe for target 'all' failed
make[2]: *** [all] Error 2
/tmp/UB1804-64_K4.15.0_Clang6.0.0/x86_64-native-linuxapp-clang/04f986c1299a4b308d6c25498815e2ef/dpdk/mk/rte.sdkinstall.mk:60: recipe for target 'pre_install' failed
make[1]: *** [pre_install] Error 2
/tmp/UB1804-64_K4.15.0_Clang6.0.0/x86_64-native-linuxapp-clang/04f986c1299a4b308d6c25498815e2ef/dpdk/mk/rte.sdkroot.mk:77: recipe for target 'install' failed
make: *** [install] Error 2

*Build Failed Build #5:
OS: RHEL80-64
Target: x86_64-native-linuxapp-gcc+debug
 vfio_spapr_map_walk(const struct rte_memseg_list *msl,
 ^~~~~~~~~~~~~~~~~~~
cc1: error: unrecognized command line option ‘-Wno-address-of-packed-member’ [-Werror]
cc1: all warnings being treated as errors
make[7]: *** [/tmp/RHEL80-64_K3.10.0_GCC8.2.1/x86_64-native-linuxapp-gcc+debug/04f986c1299a4b308d6c25498815e2ef/dpdk/mk/internal/rte.compile-pre.mk:116: eal_vfio.o] Error 1
make[7]: *** Waiting for unfinished jobs....
make[6]: *** [/tmp/RHEL80-64_K3.10.0_GCC8.2.1/x86_64-native-linuxapp-gcc+debug/04f986c1299a4b308d6c25498815e2ef/dpdk/mk/rte.subdir.mk:37: eal] Error 2
make[5]: *** [/tmp/RHEL80-64_K3.10.0_GCC8.2.1/x86_64-native-linuxapp-gcc+debug/04f986c1299a4b308d6c25498815e2ef/dpdk/mk/rte.subdir.mk:37: linux] Error 2
make[4]: *** [/tmp/RHEL80-64_K3.10.0_GCC8.2.1/x86_64-native-linuxapp-gcc+debug/04f986c1299a4b308d6c25498815e2ef/dpdk/mk/rte.subdir.mk:35: librte_eal] Error 2
make[3]: *** [/tmp/RHEL80-64_K3.10.0_GCC8.2.1/x86_64-native-linuxapp-gcc+debug/04f986c1299a4b308d6c25498815e2ef/dpdk/mk/rte.sdkbuild.mk:48: lib] Error 2
make[2]: *** [/tmp/RHEL80-64_K3.10.0_GCC8.2.1/x86_64-native-linuxapp-gcc+debug/04f986c1299a4b308d6c25498815e2ef/dpdk/mk/rte.sdkroot.mk:99: all] Error 2
make[1]: *** [/tmp/RHEL80-64_K3.10.0_GCC8.2.1/x86_64-native-linuxapp-gcc+debug/04f986c1299a4b308d6c25498815e2ef/dpdk/mk/rte.sdkinstall.mk:61: pre_install] Error 2
make: *** [/tmp/RHEL80-64_K3.10.0_GCC8.2.1/x86_64-native-linuxapp-gcc+debug/04f986c1299a4b308d6c25498815e2ef/dpdk/mk/rte.sdkroot.mk:77: install] Error 2

*Build Failed Build #6:
OS: RHEL80-64
Target: x86_64-native-linuxapp-gcc+shared
 vfio_spapr_map_walk(const struct rte_memseg_list *msl,
 ^~~~~~~~~~~~~~~~~~~
cc1: error: unrecognized command line option ‘-Wno-address-of-packed-member’ [-Werror]
cc1: all warnings being treated as errors
make[7]: *** [/tmp/RHEL80-64_K3.10.0_GCC8.2.1/x86_64-native-linuxapp-gcc+shared/04f986c1299a4b308d6c25498815e2ef/dpdk/mk/internal/rte.compile-pre.mk:114: eal_vfio.o] Error 1
make[7]: *** Waiting for unfinished jobs....
make[6]: *** [/tmp/RHEL80-64_K3.10.0_GCC8.2.1/x86_64-native-linuxapp-gcc+shared/04f986c1299a4b308d6c25498815e2ef/dpdk/mk/rte.subdir.mk:37: eal] Error 2
make[5]: *** [/tmp/RHEL80-64_K3.10.0_GCC8.2.1/x86_64-native-linuxapp-gcc+shared/04f986c1299a4b308d6c25498815e2ef/dpdk/mk/rte.subdir.mk:37: linux] Error 2
make[4]: *** [/tmp/RHEL80-64_K3.10.0_GCC8.2.1/x86_64-native-linuxapp-gcc+shared/04f986c1299a4b308d6c25498815e2ef/dpdk/mk/rte.subdir.mk:35: librte_eal] Error 2
make[3]: *** [/tmp/RHEL80-64_K3.10.0_GCC8.2.1/x86_64-native-linuxapp-gcc+shared/04f986c1299a4b308d6c25498815e2ef/dpdk/mk/rte.sdkbuild.mk:48: lib] Error 2
make[2]: *** [/tmp/RHEL80-64_K3.10.0_GCC8.2.1/x86_64-native-linuxapp-gcc+shared/04f986c1299a4b308d6c25498815e2ef/dpdk/mk/rte.sdkroot.mk:99: all] Error 2
make[1]: *** [/tmp/RHEL80-64_K3.10.0_GCC8.2.1/x86_64-native-linuxapp-gcc+shared/04f986c1299a4b308d6c25498815e2ef/dpdk/mk/rte.sdkinstall.mk:61: pre_install] Error 2
make: *** [/tmp/RHEL80-64_K3.10.0_GCC8.2.1/x86_64-native-linuxapp-gcc+shared/04f986c1299a4b308d6c25498815e2ef/dpdk/mk/rte.sdkroot.mk:77: install] Error 2

*Build Failed Build #7:
OS: RHEL80-64
Target: x86_64-native-linuxapp-clang
vfio_spapr_create_new_dma_window(int vfio_container_fd,
^
4 errors generated.
make[7]: *** [/tmp/RHEL80-64_K3.10.0_Clang6.0.1/x86_64-native-linuxapp-clang/04f986c1299a4b308d6c25498815e2ef/dpdk/mk/internal/rte.compile-pre.mk:116: eal_vfio.o] Error 1
make[7]: *** Waiting for unfinished jobs....
make[6]: *** [/tmp/RHEL80-64_K3.10.0_Clang6.0.1/x86_64-native-linuxapp-clang/04f986c1299a4b308d6c25498815e2ef/dpdk/mk/rte.subdir.mk:37: eal] Error 2
make[5]: *** [/tmp/RHEL80-64_K3.10.0_Clang6.0.1/x86_64-native-linuxapp-clang/04f986c1299a4b308d6c25498815e2ef/dpdk/mk/rte.subdir.mk:37: linux] Error 2
make[4]: *** [/tmp/RHEL80-64_K3.10.0_Clang6.0.1/x86_64-native-linuxapp-clang/04f986c1299a4b308d6c25498815e2ef/dpdk/mk/rte.subdir.mk:35: librte_eal] Error 2
make[3]: *** [/tmp/RHEL80-64_K3.10.0_Clang6.0.1/x86_64-native-linuxapp-clang/04f986c1299a4b308d6c25498815e2ef/dpdk/mk/rte.sdkbuild.mk:48: lib] Error 2
make[2]: *** [/tmp/RHEL80-64_K3.10.0_Clang6.0.1/x86_64-native-linuxapp-clang/04f986c1299a4b308d6c25498815e2ef/dpdk/mk/rte.sdkroot.mk:99: all] Error 2
make[1]: *** [/tmp/RHEL80-64_K3.10.0_Clang6.0.1/x86_64-native-linuxapp-clang/04f986c1299a4b308d6c25498815e2ef/dpdk/mk/rte.sdkinstall.mk:61: pre_install] Error 2
make: *** [/tmp/RHEL80-64_K3.10.0_Clang6.0.1/x86_64-native-linuxapp-clang/04f986c1299a4b308d6c25498815e2ef/dpdk/mk/rte.sdkroot.mk:77: install] Error 2

*Build Failed Build #8:
OS: FD30-64
Target: x86_64-native-linuxapp-clang
vfio_spapr_create_new_dma_window(int vfio_container_fd,
^
4 errors generated.
make[7]: *** [/tmp/FD30-64_K4.20_Clang8.0.0/x86_64-native-linuxapp-clang/04f986c1299a4b308d6c25498815e2ef/dpdk/mk/internal/rte.compile-pre.mk:114: eal_vfio.o] Error 1
make[7]: *** Waiting for unfinished jobs....
make[6]: *** [/tmp/FD30-64_K4.20_Clang8.0.0/x86_64-native-linuxapp-clang/04f986c1299a4b308d6c25498815e2ef/dpdk/mk/rte.subdir.mk:37: eal] Error 2
make[5]: *** [/tmp/FD30-64_K4.20_Clang8.0.0/x86_64-native-linuxapp-clang/04f986c1299a4b308d6c25498815e2ef/dpdk/mk/rte.subdir.mk:37: linux] Error 2
make[4]: *** [/tmp/FD30-64_K4.20_Clang8.0.0/x86_64-native-linuxapp-clang/04f986c1299a4b308d6c25498815e2ef/dpdk/mk/rte.subdir.mk:35: librte_eal] Error 2
make[3]: *** [/tmp/FD30-64_K4.20_Clang8.0.0/x86_64-native-linuxapp-clang/04f986c1299a4b308d6c25498815e2ef/dpdk/mk/rte.sdkbuild.mk:48: lib] Error 2
make[2]: *** [/tmp/FD30-64_K4.20_Clang8.0.0/x86_64-native-linuxapp-clang/04f986c1299a4b308d6c25498815e2ef/dpdk/mk/rte.sdkroot.mk:99: all] Error 2
make[1]: *** [/tmp/FD30-64_K4.20_Clang8.0.0/x86_64-native-linuxapp-clang/04f986c1299a4b308d6c25498815e2ef/dpdk/mk/rte.sdkinstall.mk:61: pre_install] Error 2
make: *** [/tmp/FD30-64_K4.20_Clang8.0.0/x86_64-native-linuxapp-clang/04f986c1299a4b308d6c25498815e2ef/dpdk/mk/rte.sdkroot.mk:77: install] Error 2

*Build Failed Build #9:
OS: RHEL76-64
Target: x86_64-native-linuxapp-gcc
 vfio_spapr_create_new_dma_window(int vfio_container_fd,
 ^
cc1: error: unrecognized command line option "-Wno-address-of-packed-member" [-Werror]
cc1: all warnings being treated as errors
make[7]: *** [eal_vfio.o] Error 1
make[7]: *** Waiting for unfinished jobs....
make[6]: *** [eal] Error 2
make[5]: *** [linux] Error 2
make[4]: *** [librte_eal] Error 2
make[3]: *** [lib] Error 2
make[2]: *** [all] Error 2
make[1]: *** [pre_install] Error 2
make: *** [install] Error 2

*Build Failed Build #10:
OS: SUSE15-64
Target: x86_64-native-linuxapp-gcc
 vfio_spapr_map_walk(const struct rte_memseg_list *msl,
 ^~~~~~~~~~~~~~~~~~~
cc1: error: unrecognized command line option ‘-Wno-address-of-packed-member’ [-Werror]
cc1: all warnings being treated as errors
make[7]: *** [/tmp/SUSE15-64_K4.12.14_GCC7.3.1/x86_64-native-linuxapp-gcc/04f986c1299a4b308d6c25498815e2ef/dpdk/mk/internal/rte.compile-pre.mk:114: eal_vfio.o] Error 1
make[7]: *** Waiting for unfinished jobs....
make[6]: *** [/tmp/SUSE15-64_K4.12.14_GCC7.3.1/x86_64-native-linuxapp-gcc/04f986c1299a4b308d6c25498815e2ef/dpdk/mk/rte.subdir.mk:37: eal] Error 2
make[5]: *** [/tmp/SUSE15-64_K4.12.14_GCC7.3.1/x86_64-native-linuxapp-gcc/04f986c1299a4b308d6c25498815e2ef/dpdk/mk/rte.subdir.mk:37: linux] Error 2
make[4]: *** [/tmp/SUSE15-64_K4.12.14_GCC7.3.1/x86_64-native-linuxapp-gcc/04f986c1299a4b308d6c25498815e2ef/dpdk/mk/rte.subdir.mk:35: librte_eal] Error 2
make[3]: *** [/tmp/SUSE15-64_K4.12.14_GCC7.3.1/x86_64-native-linuxapp-gcc/04f986c1299a4b308d6c25498815e2ef/dpdk/mk/rte.sdkbuild.mk:48: lib] Error 2
make[2]: *** [/tmp/SUSE15-64_K4.12.14_GCC7.3.1/x86_64-native-linuxapp-gcc/04f986c1299a4b308d6c25498815e2ef/dpdk/mk/rte.sdkroot.mk:99: all] Error 2
make[1]: *** [/tmp/SUSE15-64_K4.12.14_GCC7.3.1/x86_64-native-linuxapp-gcc/04f986c1299a4b308d6c25498815e2ef/dpdk/mk/rte.sdkinstall.mk:61: pre_install] Error 2
make: *** [/tmp/SUSE15-64_K4.12.14_GCC7.3.1/x86_64-native-linuxapp-gcc/04f986c1299a4b308d6c25498815e2ef/dpdk/mk/rte.sdkroot.mk:77: install] Error 2

*Build Failed Build #11:
OS: FD30-64
Target: x86_64-native-linuxapp-gcc
/tmp/FD30-64_K4.20_GCC9.1.1/x86_64-native-linuxapp-gcc/04f986c1299a4b308d6c25498815e2ef/dpdk/lib/librte_eal/linux/eal/eal_vfio.c:1406:1: error: ‘vfio_spapr_map_walk’ defined but not used [-Werror=unused-function]
 1406 | vfio_spapr_map_walk(const struct rte_memseg_list *msl,
      | ^~~~~~~~~~~~~~~~~~~
cc1: all warnings being treated as errors
make[7]: *** [/tmp/FD30-64_K4.20_GCC9.1.1/x86_64-native-linuxapp-gcc/04f986c1299a4b308d6c25498815e2ef/dpdk/mk/internal/rte.compile-pre.mk:116: eal_vfio.o] Error 1
make[7]: *** Waiting for unfinished jobs....
make[6]: *** [/tmp/FD30-64_K4.20_GCC9.1.1/x86_64-native-linuxapp-gcc/04f986c1299a4b308d6c25498815e2ef/dpdk/mk/rte.subdir.mk:37: eal] Error 2
make[5]: *** [/tmp/FD30-64_K4.20_GCC9.1.1/x86_64-native-linuxapp-gcc/04f986c1299a4b308d6c25498815e2ef/dpdk/mk/rte.subdir.mk:37: linux] Error 2
make[4]: *** [/tmp/FD30-64_K4.20_GCC9.1.1/x86_64-native-linuxapp-gcc/04f986c1299a4b308d6c25498815e2ef/dpdk/mk/rte.subdir.mk:35: librte_eal] Error 2
make[3]: *** [/tmp/FD30-64_K4.20_GCC9.1.1/x86_64-native-linuxapp-gcc/04f986c1299a4b308d6c25498815e2ef/dpdk/mk/rte.sdkbuild.mk:48: lib] Error 2
make[2]: *** [/tmp/FD30-64_K4.20_GCC9.1.1/x86_64-native-linuxapp-gcc/04f986c1299a4b308d6c25498815e2ef/dpdk/mk/rte.sdkroot.mk:99: all] Error 2
make[1]: *** [/tmp/FD30-64_K4.20_GCC9.1.1/x86_64-native-linuxapp-gcc/04f986c1299a4b308d6c25498815e2ef/dpdk/mk/rte.sdkinstall.mk:61: pre_install] Error 2
make: *** [/tmp/FD30-64_K4.20_GCC9.1.1/x86_64-native-linuxapp-gcc/04f986c1299a4b308d6c25498815e2ef/dpdk/mk/rte.sdkroot.mk:77: install] Error 2

*Build Failed Build #12:
OS: RHEL80-64
Target: x86_64-native-linuxapp-gcc
 vfio_spapr_map_walk(const struct rte_memseg_list *msl,
 ^~~~~~~~~~~~~~~~~~~
cc1: error: unrecognized command line option ‘-Wno-address-of-packed-member’ [-Werror]
cc1: all warnings being treated as errors
make[7]: *** [/tmp/RHEL80-64_K3.10.0_GCC8.2.1/x86_64-native-linuxapp-gcc/04f986c1299a4b308d6c25498815e2ef/dpdk/mk/internal/rte.compile-pre.mk:114: eal_vfio.o] Error 1
make[7]: *** Waiting for unfinished jobs....
make[6]: *** [/tmp/RHEL80-64_K3.10.0_GCC8.2.1/x86_64-native-linuxapp-gcc/04f986c1299a4b308d6c25498815e2ef/dpdk/mk/rte.subdir.mk:37: eal] Error 2
make[5]: *** [/tmp/RHEL80-64_K3.10.0_GCC8.2.1/x86_64-native-linuxapp-gcc/04f986c1299a4b308d6c25498815e2ef/dpdk/mk/rte.subdir.mk:37: linux] Error 2
make[4]: *** [/tmp/RHEL80-64_K3.10.0_GCC8.2.1/x86_64-native-linuxapp-gcc/04f986c1299a4b308d6c25498815e2ef/dpdk/mk/rte.subdir.mk:35: librte_eal] Error 2
make[3]: *** [/tmp/RHEL80-64_K3.10.0_GCC8.2.1/x86_64-native-linuxapp-gcc/04f986c1299a4b308d6c25498815e2ef/dpdk/mk/rte.sdkbuild.mk:48: lib] Error 2
make[2]: *** [/tmp/RHEL80-64_K3.10.0_GCC8.2.1/x86_64-native-linuxapp-gcc/04f986c1299a4b308d6c25498815e2ef/dpdk/mk/rte.sdkroot.mk:99: all] Error 2
make[1]: *** [/tmp/RHEL80-64_K3.10.0_GCC8.2.1/x86_64-native-linuxapp-gcc/04f986c1299a4b308d6c25498815e2ef/dpdk/mk/rte.sdkinstall.mk:61: pre_install] Error 2
make: *** [/tmp/RHEL80-64_K3.10.0_GCC8.2.1/x86_64-native-linuxapp-gcc/04f986c1299a4b308d6c25498815e2ef/dpdk/mk/rte.sdkroot.mk:77: install] Error 2

*Build Failed Build #13:
OS: SUSE15-64
Target: x86_64-native-linuxapp-clang
vfio_spapr_create_new_dma_window(int vfio_container_fd,
^
4 errors generated.
make[7]: *** [/tmp/SUSE15-64_K4.12.14_Clang5.0.1/x86_64-native-linuxapp-clang/04f986c1299a4b308d6c25498815e2ef/dpdk/mk/internal/rte.compile-pre.mk:114: eal_vfio.o] Error 1
make[7]: *** Waiting for unfinished jobs....
make[6]: *** [/tmp/SUSE15-64_K4.12.14_Clang5.0.1/x86_64-native-linuxapp-clang/04f986c1299a4b308d6c25498815e2ef/dpdk/mk/rte.subdir.mk:37: eal] Error 2
make[5]: *** [/tmp/SUSE15-64_K4.12.14_Clang5.0.1/x86_64-native-linuxapp-clang/04f986c1299a4b308d6c25498815e2ef/dpdk/mk/rte.subdir.mk:37: linux] Error 2
make[4]: *** [/tmp/SUSE15-64_K4.12.14_Clang5.0.1/x86_64-native-linuxapp-clang/04f986c1299a4b308d6c25498815e2ef/dpdk/mk/rte.subdir.mk:35: librte_eal] Error 2
make[3]: *** [/tmp/SUSE15-64_K4.12.14_Clang5.0.1/x86_64-native-linuxapp-clang/04f986c1299a4b308d6c25498815e2ef/dpdk/mk/rte.sdkbuild.mk:48: lib] Error 2
make[2]: *** [/tmp/SUSE15-64_K4.12.14_Clang5.0.1/x86_64-native-linuxapp-clang/04f986c1299a4b308d6c25498815e2ef/dpdk/mk/rte.sdkroot.mk:99: all] Error 2
make[1]: *** [/tmp/SUSE15-64_K4.12.14_Clang5.0.1/x86_64-native-linuxapp-clang/04f986c1299a4b308d6c25498815e2ef/dpdk/mk/rte.sdkinstall.mk:61: pre_install] Error 2
make: *** [/tmp/SUSE15-64_K4.12.14_Clang5.0.1/x86_64-native-linuxapp-clang/04f986c1299a4b308d6c25498815e2ef/dpdk/mk/rte.sdkroot.mk:77: install] Error 2

*Build Failed Build #14:
OS: UB1604-64
Target: x86_64-native-linuxapp-gcc
 vfio_spapr_create_new_dma_window(int vfio_container_fd,
 ^
cc1: error: unrecognized command line option ‘-Wno-address-of-packed-member’ [-Werror]
cc1: all warnings being treated as errors
/tmp/UB1604-64_K4.4.0_GCC5.4.0/x86_64-native-linuxapp-gcc/04f986c1299a4b308d6c25498815e2ef/dpdk/mk/internal/rte.compile-pre.mk:114: recipe for target 'eal_vfio.o' failed
make[7]: *** [eal_vfio.o] Error 1
make[7]: *** Waiting for unfinished jobs....
/tmp/UB1604-64_K4.4.0_GCC5.4.0/x86_64-native-linuxapp-gcc/04f986c1299a4b308d6c25498815e2ef/dpdk/mk/rte.subdir.mk:35: recipe for target 'eal' failed
make[6]: *** [eal] Error 2
/tmp/UB1604-64_K4.4.0_GCC5.4.0/x86_64-native-linuxapp-gcc/04f986c1299a4b308d6c25498815e2ef/dpdk/mk/rte.subdir.mk:35: recipe for target 'linux' failed
make[5]: *** [linux] Error 2
/tmp/UB1604-64_K4.4.0_GCC5.4.0/x86_64-native-linuxapp-gcc/04f986c1299a4b308d6c25498815e2ef/dpdk/mk/rte.subdir.mk:35: recipe for target 'librte_eal' failed
make[4]: *** [librte_eal] Error 2
/tmp/UB1604-64_K4.4.0_GCC5.4.0/x86_64-native-linuxapp-gcc/04f986c1299a4b308d6c25498815e2ef/dpdk/mk/rte.sdkbuild.mk:46: recipe for target 'lib' failed
make[3]: *** [lib] Error 2
/tmp/UB1604-64_K4.4.0_GCC5.4.0/x86_64-native-linuxapp-gcc/04f986c1299a4b308d6c25498815e2ef/dpdk/mk/rte.sdkroot.mk:98: recipe for target 'all' failed
make[2]: *** [all] Error 2
/tmp/UB1604-64_K4.4.0_GCC5.4.0/x86_64-native-linuxapp-gcc/04f986c1299a4b308d6c25498815e2ef/dpdk/mk/rte.sdkinstall.mk:60: recipe for target 'pre_install' failed
make[1]: *** [pre_install] Error 2
/tmp/UB1604-64_K4.4.0_GCC5.4.0/x86_64-native-linuxapp-gcc/04f986c1299a4b308d6c25498815e2ef/dpdk/mk/rte.sdkroot.mk:77: recipe for target 'install' failed
make: *** [install] Error 2

*Build Failed Build #15:
OS: UB1804-64
Target: x86_64-native-linuxapp-gcc
 vfio_spapr_map_walk(const struct rte_memseg_list *msl,
 ^~~~~~~~~~~~~~~~~~~
cc1: error: unrecognized command line option ‘-Wno-address-of-packed-member’ [-Werror]
cc1: all warnings being treated as errors
/tmp/UB1804-64_K4.15.0_GCC7.3.0/x86_64-native-linuxapp-gcc/04f986c1299a4b308d6c25498815e2ef/dpdk/mk/internal/rte.compile-pre.mk:114: recipe for target 'eal_vfio.o' failed
make[7]: *** [eal_vfio.o] Error 1
make[7]: *** Waiting for unfinished jobs....
/tmp/UB1804-64_K4.15.0_GCC7.3.0/x86_64-native-linuxapp-gcc/04f986c1299a4b308d6c25498815e2ef/dpdk/mk/rte.subdir.mk:35: recipe for target 'eal' failed
make[6]: *** [eal] Error 2
/tmp/UB1804-64_K4.15.0_GCC7.3.0/x86_64-native-linuxapp-gcc/04f986c1299a4b308d6c25498815e2ef/dpdk/mk/rte.subdir.mk:35: recipe for target 'linux' failed
make[5]: *** [linux] Error 2
/tmp/UB1804-64_K4.15.0_GCC7.3.0/x86_64-native-linuxapp-gcc/04f986c1299a4b308d6c25498815e2ef/dpdk/mk/rte.subdir.mk:35: recipe for target 'librte_eal' failed
make[4]: *** [librte_eal] Error 2
/tmp/UB1804-64_K4.15.0_GCC7.3.0/x86_64-native-linuxapp-gcc/04f986c1299a4b308d6c25498815e2ef/dpdk/mk/rte.sdkbuild.mk:46: recipe for target 'lib' failed
make[3]: *** [lib] Error 2
/tmp/UB1804-64_K4.15.0_GCC7.3.0/x86_64-native-linuxapp-gcc/04f986c1299a4b308d6c25498815e2ef/dpdk/mk/rte.sdkroot.mk:98: recipe for target 'all' failed
make[2]: *** [all] Error 2
/tmp/UB1804-64_K4.15.0_GCC7.3.0/x86_64-native-linuxapp-gcc/04f986c1299a4b308d6c25498815e2ef/dpdk/mk/rte.sdkinstall.mk:60: recipe for target 'pre_install' failed
make[1]: *** [pre_install] Error 2
/tmp/UB1804-64_K4.15.0_GCC7.3.0/x86_64-native-linuxapp-gcc/04f986c1299a4b308d6c25498815e2ef/dpdk/mk/rte.sdkroot.mk:77: recipe for target 'install' failed
make: *** [install] Error 2

*Build Failed Build #16:
OS: CENTOS76-64
Target: x86_64-native-linuxapp-gcc
 vfio_spapr_create_new_dma_window(int vfio_container_fd,
 ^
cc1: error: unrecognized command line option "-Wno-address-of-packed-member" [-Werror]
cc1: all warnings being treated as errors
make[7]: *** [eal_vfio.o] Error 1
make[7]: *** Waiting for unfinished jobs....
make[6]: *** [eal] Error 2
make[5]: *** [linux] Error 2
make[4]: *** [librte_eal] Error 2
make[3]: *** [lib] Error 2
make[2]: *** [all] Error 2
make[1]: *** [pre_install] Error 2
make: *** [install] Error 2
*Meson Failed Build #1:
OS: RHEL80-64
Target:build-gcc-static
FAILED: lib/76b5a35@@rte_eal at sta/librte_eal_linux_eal_eal_vfio.c.o 
gcc -Ilib/76b5a35@@rte_eal at sta -Ilib -I../lib -I. -I../ -Iconfig -I../config -Ilib/librte_eal/common/include -I../lib/librte_eal/common/include -I../lib/librte_eal/linux/eal/include -Ilib/librte_eal/common -I../lib/librte_eal/common -Ilib/librte_eal/common/include/arch/x86 -I../lib/librte_eal/common/include/arch/x86 -Ilib/librte_eal -I../lib/librte_eal -Ilib/librte_kvargs -I../lib/librte_kvargs -fdiagnostics-color=always -pipe -D_FILE_OFFSET_BITS=64 -Wall -Winvalid-pch -Werror -O3 -include rte_config.h -Wunused-parameter -Wsign-compare -Wcast-qual -fPIC -march=native -mno-avx512f -Wno-format-truncation -D_GNU_SOURCE -DALLOW_EXPERIMENTAL_API -MD -MQ 'lib/76b5a35@@rte_eal at sta/librte_eal_linux_eal_eal_vfio.c.o' -MF 'lib/76b5a35@@rte_eal at sta/librte_eal_linux_eal_eal_vfio.c.o.d' -o 'lib/76b5a35@@rte_eal at sta/librte_eal_linux_eal_eal_vfio.c.o' -c ../lib/librte_eal/linux/eal/eal_vfio.c
../lib/librte_eal/linux/eal/eal_vfio.c:1454:1: error: ‘vfio_spapr_create_new_dma_window’ defined but not used [-Werror=unused-function]
 vfio_spapr_create_new_dma_window(int vfio_container_fd,
 ^~~~~~~~~~~~~~~~~~~~~~~~~~~~~~~~
../lib/librte_eal/linux/eal/eal_vfio.c:1436:1: error: ‘vfio_spapr_window_size_walk’ defined but not used [-Werror=unused-function]
 vfio_spapr_window_size_walk(const struct rte_memseg_list *msl,
 ^~~~~~~~~~~~~~~~~~~~~~~~~~~
../lib/librte_eal/linux/eal/eal_vfio.c:1419:1: error: ‘vfio_spapr_unmap_walk’ defined but not used [-Werror=unused-function]
 vfio_spapr_unmap_walk(const struct rte_memseg_list *msl,
 ^~~~~~~~~~~~~~~~~~~~~
../lib/librte_eal/linux/eal/eal_vfio.c:1406:1: error: ‘vfio_spapr_map_walk’ defined but not used [-Werror=unused-function]
 vfio_spapr_map_walk(const struct rte_memseg_list *msl,
 ^~~~~~~~~~~~~~~~~~~
cc1: all warnings being treated as errors
[64/1704] Compiling C object 'lib/76b5a35@@rte_eal at sta/librte_eal_linux_eal_eal_memory.c.o'.
[65/1704] Compiling C object 'lib/76b5a35@@rte_cmdline at sta/librte_cmdline_cmdline_socket.c.o'.
[66/1704] Compiling C object 'lib/76b5a35@@rte_cmdline at sta/librte_cmdline_cmdline_parse_num.c.o'.
[67/1704] Compiling C object 'lib/76b5a35@@rte_cmdline at sta/librte_cmdline_cmdline_parse_string.c.o'.
[68/1704] Compiling C object 'lib/76b5a35@@rte_cmdline at sta/librte_cmdline_cmdline_cirbuf.c.o'.
ninja: build stopped: subcommand failed



*Meson Failed Build #2:
OS: UB1604-32
Target:build-gcc-static
FAILED: lib/76b5a35@@rte_eal at sta/librte_eal_linux_eal_eal_vfio.c.o 
gcc -Ilib/76b5a35@@rte_eal at sta -Ilib -I../lib -I. -I../ -Iconfig -I../config -Ilib/librte_eal/common/include -I../lib/librte_eal/common/include -I../lib/librte_eal/linux/eal/include -Ilib/librte_eal/common -I../lib/librte_eal/common -Ilib/librte_eal/common/include/arch/x86 -I../lib/librte_eal/common/include/arch/x86 -Ilib/librte_eal -I../lib/librte_eal -Ilib/librte_kvargs -I../lib/librte_kvargs -fdiagnostics-color=always -pipe -D_FILE_OFFSET_BITS=64 -Wall -Winvalid-pch -Werror -O3 -include rte_config.h -Wunused-parameter -Wsign-compare -Wcast-qual -Wno-pointer-to-int-cast -fPIC -march=native -D_GNU_SOURCE -DALLOW_EXPERIMENTAL_API -MD -MQ 'lib/76b5a35@@rte_eal at sta/librte_eal_linux_eal_eal_vfio.c.o' -MF 'lib/76b5a35@@rte_eal at sta/librte_eal_linux_eal_eal_vfio.c.o.d' -o 'lib/76b5a35@@rte_eal at sta/librte_eal_linux_eal_eal_vfio.c.o' -c ../lib/librte_eal/linux/eal/eal_vfio.c
../lib/librte_eal/linux/eal/eal_vfio.c:1406:1: error: ‘vfio_spapr_map_walk’ defined but not used [-Werror=unused-function]
 vfio_spapr_map_walk(const struct rte_memseg_list *msl,
 ^
../lib/librte_eal/linux/eal/eal_vfio.c:1419:1: error: ‘vfio_spapr_unmap_walk’ defined but not used [-Werror=unused-function]
 vfio_spapr_unmap_walk(const struct rte_memseg_list *msl,
 ^
../lib/librte_eal/linux/eal/eal_vfio.c:1436:1: error: ‘vfio_spapr_window_size_walk’ defined but not used [-Werror=unused-function]
 vfio_spapr_window_size_walk(const struct rte_memseg_list *msl,
 ^
../lib/librte_eal/linux/eal/eal_vfio.c:1454:1: error: ‘vfio_spapr_create_new_dma_window’ defined but not used [-Werror=unused-function]
 vfio_spapr_create_new_dma_window(int vfio_container_fd,
 ^
cc1: all warnings being treated as errors
[65/1540] Compiling C object 'lib/76b5a35@@rte_cmdline at sta/librte_cmdline_cmdline_parse_num.c.o'.
[66/1540] Compiling C object 'lib/76b5a35@@rte_cmdline at sta/librte_cmdline_cmdline_parse.c.o'.
[67/1540] Compiling C object 'lib/76b5a35@@rte_cmdline at sta/librte_cmdline_cmdline_parse_string.c.o'.
[68/1540] Compiling C object 'lib/76b5a35@@rte_eal at sta/librte_eal_linux_eal_eal_memory.c.o'.
[69/1540] Compiling C object 'lib/76b5a35@@rte_cmdline at sta/librte_cmdline_cmdline_rdline.c.o'.
ninja: build stopped: subcommand failed



*Meson Failed Build #3:
OS: FD30-64
Target:build-gcc-static
FAILED: lib/76b5a35@@rte_eal at sta/librte_eal_linux_eal_eal_vfio.c.o 
gcc -Ilib/76b5a35@@rte_eal at sta -Ilib -I../lib -I. -I../ -Iconfig -I../config -Ilib/librte_eal/common/include -I../lib/librte_eal/common/include -I../lib/librte_eal/linux/eal/include -Ilib/librte_eal/common -I../lib/librte_eal/common -Ilib/librte_eal/common/include/arch/x86 -I../lib/librte_eal/common/include/arch/x86 -Ilib/librte_eal -I../lib/librte_eal -Ilib/librte_kvargs -I../lib/librte_kvargs -fdiagnostics-color=always -pipe -D_FILE_OFFSET_BITS=64 -Wall -Winvalid-pch -Werror -O3 -include rte_config.h -Wunused-parameter -Wsign-compare -Wcast-qual -Wno-address-of-packed-member -fPIC -march=native -mno-avx512f -Wno-format-truncation -D_GNU_SOURCE -DALLOW_EXPERIMENTAL_API -MD -MQ 'lib/76b5a35@@rte_eal at sta/librte_eal_linux_eal_eal_vfio.c.o' -MF 'lib/76b5a35@@rte_eal at sta/librte_eal_linux_eal_eal_vfio.c.o.d' -o 'lib/76b5a35@@rte_eal at sta/librte_eal_linux_eal_eal_vfio.c.o' -c ../lib/librte_eal/linux/eal/eal_vfio.c
../lib/librte_eal/linux/eal/eal_vfio.c:1454:1: error: ‘vfio_spapr_create_new_dma_window’ defined but not used [-Werror=unused-function]
 1454 | vfio_spapr_create_new_dma_window(int vfio_container_fd,
      | ^~~~~~~~~~~~~~~~~~~~~~~~~~~~~~~~
../lib/librte_eal/linux/eal/eal_vfio.c:1436:1: error: ‘vfio_spapr_window_size_walk’ defined but not used [-Werror=unused-function]
 1436 | vfio_spapr_window_size_walk(const struct rte_memseg_list *msl,
      | ^~~~~~~~~~~~~~~~~~~~~~~~~~~
../lib/librte_eal/linux/eal/eal_vfio.c:1419:1: error: ‘vfio_spapr_unmap_walk’ defined but not used [-Werror=unused-function]
 1419 | vfio_spapr_unmap_walk(const struct rte_memseg_list *msl,
      | ^~~~~~~~~~~~~~~~~~~~~
../lib/librte_eal/linux/eal/eal_vfio.c:1406:1: error: ‘vfio_spapr_map_walk’ defined but not used [-Werror=unused-function]
 1406 | vfio_spapr_map_walk(const struct rte_memseg_list *msl,
      | ^~~~~~~~~~~~~~~~~~~
cc1: all warnings being treated as errors
[56/1664] Compiling C object 'lib/76b5a35@@rte_eal at sta/librte_eal_linux_eal_eal.c.o'.
[57/1664] Compiling C object 'lib/76b5a35@@rte_cmdline at sta/librte_cmdline_cmdline_parse.c.o'.
[58/1664] Compiling C object 'lib/76b5a35@@rte_cmdline at sta/librte_cmdline_cmdline_parse_etheraddr.c.o'.
[59/1664] Compiling C object 'lib/76b5a35@@rte_cmdline at sta/librte_cmdline_cmdline_rdline.c.o'.
[60/1664] Compiling C object 'lib/76b5a35@@rte_eal at sta/librte_eal_linux_eal_eal_memory.c.o'.
ninja: build stopped: subcommand failed



*Meson Failed Build #4:
OS: SUSE15-64
Target:build-gcc-static
FAILED: lib/76b5a35@@rte_eal at sta/librte_eal_linux_eal_eal_vfio.c.o 
gcc -Ilib/76b5a35@@rte_eal at sta -Ilib -I../lib -I. -I../ -Iconfig -I../config -Ilib/librte_eal/common/include -I../lib/librte_eal/common/include -I../lib/librte_eal/linux/eal/include -Ilib/librte_eal/common -I../lib/librte_eal/common -Ilib/librte_eal/common/include/arch/x86 -I../lib/librte_eal/common/include/arch/x86 -Ilib/librte_eal -I../lib/librte_eal -Ilib/librte_kvargs -I../lib/librte_kvargs -fdiagnostics-color=always -pipe -D_FILE_OFFSET_BITS=64 -Wall -Winvalid-pch -Werror -O3 -include rte_config.h -Wunused-parameter -Wsign-compare -Wcast-qual -fPIC -march=native -Wno-format-truncation -D_GNU_SOURCE -DALLOW_EXPERIMENTAL_API -MD -MQ 'lib/76b5a35@@rte_eal at sta/librte_eal_linux_eal_eal_vfio.c.o' -MF 'lib/76b5a35@@rte_eal at sta/librte_eal_linux_eal_eal_vfio.c.o.d' -o 'lib/76b5a35@@rte_eal at sta/librte_eal_linux_eal_eal_vfio.c.o' -c ../lib/librte_eal/linux/eal/eal_vfio.c
../lib/librte_eal/linux/eal/eal_vfio.c:1454:1: error: ‘vfio_spapr_create_new_dma_window’ defined but not used [-Werror=unused-function]
 vfio_spapr_create_new_dma_window(int vfio_container_fd,
 ^~~~~~~~~~~~~~~~~~~~~~~~~~~~~~~~
../lib/librte_eal/linux/eal/eal_vfio.c:1436:1: error: ‘vfio_spapr_window_size_walk’ defined but not used [-Werror=unused-function]
 vfio_spapr_window_size_walk(const struct rte_memseg_list *msl,
 ^~~~~~~~~~~~~~~~~~~~~~~~~~~
../lib/librte_eal/linux/eal/eal_vfio.c:1419:1: error: ‘vfio_spapr_unmap_walk’ defined but not used [-Werror=unused-function]
 vfio_spapr_unmap_walk(const struct rte_memseg_list *msl,
 ^~~~~~~~~~~~~~~~~~~~~
../lib/librte_eal/linux/eal/eal_vfio.c:1406:1: error: ‘vfio_spapr_map_walk’ defined but not used [-Werror=unused-function]
 vfio_spapr_map_walk(const struct rte_memseg_list *msl,
 ^~~~~~~~~~~~~~~~~~~
cc1: all warnings being treated as errors
[70/1711] Compiling C object 'lib/76b5a35@@rte_cmdline at sta/librte_cmdline_cmdline_vt100.c.o'.
[71/1711] Compiling C object 'lib/76b5a35@@rte_ring at sta/librte_ring_rte_ring.c.o'.
[72/1711] Compiling C object 'lib/76b5a35@@rte_eal at sta/librte_eal_linux_eal_eal_memory.c.o'.
[73/1711] Compiling C object 'lib/76b5a35@@rte_mempool at sta/librte_mempool_rte_mempool_ops.c.o'.
[74/1711] Compiling C object 'lib/76b5a35@@rte_mempool at sta/librte_mempool_rte_mempool.c.o'.
ninja: build stopped: subcommand failed



*Meson Failed Build #5:
OS: UB1804-64
Target:build-gcc-static
FAILED: lib/76b5a35@@rte_eal at sta/librte_eal_linux_eal_eal_vfio.c.o 
gcc -Ilib/76b5a35@@rte_eal at sta -Ilib -I../lib -I. -I../ -Iconfig -I../config -Ilib/librte_eal/common/include -I../lib/librte_eal/common/include -I../lib/librte_eal/linux/eal/include -Ilib/librte_eal/common -I../lib/librte_eal/common -Ilib/librte_eal/common/include/arch/x86 -I../lib/librte_eal/common/include/arch/x86 -Ilib/librte_eal -I../lib/librte_eal -Ilib/librte_kvargs -I../lib/librte_kvargs -fdiagnostics-color=always -pipe -D_FILE_OFFSET_BITS=64 -Wall -Winvalid-pch -Werror -O3 -include rte_config.h -Wunused-parameter -Wsign-compare -Wcast-qual -fPIC -march=native -mno-avx512f -Wno-format-truncation -D_GNU_SOURCE -DALLOW_EXPERIMENTAL_API -MD -MQ 'lib/76b5a35@@rte_eal at sta/librte_eal_linux_eal_eal_vfio.c.o' -MF 'lib/76b5a35@@rte_eal at sta/librte_eal_linux_eal_eal_vfio.c.o.d' -o 'lib/76b5a35@@rte_eal at sta/librte_eal_linux_eal_eal_vfio.c.o' -c ../lib/librte_eal/linux/eal/eal_vfio.c
../lib/librte_eal/linux/eal/eal_vfio.c:1454:1: error: ‘vfio_spapr_create_new_dma_window’ defined but not used [-Werror=unused-function]
 vfio_spapr_create_new_dma_window(int vfio_container_fd,
 ^~~~~~~~~~~~~~~~~~~~~~~~~~~~~~~~
../lib/librte_eal/linux/eal/eal_vfio.c:1436:1: error: ‘vfio_spapr_window_size_walk’ defined but not used [-Werror=unused-function]
 vfio_spapr_window_size_walk(const struct rte_memseg_list *msl,
 ^~~~~~~~~~~~~~~~~~~~~~~~~~~
../lib/librte_eal/linux/eal/eal_vfio.c:1419:1: error: ‘vfio_spapr_unmap_walk’ defined but not used [-Werror=unused-function]
 vfio_spapr_unmap_walk(const struct rte_memseg_list *msl,
 ^~~~~~~~~~~~~~~~~~~~~
../lib/librte_eal/linux/eal/eal_vfio.c:1406:1: error: ‘vfio_spapr_map_walk’ defined but not used [-Werror=unused-function]
 vfio_spapr_map_walk(const struct rte_memseg_list *msl,
 ^~~~~~~~~~~~~~~~~~~
cc1: all warnings being treated as errors
[66/1671] Compiling C object 'lib/76b5a35@@rte_cmdline at sta/librte_cmdline_cmdline_parse_portlist.c.o'.
[67/1671] Compiling C object 'lib/76b5a35@@rte_cmdline at sta/librte_cmdline_cmdline_socket.c.o'.
[68/1671] Compiling C object 'lib/76b5a35@@rte_cmdline at sta/librte_cmdline_cmdline_vt100.c.o'.
[69/1671] Compiling C object 'lib/76b5a35@@rte_cmdline at sta/librte_cmdline_cmdline_parse_string.c.o'.
[70/1671] Compiling C object 'lib/76b5a35@@rte_eal at sta/librte_eal_linux_eal_eal_memory.c.o'.
ninja: build stopped: subcommand failed



DPDK STV team


More information about the test-report mailing list