[dpdk-test-report] |FAILURE| pw54957[03/28] vhost: allocate per-socket transport state

sys_stv at intel.com sys_stv at intel.com
Wed Jun 19 23:39:33 CEST 2019


Test-Label: Intel-compilation
Test-Status: FAILURE
http://dpdk.org/patch/54957

_Compilation issues_

Submitter: Nikos Dragazis <ndragazis at arrikto.com>
Date: 2019-06-19 15:14:28
Reply_mail: 1560957293-17294-4-git-send-email-ndragazis at arrikto.com
DPDK git baseline: Repo:dpdk-next-virtio, CommitID: 11e71de3cf44eaca9106c0d3347dfb9c64dd188b

Build Summary: 22 Builds Done, 17 Successful, 5 Failures

Meson Summary: 8 Builds Done, 2 Successful, 6 Failures



Test environment and configuration as below:

**Make Build**


OS: RHEL76-64
	Kernel Version: 3.10.0-957.el7.x86_64
	CPU info: Intel(R) Xeon(R) CPU E5-2699 v4 @ 2.20GHz
	GCC Version: gcc (GCC) 4.8.5 20150623 (Red Hat 4.8.5-36)
	Clang Version: NA
	x86_64-native-linuxapp-gcc


OS: CENTOS76-64
	Kernel Version: 3.10.0-957.10.1.el7.x86_64
	CPU info: Intel(R) Xeon(R) CPU E5-2699 v4 @ 2.20GHz
	GCC Version: gcc (GCC) 4.8.5 20150623 (Red Hat 4.8.5-36)
	Clang Version: 3.4.2 (tags/RELEASE_34/dot2-final)
	x86_64-native-linuxapp-gcc


OS: UB1804-64
	Kernel Version: 4.15.0-20-generic
	CPU info: Intel(R) Xeon(R) CPU E5-2699 v3 @ 2.30GHz
	GCC Version: gcc (Ubuntu 7.3.0-27ubuntu1~18.04) 7.3.0
	Clang Version: 6.0.0-1ubuntu2 (tags/RELEASE_600/final)
	x86_64-native-linuxapp-icc
	x86_64-native-linuxapp-clang
	x86_64-native-linuxapp-gcc


OS: UB1904-64
	Kernel Version: 5.0.0-13-generic
	CPU info: Intel(R) Xeon(R) CPU E5-2699 v3 @ 2.30GHz
	GCC Version: gcc (Ubuntu 8.3.0-6ubuntu1) 8.3.0
	Clang Version: 8.0.0-3 (tags/RELEASE_800/final)
	x86_64-native-linuxapp-gcc


OS: UB1604-32
	Kernel Version: 4.4.0-131-generic
	CPU info: Intel(R) Xeon(R) CPU E5-2699 v3 @ 2.30GHz
	GCC Version: gcc (Ubuntu 5.4.0-6ubuntu1~16.04.11) 5.4.0 20160609
	Clang Version: 3.8.0-2ubuntu4 (tags/RELEASE_380/final)
	i686-native-linuxapp-gcc


OS: UB1604-64
	Kernel Version: 4.4.0-47-generic
	CPU info: Intel(R) Xeon(R) CPU E5-2699 v3 @ 2.30GHz
	GCC Version: gcc (Ubuntu 5.4.0-6ubuntu1~16.04.10) 5.4.0 20160609
	Clang Version: 3.8.0-2ubuntu4 (tags/RELEASE_380/final)
	x86_64-native-linuxapp-clang
	x86_64-native-linuxapp-gcc


OS: FreeBSD12-64
	Kernel Version: 12.0-RC3
	CPU info: Intel(R) Xeon(R) CPU E5-2699 v4 @ 2.20GHz (2194.98-MHz K8-class CPU)
	GCC Version: gcc (FreeBSD Ports Collection) 7.3.0
	Clang Version: 6.0.1 (tags/RELEASE_601/final 335540) (based on LLVM 6.0.1)
	x86_64-native-bsdapp-gcc+debug
	x86_64-native-bsdapp-gcc
	x86_64-native-bsdapp-gcc+shared
	x86_64-native-bsdapp-clang


OS: RHEL80-64
	Kernel Version: 4.18.0-80.el8.x86_64
	CPU info: Intel(R) Xeon(R) CPU E5-2699 v4 @ 2.20GHz
	GCC Version: gcc (GCC) 8.2.1 20180905 (Red Hat 8.2.1-3)
	Clang Version: NA
	x86_64-native-linuxapp-icc
	x86_64-native-linuxapp-gcc+debug
	x86_64-native-linuxapp-gcc+shared
	x86_64-native-linuxapp-clang
	x86_64-native-linuxapp-gcc


OS: SUSE15-64
	Kernel Version: 4.12.14-lp150.11-default
	CPU info: Intel(R) Xeon(R) CPU E5-2699 v4 @ 2.20GHz
	GCC Version: gcc (SUSE Linux) 7.3.1 20180323 [gcc-7-branch revision 258812]
	Clang Version: 5.0.1 (tags/RELEASE_501/final 312548)
	x86_64-native-linuxapp-gcc
	x86_64-native-linuxapp-clang


OS: FD30-64
	Kernel Version: 5.1.7-300.fc30.x86_64
	CPU info: Intel(R) Xeon(R) CPU E5-2699 v4 @ 2.20GHz
	GCC Version: gcc (GCC) 9.1.1 20190503 (Red Hat 9.1.1-1)
	Clang Version: 8.0.0 (Fedora 8.0.0-1.fc30)
	x86_64-native-linuxapp-gcc
	x86_64-native-linuxapp-clang


**Meson Build**


OS: UB1804-64
	Kernel Version: 4.15.0-20-generic
	CPU info: Intel(R) Xeon(R) CPU E5-2699 v4 @ 2.20GHz
	GCC Version: gcc (Ubuntu 7.3.0-27ubuntu1~18.04) 7.3.0
	Clang Version: 6.0.0-1ubuntu2 (tags/RELEASE_600/final)
	x86_64-native-linuxapp-doc
	build-gcc-static
	build-gcc-shared
	build-clang-static
	build-clang-shared
	build-x86-default


OS: UB1604-32
	Kernel Version: 4.4.0-131-generic
	CPU info: Intel(R) Xeon(R) CPU E5-2699 v4 @ 2.20GHz
	GCC Version: gcc (Ubuntu 5.4.0-6ubuntu1~16.04.11) 5.4.0 20160609
	Clang Version: 3.8.0-2ubuntu4 (tags/RELEASE_380/final)
	build-gcc-static
	build-gcc-shared
	build-clang-static
	build-clang-shared
	build-x86-default


OS: WIN10-64
	Kernel Version: N/A
	CPU info: N/A
	GCC Version: N/A
	Clang Version: Clang 8.0.0
	x86_64-windows-clang


OS: FreeBSD12-64
	Kernel Version: 12.0-RC3
	CPU info: Intel(R) Xeon(R) CPU E5-2699 v4 @ 2.20GHz (2194.99-MHz K8-class CPU)
	GCC Version: gcc (FreeBSD Ports Collection) 7.3.0
	Clang Version: 6.0.1 (tags/RELEASE_601/final 335540) (based on LLVM 6.0.1)
	build-gcc-static
	build-gcc-shared
	build-clang-static
	build-clang-shared
	build-x86-default


OS: RHEL80-64
	Kernel Version: 4.18.0-80.el8.x86_64
	CPU info: Intel(R) Xeon(R) CPU E5-2699 v4 @ 2.20GHz
	GCC Version: gcc (GCC) 8.2.1 20180905 (Red Hat 8.2.1-3)
	Clang Version: NA
	build-gcc-static
	build-gcc-shared
	build-x86-default


OS: SUSE15-64
	Kernel Version: 4.12.14-lp150.11-default
	CPU info: Intel(R) Xeon(R) CPU E5-2699 v4 @ 2.20GHz
	GCC Version: gcc (SUSE Linux) 7.3.1 20180323 [gcc-7-branch revision 258812]
	Clang Version: 5.0.1 (tags/RELEASE_501/final 312548)
	build-gcc-static
	build-gcc-shared
	build-clang-static
	build-clang-shared
	build-x86-default


OS: FD30-64
	Kernel Version: 5.0.9-301.fc30.x86_64
	CPU info: Intel(R) Xeon(R) CPU E5-2699 v4 @ 2.20GHz
	GCC Version: gcc (GCC) 9.1.1 20190503 (Red Hat 9.1.1-1)
	Clang Version: 8.0.0 (Fedora 8.0.0-1.fc30)
	build-gcc-static
	build-gcc-shared
	build-clang-static
	build-clang-shared
	build-x86-default


*Make Build Failed #1:
OS: UB1804-64
Target: x86_64-native-linuxapp-icc
/tmp/UB1804-64_K4.15.0_ICC19.0.0/x86_64-native-linuxapp-icc/5cdab6d057de4ede86aecce437e47b9d/dpdk/drivers/net/bnx2x/bnx2x_ethdev.c(154): error #279: controlling expression is constant
  			assert(false && "Unable to start periodic timer");
  			^

compilation aborted for /tmp/UB1804-64_K4.15.0_ICC19.0.0/x86_64-native-linuxapp-icc/5cdab6d057de4ede86aecce437e47b9d/dpdk/drivers/net/bnx2x/bnx2x_ethdev.c (code 2)
/tmp/UB1804-64_K4.15.0_ICC19.0.0/x86_64-native-linuxapp-icc/5cdab6d057de4ede86aecce437e47b9d/dpdk/mk/internal/rte.compile-pre.mk:114: recipe for target 'bnx2x_ethdev.o' failed
make[6]: *** [bnx2x_ethdev.o] Error 2
make[6]: *** Waiting for unfinished jobs....
  CC fm10k_rxtx.o
  LD dpaa2_mux.o
  LD failsafe.o
  CC mc/dpni.o
--
  CC rte_eth_bond_alb.o
  AR librte_pmd_octeontx_crypto.a
  CC failsafe_ops.o
  CC base/vnic_cq.o
  CC mc/dpdmux.o
/tmp/UB1804-64_K4.15.0_ICC19.0.0/x86_64-native-linuxapp-icc/5cdab6d057de4ede86aecce437e47b9d/dpdk/mk/rte.subdir.mk:35: recipe for target 'bnx2x' failed
make[5]: *** [bnx2x] Error 2
make[5]: *** Waiting for unfinished jobs....
  CC base/vnic_wq.o
  INSTALL-LIB librte_pmd_octeontx_crypto.a
  CC fm10k_common.o
  CC rte_eth_bond_flow.o
--
  PMDINFO igb_ethdev.o.pmd.c
  CC igb_ethdev.o.pmd.o
  LD igb_ethdev.o
  AR librte_pmd_e1000.a
  INSTALL-LIB librte_pmd_e1000.a
/tmp/UB1804-64_K4.15.0_ICC19.0.0/x86_64-native-linuxapp-icc/5cdab6d057de4ede86aecce437e47b9d/dpdk/mk/rte.subdir.mk:35: recipe for target 'net' failed
make[4]: *** [net] Error 2
/tmp/UB1804-64_K4.15.0_ICC19.0.0/x86_64-native-linuxapp-icc/5cdab6d057de4ede86aecce437e47b9d/dpdk/mk/rte.sdkbuild.mk:46: recipe for target 'drivers' failed
make[3]: *** [drivers] Error 2
/tmp/UB1804-64_K4.15.0_ICC19.0.0/x86_64-native-linuxapp-icc/5cdab6d057de4ede86aecce437e47b9d/dpdk/mk/rte.sdkroot.mk:98: recipe for target 'all' failed
make[2]: *** [all] Error 2
/tmp/UB1804-64_K4.15.0_ICC19.0.0/x86_64-native-linuxapp-icc/5cdab6d057de4ede86aecce437e47b9d/dpdk/mk/rte.sdkinstall.mk:60: recipe for target 'pre_install' failed
make[1]: *** [pre_install] Error 2
/tmp/UB1804-64_K4.15.0_ICC19.0.0/x86_64-native-linuxapp-icc/5cdab6d057de4ede86aecce437e47b9d/dpdk/mk/rte.sdkroot.mk:77: recipe for target 'install' failed
make: *** [install] Error 2


*Make Build Failed #2:
OS: RHEL80-64
Target: x86_64-native-linuxapp-icc
/tmp/RHEL80-64_K3.10.0_ICC19.0.0/x86_64-native-linuxapp-icc/5cdab6d057de4ede86aecce437e47b9d/dpdk/drivers/net/bnx2x/bnx2x_ethdev.c(154): error #279: controlling expression is constant
  			assert(false && "Unable to start periodic timer");
  			^

compilation aborted for /tmp/RHEL80-64_K3.10.0_ICC19.0.0/x86_64-native-linuxapp-icc/5cdab6d057de4ede86aecce437e47b9d/dpdk/drivers/net/bnx2x/bnx2x_ethdev.c (code 2)
make[6]: *** [/tmp/RHEL80-64_K3.10.0_ICC19.0.0/x86_64-native-linuxapp-icc/5cdab6d057de4ede86aecce437e47b9d/dpdk/mk/internal/rte.compile-pre.mk:116: bnx2x_ethdev.o] Error 2
make[5]: *** [/tmp/RHEL80-64_K3.10.0_ICC19.0.0/x86_64-native-linuxapp-icc/5cdab6d057de4ede86aecce437e47b9d/dpdk/mk/rte.subdir.mk:37: bnx2x] Error 2
make[5]: *** Waiting for unfinished jobs....
== Build drivers/crypto/virtio
  CC clip_tbl.o
  PMDINFO dpaa2_mux.o.pmd.c
  CC dpaa2_mux.o.pmd.o
--
  PMDINFO igb_ethdev.o.pmd.c
  CC igb_ethdev.o.pmd.o
  LD igb_ethdev.o
  AR librte_pmd_e1000.a
  INSTALL-LIB librte_pmd_e1000.a
make[4]: *** [/tmp/RHEL80-64_K3.10.0_ICC19.0.0/x86_64-native-linuxapp-icc/5cdab6d057de4ede86aecce437e47b9d/dpdk/mk/rte.subdir.mk:35: net] Error 2
make[3]: *** [/tmp/RHEL80-64_K3.10.0_ICC19.0.0/x86_64-native-linuxapp-icc/5cdab6d057de4ede86aecce437e47b9d/dpdk/mk/rte.sdkbuild.mk:46: drivers] Error 2
make[2]: *** [/tmp/RHEL80-64_K3.10.0_ICC19.0.0/x86_64-native-linuxapp-icc/5cdab6d057de4ede86aecce437e47b9d/dpdk/mk/rte.sdkroot.mk:99: all] Error 2
make[1]: *** [/tmp/RHEL80-64_K3.10.0_ICC19.0.0/x86_64-native-linuxapp-icc/5cdab6d057de4ede86aecce437e47b9d/dpdk/mk/rte.sdkinstall.mk:61: pre_install] Error 2
make: *** [/tmp/RHEL80-64_K3.10.0_ICC19.0.0/x86_64-native-linuxapp-icc/5cdab6d057de4ede86aecce437e47b9d/dpdk/mk/rte.sdkroot.mk:77: install] Error 2


*Make Build Failed #3:
OS: RHEL76-64
Target: x86_64-native-linuxapp-gcc
  LD bbdev_null.o
  AR librte_pmd_bbdev_null.a
  LD otx_zip_pmd.o
  INSTALL-LIB librte_pmd_bbdev_null.a
/tmp/RHEL76-64_K3.10.0_GCC4.8.5/x86_64-native-linuxapp-gcc/5cdab6d057de4ede86aecce437e47b9d/dpdk/drivers/crypto/aesni_mb/rte_aesni_mb_pmd.c: In function ‘aesni_mb_set_session_auth_parameters’:
/tmp/RHEL76-64_K3.10.0_GCC4.8.5/x86_64-native-linuxapp-gcc/5cdab6d057de4ede86aecce437e47b9d/dpdk/drivers/crypto/aesni_mb/rte_aesni_mb_pmd.c:60:19: error: ‘hash_oneblock_fn’ may be used uninitialized in this function [-Werror=maybe-uninitialized]
  (*one_block_hash)(opad_buf, opad);
                   ^
/tmp/RHEL76-64_K3.10.0_GCC4.8.5/x86_64-native-linuxapp-gcc/5cdab6d057de4ede86aecce437e47b9d/dpdk/drivers/crypto/aesni_mb/rte_aesni_mb_pmd.c:107:19: note: ‘hash_oneblock_fn’ was declared here
  hash_one_block_t hash_oneblock_fn;
                   ^
  CC otx_zip.o
  CC otx_cryptodev.o
  AR librte_pmd_isal_comp.a
== Build drivers/compress/zlib
/tmp/RHEL76-64_K3.10.0_GCC4.8.5/x86_64-native-linuxapp-gcc/5cdab6d057de4ede86aecce437e47b9d/dpdk/drivers/crypto/aesni_mb/rte_aesni_mb_pmd.c: At top level:
cc1: error: unrecognized command line option "-Wno-address-of-packed-member" [-Werror]
cc1: all warnings being treated as errors
make[6]: *** [rte_aesni_mb_pmd.o] Error 1
make[5]: *** [aesni_mb] Error 2
make[5]: *** Waiting for unfinished jobs....
  INSTALL-LIB librte_pmd_isal_comp.a
  CC ark_mpu.o
  PMDINFO otx_cryptodev.o.pmd.c
  CC otx_cryptodev.o.pmd.o
--
  INSTALL-LIB librte_pmd_dpaa.a
== Build drivers/net/enic
  AR librte_pmd_octeontx_crypto.a
  CC clip_tbl.o
  INSTALL-LIB librte_pmd_octeontx_crypto.a
make[4]: *** [crypto] Error 2
make[4]: *** Waiting for unfinished jobs....
  CC dpaa2_ethdev.o
  CC e1000_82543.o
  CC mps_tcam.o
  CC dpaa2_flow.o
--
  CC medford_nic.o
  INSTALL-LIB librte_pmd_qede.a
  CC medford2_nic.o
  AR librte_pmd_sfc_efx.a
  INSTALL-LIB librte_pmd_sfc_efx.a
make[3]: *** [drivers] Error 2
make[2]: *** [all] Error 2
make[1]: *** [pre_install] Error 2
make: *** [install] Error 2


*Make Build Failed #4:
OS: FreeBSD12-64
Target: x86_64-native-bsdapp-clang
== Build drivers/common
awk -f /usr/src/sys/tools/makeobjops.awk /usr/src/sys/kern/bus_if.m -h
awk -f /usr/src/sys/tools/makeobjops.awk /usr/src/sys/kern/bus_if.m -h
awk -f /usr/src/sys/tools/makeobjops.awk /usr/src/sys/dev/pci/pci_if.m -h
Warning: Object directory not changed from original /tmp/FreeBSD12-64_K19.02_Clang6.0.1/x86_64-native-bsdapp-clang/5cdab6d057de4ede86aecce437e47b9d/dpdk/x86_64-native-bsdapp-clang/build/kernel/freebsd/contigmem
cc  -Winline -Wall -Werror -include /tmp/FreeBSD12-64_K19.02_Clang6.0.1/x86_64-native-bsdapp-clang/5cdab6d057de4ede86aecce437e47b9d/dpdk/x86_64-native-bsdapp-clang/include/rte_config.h  -Werror -D_KERNEL -DKLD_MODULE -nostdinc  -I/tmp/FreeBSD12-64_K19.02_Clang6.0.1/x86_64-native-bsdapp-clang/5cdab6d057de4ede86aecce437e47b9d/dpdk/kernel/freebsd/contigmem -I/tmp/FreeBSD12-64_K19.02_Clang6.0.1/x86_64-native-bsdapp-clang/5cdab6d057de4ede86aecce437e47b9d/dpdk/x86_64-native-bsdapp-clang/include -I. -I/usr/src/sys -I/usr/src/sys/contrib/ck/include -fno-common  -fno-omit-frame-pointer -mno-omit-leaf-frame-pointer   -MD  -MF.depend.contigmem.o -MTcontigmem.o -mcmodel=kernel -mno-red-zone -mno-mmx -mno-sse -msoft-float  -fno-asynchronous-unwind-tables -ffreestanding -fwrapv -fstack-protector -Wall -Wredundant-decls -Wnested-externs -Wstrict-prototypes -Wmissing-prototypes -Wpointer-arith -Wcast-qual -Wundef -Wno-pointer-sign -D__printf__=__freebsd_kprintf__ -Wmissing-include-dirs -fdiagnostics-show-option -Wno-unknown-pragmas -Wno-error-tautological-compare -Wno-error-empty-body -Wno-error-parentheses-equality -Wno-error-unused-function -Wno-error-pointer-sign -Wno-error-shift-negative-value -Wno-address-of-packed-member  -mno-aes -mno-avx  -std=iso9899:1999 -c contigmem.c -o contigmem.o
Warning: Object directory not changed from original /tmp/FreeBSD12-64_K19.02_Clang6.0.1/x86_64-native-bsdapp-clang/5cdab6d057de4ede86aecce437e47b9d/dpdk/x86_64-native-bsdapp-clang/build/kernel/freebsd/nic_uio
cc  -Winline -Wall -Werror -include /tmp/FreeBSD12-64_K19.02_Clang6.0.1/x86_64-native-bsdapp-clang/5cdab6d057de4ede86aecce437e47b9d/dpdk/x86_64-native-bsdapp-clang/include/rte_config.h  -Werror -D_KERNEL -DKLD_MODULE -nostdinc  -I/tmp/FreeBSD12-64_K19.02_Clang6.0.1/x86_64-native-bsdapp-clang/5cdab6d057de4ede86aecce437e47b9d/dpdk/kernel/freebsd/nic_uio -I/tmp/FreeBSD12-64_K19.02_Clang6.0.1/x86_64-native-bsdapp-clang/5cdab6d057de4ede86aecce437e47b9d/dpdk/x86_64-native-bsdapp-clang/include -I. -I/usr/src/sys -I/usr/src/sys/contrib/ck/include -fno-common  -fno-omit-frame-pointer -mno-omit-leaf-frame-pointer   -MD  -MF.depend.nic_uio.o -MTnic_uio.o -mcmodel=kernel -mno-red-zone -mno-mmx -mno-sse -msoft-float  -fno-asynchronous-unwind-tables -ffreestanding -fwrapv -fstack-protector -Wall -Wredundant-decls -Wnested-externs -Wstrict-prototypes -Wmissing-prototypes -Wpointer-arith -Wcast-qual -Wundef -Wno-pointer-sign -D__printf__=__freebsd_kprintf__ -Wmissing-include-dirs -fdiagnostics-show-option -Wno-unknown-pragmas -Wno-error-tautological-compare -Wno-error-empty-body -Wno-error-parentheses-equality -Wno-error-unused-function -Wno-error-pointer-sign -Wno-error-shift-negative-value -Wno-address-of-packed-member  -mno-aes -mno-avx  -std=iso9899:1999 -c nic_uio.c -o nic_uio.o
== Build drivers/common/cpt
== Build drivers/common/octeontx
  CC octeontx_mbox.o
  CC cpt_pmd_ops_helper.o
ld -m elf_x86_64_fbsd -L/tmp/FreeBSD12-64_K19.02_Clang6.0.1/x86_64-native-bsdapp-clang/5cdab6d057de4ede86aecce437e47b9d/dpdk/x86_64-native-bsdapp-clang/lib -d -warn-common --build-id=sha1 -r -d -o contigmem.ko contigmem.o
--
  CC null_crypto_pmd.o
  CC isal_compress_pmd.o
  SYMLINK-FILE include/rte_cryptodev_scheduler.h
  CC atl_rxtx.o
/tmp/FreeBSD12-64_K19.02_Clang6.0.1/x86_64-native-bsdapp-clang/5cdab6d057de4ede86aecce437e47b9d/dpdk/drivers/compress/isal/isal_compress_pmd.c:4:  CC ark_ddm.o
10: fatal error: 'isa-l.h' file not found
#include <isa-l.h>
         ^~~~~~~~~
  CC axgbe_ethdev.o
  CC ark_ethdev.o
  CC scheduler_pmd.o
  PMDINFO otx_cryptodev.o.pmd.c
  CC otx_cryptodev.o.pmd.o
  LD otx_cryptodev.o
1 error generated.
gmake[6]: *** [/tmp/FreeBSD12-64_K19.02_Clang6.0.1/x86_64-native-bsdapp-clang/5cdab6d057de4ede86aecce437e47b9d/dpdk/mk/internal/rte.compile-pre.mk:116: isal_compress_pmd.o] Error 1
gmake[5]: *** [/tmp/FreeBSD12-64_K19.02_Clang6.0.1/x86_64-native-bsdapp-clang/5cdab6d057de4ede86aecce437e47b9d/dpdk/mk/rte.subdir.mk:37: isal] Error 2
gmake[4]: *** [/tmp/FreeBSD12-64_K19.02_Clang6.0.1/x86_64-native-bsdapp-clang/5cdab6d057de4ede86aecce437e47b9d/dpdk/mk/rte.subdir.mk:37: compress] Error 2
gmake[4]: *** Waiting for unfinished jobs....
== Build drivers/net/bnx2x
  CC qat_comp_pmd.o
  PMDINFO null_crypto_pmd.o.pmd.c
  CC null_crypto_pmd.o.pmd.o
--
  CC hunt_nic.o
  CC medford_nic.o
  CC medford2_nic.o
  AR librte_pmd_sfc_efx.a
  INSTALL-LIB librte_pmd_sfc_efx.a
gmake[3]: *** [/tmp/FreeBSD12-64_K19.02_Clang6.0.1/x86_64-native-bsdapp-clang/5cdab6d057de4ede86aecce437e47b9d/dpdk/mk/rte.sdkbuild.mk:46: drivers] Error 2
gmake[2]: *** [/tmp/FreeBSD12-64_K19.02_Clang6.0.1/x86_64-native-bsdapp-clang/5cdab6d057de4ede86aecce437e47b9d/dpdk/mk/rte.sdkroot.mk:99: all] Error 2
gmake[1]: *** [/tmp/FreeBSD12-64_K19.02_Clang6.0.1/x86_64-native-bsdapp-clang/5cdab6d057de4ede86aecce437e47b9d/dpdk/mk/rte.sdkinstall.mk:61: pre_install] Error 2
gmake: *** [/tmp/FreeBSD12-64_K19.02_Clang6.0.1/x86_64-native-bsdapp-clang/5cdab6d057de4ede86aecce437e47b9d/dpdk/mk/rte.sdkroot.mk:77: install] Error 2


*Make Build Failed #5:
OS: CENTOS76-64
Target: x86_64-native-linuxapp-gcc
  CC rte_aesni_mb_pmd_ops.o
  CC bbdev_null.o
  CC ark_ethdev.o
  CC avp_ethdev.o
/tmp/CENTOS76-64_K3.10.0_GCC4.8.5/x86_64-native-linuxapp-gcc/5cdab6d057de4ede86aecce437e47b9d/dpdk/drivers/crypto/aesni_mb/rte_aesni_mb_pmd.c: In function ‘aesni_mb_set_session_auth_parameters’:
/tmp/CENTOS76-64_K3.10.0_GCC4.8.5/x86_64-native-linuxapp-gcc/5cdab6d057de4ede86aecce437e47b9d/dpdk/drivers/crypto/aesni_mb/rte_aesni_mb_pmd.c:60:19: error: ‘hash_oneblock_fn’ may be used uninitialized in this function [-Werror=maybe-uninitialized]
  (*one_block_hash)(opad_buf, opad);
                   ^
/tmp/CENTOS76-64_K3.10.0_GCC4.8.5/x86_64-native-linuxapp-gcc/5cdab6d057de4ede86aecce437e47b9d/dpdk/drivers/crypto/aesni_mb/rte_aesni_mb_pmd.c:107:19: note: ‘hash_oneblock_fn’ was declared here
  hash_one_block_t hash_oneblock_fn;
                   ^
--
  PMDINFO bbdev_null.o.pmd.c
  CC bbdev_null.o.pmd.o
  PMDINFO isal_compress_pmd.o.pmd.c
  AR librte_pmd_qat.a
/tmp/CENTOS76-64_K3.10.0_GCC4.8.5/x86_64-native-linuxapp-gcc/5cdab6d057de4ede86aecce437e47b9d/dpdk/drivers/crypto/aesni_mb/rte_aesni_mb_pmd.c: At top level:
cc1: error: unrecognized command line option "-Wno-address-of-packed-member" [-Werror]
cc1: all warnings being treated as errors
  CC isal_compress_pmd.o.pmd.o
make[6]: *** [rte_aesni_mb_pmd.o] Error 1
make[6]: *** Waiting for unfinished jobs....
  INSTALL-LIB librte_pmd_qat.a
make[5]: *** [aesni_mb] Error 2
  CC ark_ethdev_tx.o
  LD bbdev_null.o
make[4]: *** [crypto] Error 2
make[4]: *** Waiting for unfinished jobs....
== Build drivers/net/axgbe
== Build drivers/compress/octeontx
  LD isal_compress_pmd.o
  AR librte_pmd_bbdev_null.a
--
  INSTALL-LIB librte_pmd_sfc_efx.a
  AR librte_pmd_softnic.a
  INSTALL-LIB librte_pmd_softnic.a
  AR librte_pmd_qede.a
  INSTALL-LIB librte_pmd_qede.a
make[3]: *** [drivers] Error 2
make[2]: *** [all] Error 2
make[1]: *** [pre_install] Error 2
make: *** [install] Error 2

*Meson Build Failed #1:
OS: RHEL80-64
Target:build-gcc-static
FAILED: lib/librte_vhost.so.4.1 
gcc  -o lib/librte_vhost.so.4.1 'lib/76b5a35@@rte_vhost at sta/librte_vhost_fd_man.c.o' 'lib/76b5a35@@rte_vhost at sta/librte_vhost_iotlb.c.o' 'lib/76b5a35@@rte_vhost at sta/librte_vhost_socket.c.o' 'lib/76b5a35@@rte_vhost at sta/librte_vhost_vdpa.c.o' 'lib/76b5a35@@rte_vhost at sta/librte_vhost_vhost.c.o' 'lib/76b5a35@@rte_vhost at sta/librte_vhost_vhost_user.c.o' 'lib/76b5a35@@rte_vhost at sta/librte_vhost_virtio_net.c.o' 'lib/76b5a35@@rte_vhost at sta/librte_vhost_vhost_crypto.c.o' -Wl,--no-undefined -Wl,--as-needed -Wl,-O1 -shared -fPIC -Wl,--start-group -Wl,-soname,librte_vhost.so.4 -Wl,--no-as-needed -pthread -lm -ldl -lnuma lib/librte_eal.so.10.1 lib/librte_kvargs.so.1.1 lib/librte_ethdev.so.12.1 lib/librte_net.so.1.1 lib/librte_mbuf.so.5.1 lib/librte_mempool.so.5.1 lib/librte_ring.so.2.1 lib/librte_cmdline.so.2.1 lib/librte_meter.so.3.1 lib/librte_cryptodev.so.7.1 lib/librte_hash.so.2.1 lib/librte_pci.so.1.1 -Wl,--end-group -Wl,--version-script=/tmp/RHEL80-64_K3.10.0_GCC8.2.1/x86_64-native-linuxapp-gcc/5cdab6d057de4ede86aecce437e47b9d/dpdk/lib/librte_vhost/rte_vhost_version.map '-Wl,-rpath,$ORIGIN/' -Wl,-rpath-link,/tmp/RHEL80-64_K3.10.0_GCC8.2.1/x86_64-native-linuxapp-gcc/5cdab6d057de4ede86aecce437e47b9d/dpdk/build-gcc-static/lib 
lib/76b5a35@@rte_vhost at sta/librte_vhost_socket.c.o: In function `rte_vhost_driver_register':
socket.c:(.text+0x7bb): undefined reference to `af_unix_trans_ops'
collect2: error: ld returned 1 exit status
[274/1660] Compiling C object 'lib/76b5a35@@rte_port at sta/librte_port_rte_port_ethdev.c.o'.
[275/1660] Compiling C object 'lib/76b5a35@@rte_port at sta/librte_port_rte_port_source_sink.c.o'.
[276/1660] Compiling C object 'lib/76b5a35@@rte_port at sta/librte_port_rte_port_sym_crypto.c.o'.
[277/1660] Compiling C object 'lib/76b5a35@@rte_port at sta/librte_port_rte_port_kni.c.o'.
[278/1660] Compiling C object 'lib/76b5a35@@rte_port at sta/librte_port_rte_port_ring.c.o'.
ninja: build stopped: subcommand failed




*Meson Build Failed #2:
OS: UB1604-32
Target:build-gcc-static
FAILED: lib/librte_vhost.so.4.1 
gcc  -o lib/librte_vhost.so.4.1 'lib/76b5a35@@rte_vhost at sta/librte_vhost_fd_man.c.o' 'lib/76b5a35@@rte_vhost at sta/librte_vhost_iotlb.c.o' 'lib/76b5a35@@rte_vhost at sta/librte_vhost_socket.c.o' 'lib/76b5a35@@rte_vhost at sta/librte_vhost_vdpa.c.o' 'lib/76b5a35@@rte_vhost at sta/librte_vhost_vhost.c.o' 'lib/76b5a35@@rte_vhost at sta/librte_vhost_vhost_user.c.o' 'lib/76b5a35@@rte_vhost at sta/librte_vhost_virtio_net.c.o' 'lib/76b5a35@@rte_vhost at sta/librte_vhost_vhost_crypto.c.o' -Wl,--no-undefined -Wl,--as-needed -Wl,-O1 -shared -fPIC -Wl,--start-group -Wl,-soname,librte_vhost.so.4 -Wl,--no-as-needed -pthread -lm -ldl -lnuma lib/librte_eal.so.10.1 lib/librte_kvargs.so.1.1 lib/librte_ethdev.so.12.1 lib/librte_net.so.1.1 lib/librte_mbuf.so.5.1 lib/librte_mempool.so.5.1 lib/librte_ring.so.2.1 lib/librte_cmdline.so.2.1 lib/librte_meter.so.3.1 lib/librte_cryptodev.so.7.1 lib/librte_hash.so.2.1 lib/librte_pci.so.1.1 -Wl,--end-group -Wl,--version-script=/tmp/UB1604-32_K4.4.0_GCC5.4.0/i686-native-linuxapp-gcc/5cdab6d057de4ede86aecce437e47b9d/dpdk/lib/librte_vhost/rte_vhost_version.map '-Wl,-rpath,$ORIGIN/' -Wl,-rpath-link,/tmp/UB1604-32_K4.4.0_GCC5.4.0/i686-native-linuxapp-gcc/5cdab6d057de4ede86aecce437e47b9d/dpdk/build-gcc-static/lib 
lib/76b5a35@@rte_vhost at sta/librte_vhost_socket.c.o: In function `rte_vhost_driver_register':
socket.c:(.text+0x9e5): undefined reference to `af_unix_trans_ops'
collect2: error: ld returned 1 exit status
[274/1497] Compiling C object 'lib/76b5a35@@rte_table at sta/librte_table_rte_table_lpm_ipv6.c.o'.
[275/1497] Compiling C object 'lib/76b5a35@@rte_port at sta/librte_port_rte_port_source_sink.c.o'.
[276/1497] Compiling C object 'lib/76b5a35@@rte_table at sta/librte_table_rte_table_acl.c.o'.
[277/1497] Compiling C object 'lib/76b5a35@@rte_port at sta/librte_port_rte_port_sym_crypto.c.o'.
[278/1497] Compiling C object 'lib/76b5a35@@rte_port at sta/librte_port_rte_port_ring.c.o'.
ninja: build stopped: subcommand failed




*Meson Build Failed #3:
OS: SUSE15-64
Target:build-gcc-static
FAILED: lib/librte_vhost.so.4.1 
gcc  -o lib/librte_vhost.so.4.1 'lib/76b5a35@@rte_vhost at sta/librte_vhost_fd_man.c.o' 'lib/76b5a35@@rte_vhost at sta/librte_vhost_iotlb.c.o' 'lib/76b5a35@@rte_vhost at sta/librte_vhost_socket.c.o' 'lib/76b5a35@@rte_vhost at sta/librte_vhost_vdpa.c.o' 'lib/76b5a35@@rte_vhost at sta/librte_vhost_vhost.c.o' 'lib/76b5a35@@rte_vhost at sta/librte_vhost_vhost_user.c.o' 'lib/76b5a35@@rte_vhost at sta/librte_vhost_virtio_net.c.o' 'lib/76b5a35@@rte_vhost at sta/librte_vhost_vhost_crypto.c.o' -Wl,--no-undefined -Wl,--as-needed -Wl,-O1 -shared -fPIC -Wl,--start-group -Wl,-soname,librte_vhost.so.4 -Wl,--no-as-needed -pthread -lm -ldl -lnuma lib/librte_eal.so.10.1 lib/librte_kvargs.so.1.1 lib/librte_ethdev.so.12.1 lib/librte_net.so.1.1 lib/librte_mbuf.so.5.1 lib/librte_mempool.so.5.1 lib/librte_ring.so.2.1 lib/librte_cmdline.so.2.1 lib/librte_meter.so.3.1 lib/librte_cryptodev.so.7.1 lib/librte_hash.so.2.1 lib/librte_pci.so.1.1 -Wl,--end-group -Wl,--version-script=/tmp/SUSE15-64_K4.12.14_GCC7.3.1/x86_64-native-linuxapp-gcc/5cdab6d057de4ede86aecce437e47b9d/dpdk/lib/librte_vhost/rte_vhost_version.map '-Wl,-rpath,$ORIGIN/' -Wl,-rpath-link,/tmp/SUSE15-64_K4.12.14_GCC7.3.1/x86_64-native-linuxapp-gcc/5cdab6d057de4ede86aecce437e47b9d/dpdk/build-gcc-static/lib 
lib/76b5a35@@rte_vhost at sta/librte_vhost_socket.c.o: In function `rte_vhost_driver_register':
socket.c:(.text+0x7fb): undefined reference to `af_unix_trans_ops'
collect2: error: ld returned 1 exit status
[278/1667] Compiling C object 'lib/76b5a35@@rte_table at sta/librte_table_rte_table_lpm_ipv6.c.o'.
[279/1667] Compiling C object 'lib/76b5a35@@rte_port at sta/librte_port_rte_port_sym_crypto.c.o'.
[280/1667] Compiling C object 'lib/76b5a35@@rte_table at sta/librte_table_rte_table_hash_cuckoo.c.o'.
[281/1667] Compiling C object 'lib/76b5a35@@rte_port at sta/librte_port_rte_port_kni.c.o'.
[282/1667] Compiling C object 'lib/76b5a35@@rte_port at sta/librte_port_rte_port_ring.c.o'.
ninja: build stopped: subcommand failed




*Meson Build Failed #4:
OS: FD30-64
Target:build-gcc-static
FAILED: lib/librte_vhost.so.4.1 
gcc  -o lib/librte_vhost.so.4.1 'lib/76b5a35@@rte_vhost at sta/librte_vhost_fd_man.c.o' 'lib/76b5a35@@rte_vhost at sta/librte_vhost_iotlb.c.o' 'lib/76b5a35@@rte_vhost at sta/librte_vhost_socket.c.o' 'lib/76b5a35@@rte_vhost at sta/librte_vhost_vdpa.c.o' 'lib/76b5a35@@rte_vhost at sta/librte_vhost_vhost.c.o' 'lib/76b5a35@@rte_vhost at sta/librte_vhost_vhost_user.c.o' 'lib/76b5a35@@rte_vhost at sta/librte_vhost_virtio_net.c.o' 'lib/76b5a35@@rte_vhost at sta/librte_vhost_vhost_crypto.c.o' -Wl,--no-undefined -Wl,--as-needed -Wl,-O1 -shared -fPIC -Wl,--start-group -Wl,-soname,librte_vhost.so.4 -Wl,--no-as-needed -pthread -lm -ldl -lnuma lib/librte_eal.so.10.1 lib/librte_kvargs.so.1.1 lib/librte_ethdev.so.12.1 lib/librte_net.so.1.1 lib/librte_mbuf.so.5.1 lib/librte_mempool.so.5.1 lib/librte_ring.so.2.1 lib/librte_cmdline.so.2.1 lib/librte_meter.so.3.1 lib/librte_cryptodev.so.7.1 lib/librte_hash.so.2.1 lib/librte_pci.so.1.1 -Wl,--end-group -Wl,--version-script=/tmp/FD30-64_K4.20_GCC9.1.1/x86_64-native-linuxapp-gcc/5cdab6d057de4ede86aecce437e47b9d/dpdk/lib/librte_vhost/rte_vhost_version.map '-Wl,-rpath,$ORIGIN/' -Wl,-rpath-link,/tmp/FD30-64_K4.20_GCC9.1.1/x86_64-native-linuxapp-gcc/5cdab6d057de4ede86aecce437e47b9d/dpdk/build-gcc-static/lib 
/usr/bin/ld: lib/76b5a35@@rte_vhost at sta/librte_vhost_socket.c.o: in function `rte_vhost_driver_register':
socket.c:(.text+0x7eb): undefined reference to `af_unix_trans_ops'
collect2: error: ld returned 1 exit status
[281/1620] Compiling C object 'lib/76b5a35@@rte_table at sta/librte_table_rte_table_lpm_ipv6.c.o'.
[282/1620] Compiling C object 'lib/76b5a35@@rte_port at sta/librte_port_rte_port_kni.c.o'.
[283/1620] Compiling C object 'lib/76b5a35@@rte_table at sta/librte_table_rte_table_acl.c.o'.
[284/1620] Compiling C object 'lib/76b5a35@@rte_port at sta/librte_port_rte_port_ring.c.o'.
[285/1620] Compiling C object 'lib/76b5a35@@rte_table at sta/librte_table_rte_table_hash_key8.c.o'.
ninja: build stopped: subcommand failed




*Meson Build Failed #5:
OS: UB1804-64
Target:build-gcc-static
FAILED: lib/librte_vhost.so.4.1 
gcc  -o lib/librte_vhost.so.4.1 'lib/76b5a35@@rte_vhost at sta/librte_vhost_fd_man.c.o' 'lib/76b5a35@@rte_vhost at sta/librte_vhost_iotlb.c.o' 'lib/76b5a35@@rte_vhost at sta/librte_vhost_socket.c.o' 'lib/76b5a35@@rte_vhost at sta/librte_vhost_vdpa.c.o' 'lib/76b5a35@@rte_vhost at sta/librte_vhost_vhost.c.o' 'lib/76b5a35@@rte_vhost at sta/librte_vhost_vhost_user.c.o' 'lib/76b5a35@@rte_vhost at sta/librte_vhost_virtio_net.c.o' 'lib/76b5a35@@rte_vhost at sta/librte_vhost_vhost_crypto.c.o' -Wl,--no-undefined -Wl,--as-needed -Wl,-O1 -shared -fPIC -Wl,--start-group -Wl,-soname,librte_vhost.so.4 -Wl,--no-as-needed -pthread -lm -ldl -lnuma lib/librte_eal.so.10.1 lib/librte_kvargs.so.1.1 lib/librte_ethdev.so.12.1 lib/librte_net.so.1.1 lib/librte_mbuf.so.5.1 lib/librte_mempool.so.5.1 lib/librte_ring.so.2.1 lib/librte_cmdline.so.2.1 lib/librte_meter.so.3.1 lib/librte_cryptodev.so.7.1 lib/librte_hash.so.2.1 lib/librte_pci.so.1.1 -Wl,--end-group -Wl,--version-script=/tmp/UB1804-64_K4.15.0_GCC7.3.0/x86_64-native-linuxapp-gcc/5cdab6d057de4ede86aecce437e47b9d/dpdk/lib/librte_vhost/rte_vhost_version.map '-Wl,-rpath,$ORIGIN/' -Wl,-rpath-link,/tmp/UB1804-64_K4.15.0_GCC7.3.0/x86_64-native-linuxapp-gcc/5cdab6d057de4ede86aecce437e47b9d/dpdk/build-gcc-static/lib 
lib/76b5a35@@rte_vhost at sta/librte_vhost_socket.c.o: In function `rte_vhost_driver_register':
socket.c:(.text+0x81b): undefined reference to `af_unix_trans_ops'
collect2: error: ld returned 1 exit status
[275/1627] Compiling C object 'lib/76b5a35@@rte_port at sta/librte_port_rte_port_source_sink.c.o'.
[276/1627] Compiling C object 'lib/76b5a35@@rte_table at sta/librte_table_rte_table_lpm.c.o'.
[277/1627] Compiling C object 'lib/76b5a35@@rte_port at sta/librte_port_rte_port_sym_crypto.c.o'.
[278/1627] Compiling C object 'lib/76b5a35@@rte_port at sta/librte_port_rte_port_kni.c.o'.
[279/1627] Compiling C object 'lib/76b5a35@@rte_port at sta/librte_port_rte_port_ring.c.o'.
ninja: build stopped: subcommand failed




*Meson Build Failed #6:
OS: FreeBSD12-64
Target:build-gcc-static
FAILED: examples/c590b3c@@dpdk-mp_server at exe/multi_process_client_server_mp_mp_server_main.c.o 
ccache gcc -Iexamples/c590b3c@@dpdk-mp_server at exe -Iexamples -I../examples -Iexamples/multi_process/client_server_mp/mp_server -I../examples/multi_process/client_server_mp/mp_server -I../examples/multi_process/client_server_mp/mp_server/../shared -I. -I../ -Iconfig -I../config -Ilib/librte_eal/common/include -I../lib/librte_eal/common/include -I../lib/librte_eal/freebsd/eal/include -Ilib/librte_eal/common -I../lib/librte_eal/common -Ilib/librte_eal/common/include/arch/x86 -I../lib/librte_eal/common/include/arch/x86 -Ilib/librte_eal -I../lib/librte_eal -Ilib/librte_kvargs -I../lib/librte_kvargs -Ilib/librte_mempool -I../lib/librte_mempool -Ilib/librte_ring -I../lib/librte_ring -Ilib/librte_net -I../lib/librte_net -Ilib/librte_mbuf -I../lib/librte_mbuf -Ilib/librte_ethdev -I../lib/librte_ethdev -Ilib/librte_cmdline -I../lib/librte_cmdline -Ilib/librte_meter -I../lib/librte_meter -fdiagnostics-color=always -pipe -D_FILE_OFFSET_BITS=64 -Wall -Winvalid-pch -Werror -O3 -include rte_config.h -Wunused-parameter -Wsign-compare -Wcast-qual -march=native -Wno-format-truncation -D_GNU_SOURCE -MD -MQ 'examples/c590b3c@@dpdk-mp_server at exe/multi_process_client_server_mp_mp_server_main.c.o' -MF 'examples/c590b3c@@dpdk-mp_server at exe/multi_process_client_server_mp_mp_server_main.c.o.d' -o 'examples/c590b3c@@dpdk-mp_server at exe/multi_process_client_server_mp_mp_server_main.c.o' -c ../examples/multi_process/client_server_mp/mp_server/main.c
In file included from ../examples/multi_process/client_server_mp/mp_server/main.c:14:0:
/usr/include/netinet/ip.h:71:17: error: field 'ip_src' has incomplete type
  struct in_addr ip_src,ip_dst; /* source and dest address */
                 ^~~~~~
/usr/include/netinet/ip.h:71:24: error: field 'ip_dst' has incomplete type
  struct in_addr ip_src,ip_dst; /* source and dest address */
                        ^~~~~~
/usr/include/netinet/ip.h:188:19: error: field 'ipt_addr' has incomplete type
    struct in_addr ipt_addr;
                   ^~~~~~~~
/usr/include/netinet/ip.h:223:17: error: field 'ippseudo_src' has incomplete type
  struct in_addr ippseudo_src; /* source internet address */
                 ^~~~~~~~~~~~
/usr/include/netinet/ip.h:224:17: error: field 'ippseudo_dst' has incomplete type
  struct in_addr ippseudo_dst; /* destination internet address */
                 ^~~~~~~~~~~~
[1225/1234] Linking target examples/dpdk-service_cores.
[1226/1234] Linking target examples/dpdk-qos_sched.
[1227/1234] Linking target examples/dpdk-skeleton.
[1228/1234] Linking target examples/dpdk-vmdq.
[1229/1234] Linking target examples/dpdk-timer.
ninja: build stopped: subcommand failed



DPDK STV team


More information about the test-report mailing list