[dpdk-test-report] |FAILURE| pw55547[v2, 12/44] event/octeontx2: add register dump functions

sys_stv at intel.com sys_stv at intel.com
Fri Jun 28 17:04:15 CEST 2019


Test-Label: Intel-compilation
Test-Status: FAILURE
http://dpdk.org/patch/55547

_Compilation issues_

Submitter: Pavan Nikhilesh Bhagavatula <pbhagavatula at marvell.com>
Date: 2019-06-28 07:49:51
Reply_mail: 20190628075024.404-13-pbhagavatula at marvell.com
DPDK git baseline: Repo:dpdk-next-eventdev, CommitID: 982d05fe41e3d8e9c0eb07135be43a9d09ba960e

Build Summary: 22 Builds Done, 20 Successful, 2 Failures

Meson Summary: 8 Builds Done, 8 Successful, 0 Failures



Test environment and configuration as below:

**Make Build**


OS: RHEL76-64
	Kernel Version: 3.10.0-957.el7.x86_64
	CPU info: Intel(R) Xeon(R) CPU E5-2699 v4 @ 2.20GHz
	GCC Version: gcc (GCC) 4.8.5 20150623 (Red Hat 4.8.5-36)
	Clang Version: NA
	x86_64-native-linuxapp-gcc


OS: CENTOS76-64
	Kernel Version: 3.10.0-957.10.1.el7.x86_64
	CPU info: Intel(R) Xeon(R) CPU E5-2699 v4 @ 2.20GHz
	GCC Version: gcc (GCC) 4.8.5 20150623 (Red Hat 4.8.5-36)
	Clang Version: 3.4.2 (tags/RELEASE_34/dot2-final)
	x86_64-native-linuxapp-gcc


OS: UB1804-64
	Kernel Version: 4.15.0-20-generic
	CPU info: Intel(R) Xeon(R) CPU E5-2699 v3 @ 2.30GHz
	GCC Version: gcc (Ubuntu 7.3.0-27ubuntu1~18.04) 7.3.0
	Clang Version: 6.0.0-1ubuntu2 (tags/RELEASE_600/final)
	x86_64-native-linuxapp-icc
	x86_64-native-linuxapp-clang
	x86_64-native-linuxapp-gcc


OS: UB1904-64
	Kernel Version: 5.0.0-13-generic
	CPU info: Intel(R) Xeon(R) CPU E5-2699 v3 @ 2.30GHz
	GCC Version: gcc (Ubuntu 8.3.0-6ubuntu1) 8.3.0
	Clang Version: 8.0.0-3 (tags/RELEASE_800/final)
	x86_64-native-linuxapp-gcc


OS: UB1604-32
	Kernel Version: 4.4.0-131-generic
	CPU info: Intel(R) Xeon(R) CPU E5-2699 v3 @ 2.30GHz
	GCC Version: gcc (Ubuntu 5.4.0-6ubuntu1~16.04.11) 5.4.0 20160609
	Clang Version: 3.8.0-2ubuntu4 (tags/RELEASE_380/final)
	i686-native-linuxapp-gcc


OS: UB1604-64
	Kernel Version: 4.4.0-47-generic
	CPU info: Intel(R) Xeon(R) CPU E5-2699 v3 @ 2.30GHz
	GCC Version: gcc (Ubuntu 5.4.0-6ubuntu1~16.04.10) 5.4.0 20160609
	Clang Version: 3.8.0-2ubuntu4 (tags/RELEASE_380/final)
	x86_64-native-linuxapp-clang
	x86_64-native-linuxapp-gcc


OS: FreeBSD12-64
	Kernel Version: 12.0-RC3
	CPU info: Intel(R) Xeon(R) CPU E5-2699 v4 @ 2.20GHz (2194.97-MHz K8-class CPU)
	GCC Version: gcc (FreeBSD Ports Collection) 7.3.0
	Clang Version: 6.0.1 (tags/RELEASE_601/final 335540) (based on LLVM 6.0.1)
	x86_64-native-bsdapp-gcc+shared
	x86_64-native-bsdapp-gcc
	x86_64-native-bsdapp-gcc+debug
	x86_64-native-bsdapp-clang


OS: RHEL80-64
	Kernel Version: 4.18.0-80.el8.x86_64
	CPU info: Intel(R) Xeon(R) CPU E5-2699 v4 @ 2.20GHz
	GCC Version: gcc (GCC) 8.2.1 20180905 (Red Hat 8.2.1-3)
	Clang Version: NA
	x86_64-native-linuxapp-icc
	x86_64-native-linuxapp-gcc+debug
	x86_64-native-linuxapp-gcc+shared
	x86_64-native-linuxapp-clang
	x86_64-native-linuxapp-gcc


OS: SUSE15-64
	Kernel Version: 4.12.14-lp150.11-default
	CPU info: Intel(R) Xeon(R) CPU E5-2699 v4 @ 2.20GHz
	GCC Version: gcc (SUSE Linux) 7.3.1 20180323 [gcc-7-branch revision 258812]
	Clang Version: 5.0.1 (tags/RELEASE_501/final 312548)
	x86_64-native-linuxapp-gcc
	x86_64-native-linuxapp-clang


OS: FD30-64
	Kernel Version: 5.1.7-300.fc30.x86_64
	CPU info: Intel(R) Xeon(R) CPU E5-2699 v4 @ 2.20GHz
	GCC Version: gcc (GCC) 9.1.1 20190503 (Red Hat 9.1.1-1)
	Clang Version: 8.0.0 (Fedora 8.0.0-1.fc30)
	x86_64-native-linuxapp-gcc
	x86_64-native-linuxapp-clang


**Meson Build**


OS: UB1804-64
	Kernel Version: 4.15.0-20-generic
	CPU info: Intel(R) Xeon(R) CPU E5-2699 v4 @ 2.20GHz
	GCC Version: gcc (Ubuntu 7.3.0-27ubuntu1~18.04) 7.3.0
	Clang Version: 6.0.0-1ubuntu2 (tags/RELEASE_600/final)
	x86_64-native-linuxapp-doc
	build-gcc-static
	build-gcc-shared
	build-clang-static
	build-clang-shared
	build-x86-default


OS: UB1604-32
	Kernel Version: 4.4.0-131-generic
	CPU info: Intel(R) Xeon(R) CPU E5-2699 v4 @ 2.20GHz
	GCC Version: gcc (Ubuntu 5.4.0-6ubuntu1~16.04.11) 5.4.0 20160609
	Clang Version: 3.8.0-2ubuntu4 (tags/RELEASE_380/final)
	build-gcc-static
	build-gcc-shared
	build-clang-static
	build-clang-shared
	build-x86-default


OS: WIN10-64
	Kernel Version: N/A
	CPU info: N/A
	GCC Version: N/A
	Clang Version: Clang 8.0.0
	x86_64-windows-clang


OS: FreeBSD12-64
	Kernel Version: 12.0-RC3
	CPU info: Intel(R) Xeon(R) CPU E5-2699 v4 @ 2.20GHz (2194.99-MHz K8-class CPU)
	GCC Version: gcc (FreeBSD Ports Collection) 7.3.0
	Clang Version: 6.0.1 (tags/RELEASE_601/final 335540) (based on LLVM 6.0.1)
	build-gcc-static
	build-gcc-shared
	build-clang-static
	build-clang-shared
	build-x86-default


OS: RHEL80-64
	Kernel Version: 4.18.0-80.el8.x86_64
	CPU info: Intel(R) Xeon(R) CPU E5-2699 v4 @ 2.20GHz
	GCC Version: gcc (GCC) 8.2.1 20180905 (Red Hat 8.2.1-3)
	Clang Version: NA
	build-gcc-static
	build-gcc-shared
	build-x86-default


OS: SUSE15-64
	Kernel Version: 4.12.14-lp150.11-default
	CPU info: Intel(R) Xeon(R) CPU E5-2699 v4 @ 2.20GHz
	GCC Version: gcc (SUSE Linux) 7.3.1 20180323 [gcc-7-branch revision 258812]
	Clang Version: 5.0.1 (tags/RELEASE_501/final 312548)
	build-gcc-static
	build-gcc-shared
	build-clang-static
	build-clang-shared
	build-x86-default


OS: FD30-64
	Kernel Version: 5.0.9-301.fc30.x86_64
	CPU info: Intel(R) Xeon(R) CPU E5-2699 v4 @ 2.20GHz
	GCC Version: gcc (GCC) 9.1.1 20190503 (Red Hat 9.1.1-1)
	Clang Version: 8.0.0 (Fedora 8.0.0-1.fc30)
	build-gcc-static
	build-gcc-shared
	build-clang-static
	build-clang-shared
	build-x86-default


*Make Build Failed #1:
OS: UB1804-64
Target: x86_64-native-linuxapp-icc
/tmp/UB1804-64_K4.15.0_ICC19.0.0/x86_64-native-linuxapp-icc/d47eea1eb9c342059a56291ab625e461/dpdk/drivers/net/bnx2x/bnx2x_ethdev.c(153): error #279: controlling expression is constant
  			assert(false && "Unable to start periodic timer");
  			^

compilation aborted for /tmp/UB1804-64_K4.15.0_ICC19.0.0/x86_64-native-linuxapp-icc/d47eea1eb9c342059a56291ab625e461/dpdk/drivers/net/bnx2x/bnx2x_ethdev.c (code 2)
/tmp/UB1804-64_K4.15.0_ICC19.0.0/x86_64-native-linuxapp-icc/d47eea1eb9c342059a56291ab625e461/dpdk/mk/internal/rte.compile-pre.mk:114: recipe for target 'bnx2x_ethdev.o' failed
make[6]: *** [bnx2x_ethdev.o] Error 2
make[6]: *** Waiting for unfinished jobs....
  CC cxgbevf_ethdev.o
  CC cxgbe_main.o
  CC rte_eth_bond_pmd.o
  CC hw_atl_b0.o
--
  CC cxgbe_filter.o
  CC cxgbe_flow.o
  AR librte_pmd_axgbe.a
  INSTALL-LIB librte_pmd_axgbe.a
== Build drivers/net/dpaa
/tmp/UB1804-64_K4.15.0_ICC19.0.0/x86_64-native-linuxapp-icc/d47eea1eb9c342059a56291ab625e461/dpdk/mk/rte.subdir.mk:35: recipe for target 'bnx2x' failed
make[5]: *** [bnx2x] Error 2
make[5]: *** Waiting for unfinished jobs....
  CC rte_eth_bond_args.o
  CC rte_eth_bond_8023ad.o
  CC t4_hw.o
  AR librte_pmd_atlantic.a
--
  LD dpaa_ethdev.o
  AR librte_pmd_dpaa.a
  INSTALL-LIB librte_pmd_dpaa.a
  AR librte_pmd_cxgbe.a
  INSTALL-LIB librte_pmd_cxgbe.a
/tmp/UB1804-64_K4.15.0_ICC19.0.0/x86_64-native-linuxapp-icc/d47eea1eb9c342059a56291ab625e461/dpdk/mk/rte.subdir.mk:35: recipe for target 'net' failed
make[4]: *** [net] Error 2
make[4]: *** Waiting for unfinished jobs....
  AR librte_pmd_octeontx_crypto.a
  INSTALL-LIB librte_pmd_octeontx_crypto.a
/tmp/UB1804-64_K4.15.0_ICC19.0.0/x86_64-native-linuxapp-icc/d47eea1eb9c342059a56291ab625e461/dpdk/mk/rte.sdkbuild.mk:46: recipe for target 'drivers' failed
make[3]: *** [drivers] Error 2
/tmp/UB1804-64_K4.15.0_ICC19.0.0/x86_64-native-linuxapp-icc/d47eea1eb9c342059a56291ab625e461/dpdk/mk/rte.sdkroot.mk:98: recipe for target 'all' failed
make[2]: *** [all] Error 2
/tmp/UB1804-64_K4.15.0_ICC19.0.0/x86_64-native-linuxapp-icc/d47eea1eb9c342059a56291ab625e461/dpdk/mk/rte.sdkinstall.mk:60: recipe for target 'pre_install' failed
make[1]: *** [pre_install] Error 2
/tmp/UB1804-64_K4.15.0_ICC19.0.0/x86_64-native-linuxapp-icc/d47eea1eb9c342059a56291ab625e461/dpdk/mk/rte.sdkroot.mk:77: recipe for target 'install' failed
make: *** [install] Error 2


*Make Build Failed #2:
OS: RHEL80-64
Target: x86_64-native-linuxapp-icc
/tmp/RHEL80-64_K3.10.0_ICC19.0.0/x86_64-native-linuxapp-icc/d47eea1eb9c342059a56291ab625e461/dpdk/drivers/net/bnx2x/bnx2x_ethdev.c(153): error #279: controlling expression is constant
  			assert(false && "Unable to start periodic timer");
  			^

compilation aborted for /tmp/RHEL80-64_K3.10.0_ICC19.0.0/x86_64-native-linuxapp-icc/d47eea1eb9c342059a56291ab625e461/dpdk/drivers/net/bnx2x/bnx2x_ethdev.c (code 2)
make[6]: *** [/tmp/RHEL80-64_K3.10.0_ICC19.0.0/x86_64-native-linuxapp-icc/d47eea1eb9c342059a56291ab625e461/dpdk/mk/internal/rte.compile-pre.mk:114: bnx2x_ethdev.o] Error 2
make[6]: *** Waiting for unfinished jobs....
  CC rte_eth_bond_args.o
  PMDINFO dpaa_ethdev.o.pmd.c
  CC dpaa_ethdev.o.pmd.o
  CC ena_ethdev.o
--
  INSTALL-LIB librte_pmd_cxgbe.a
  CC igb_flow.o
  PMDINFO igb_ethdev.o.pmd.c
  CC igb_ethdev.o.pmd.o
  CC em_ethdev.o
make[5]: *** [/tmp/RHEL80-64_K3.10.0_ICC19.0.0/x86_64-native-linuxapp-icc/d47eea1eb9c342059a56291ab625e461/dpdk/mk/rte.subdir.mk:35: bnx2x] Error 2
make[5]: *** Waiting for unfinished jobs....
== Build drivers/net/enetc
  CC em_rxtx.o
  LD igb_ethdev.o
  PMDINFO em_ethdev.o.pmd.c
--
  LD enetc_ethdev.o
  AR librte_pmd_e1000.a
  INSTALL-LIB librte_pmd_e1000.a
  AR librte_pmd_enetc.a
  INSTALL-LIB librte_pmd_enetc.a
make[4]: *** [/tmp/RHEL80-64_K3.10.0_ICC19.0.0/x86_64-native-linuxapp-icc/d47eea1eb9c342059a56291ab625e461/dpdk/mk/rte.subdir.mk:35: net] Error 2
make[3]: *** [/tmp/RHEL80-64_K3.10.0_ICC19.0.0/x86_64-native-linuxapp-icc/d47eea1eb9c342059a56291ab625e461/dpdk/mk/rte.sdkbuild.mk:46: drivers] Error 2
make[2]: *** [/tmp/RHEL80-64_K3.10.0_ICC19.0.0/x86_64-native-linuxapp-icc/d47eea1eb9c342059a56291ab625e461/dpdk/mk/rte.sdkroot.mk:99: all] Error 2
make[1]: *** [/tmp/RHEL80-64_K3.10.0_ICC19.0.0/x86_64-native-linuxapp-icc/d47eea1eb9c342059a56291ab625e461/dpdk/mk/rte.sdkinstall.mk:61: pre_install] Error 2
make: *** [/tmp/RHEL80-64_K3.10.0_ICC19.0.0/x86_64-native-linuxapp-icc/d47eea1eb9c342059a56291ab625e461/dpdk/mk/rte.sdkroot.mk:77: install] Error 2

DPDK STV team


More information about the test-report mailing list