[dpdk-test-report] |FAILURE| pw50706[v1, 3/6] lib/mempool: allow page size aligned mempool

sys_stv at intel.com sys_stv at intel.com
Fri Mar 1 09:25:08 CET 2019


Test-Label: Intel-compilation
Test-Status: FAILURE
http://dpdk.org/patch/50706

_Compilation issues_

Submitter: Xiaolong Ye <xiaolong.ye at intel.com>
Date: 2019-03-01 08:09:44
Reply_mail: 20190301080947.91086-4-xiaolong.ye at intel.com
DPDK git baseline: Repo:dpdk-master, CommitID: 8d47a753b7cb05e0ef62360324c6a28505038d09

Build Summary: 16 Builds Done, 13 Successful, 3 Failures

Test environment and configuration as below:

OS: UB1604
	Kernel Version: 4.4.0-78-generic
	CPU info: Intel(R) Xeon(R) CPU E5-2699 v3 @ 2.30GHz
	GCC Version: gcc (Ubuntu 5.4.0-6ubuntu1~16.04.10) 5.4.0 20160609
	Clang Version: 3.8.0-2ubuntu4 (tags/RELEASE_380/final)
	x86_64-native-linuxapp-gcc
	x86_64-native-linuxapp-clang
	x86_64-native-linuxapp-gcc-shared
	i686-native-linuxapp-gcc

OS: CENTOS
	Kernel Version: 3.10.0-957.1.3.el7.x86_64
	CPU info: Intel(R) Xeon(R) CPU E5-2699 v3 @ 2.30GHz
	GCC Version: gcc (GCC) 4.8.5 20150623 (Red Hat 4.8.5-36)
	Clang Version: 3.4.2 (tags/RELEASE_34/dot2-final)
	x86_64-native-linuxapp-clang
	i686-native-linuxapp-gcc
	x86_64-native-linuxapp-gcc
	x86_64-native-linuxapp-gcc-shared

OS: UBT1804
	Kernel Version: 4.15.0-29-generic
	CPU info: Intel(R) Xeon(R) Platinum 8180M CPU @ 2.50GHz
	GCC Version: gcc (Ubuntu 7.3.0-27ubuntu1~18.04) 7.3.0
	Clang Version: 6.0.0-1ubuntu2 (tags/RELEASE_600/final)
	x86_64-native-linuxapp-gcc

OS: FC25
	Kernel Version: 4.5.5-300.fc24.x86_64
	CPU info: Intel(R) Xeon(R) CPU E5-2699 v3 @ 2.30GHz
	GCC Version: gcc (GCC) 6.1.1 20160510 (Red Hat 6.1.1-2)
	Clang Version: 3.8.0 (tags/RELEASE_380/final)
	x86_64-native-linuxapp-gcc
	x86_64-native-linuxapp-gcc-debug

OS: FC24
	Kernel Version: 4.11.12-100.fc24.x86_64
	CPU info: Intel(R) Xeon(R) CPU E5-2699 v3 @ 2.30GHz
	GCC Version: gcc (GCC) 6.3.1 20161221 (Red Hat 6.3.1-1)
	Clang Version: 3.8.1 (tags/RELEASE_381/final)
	i686-native-linuxapp-gcc
	x86_64-native-linuxapp-clang
	x86_64-native-linuxapp-gcc-shared

OS: FreeBSD
	Kernel Version: 10.3-RELEASE
	CPU info: Intel(R) Xeon(R) CPU E5-2699 v3 @ 2.30GHz (2294.75-MHz K8-class CPU)
	GCC Version: gcc (FreeBSD Ports Collection) 7.3.0
	Clang Version: 3.4.1 (tags/RELEASE_34/dot1-final 208032) 20140512
	x86_64-native-bsdapp-clang
	x86_64-native-bsdapp-gcc

*Failed Build #1:
OS: UB1604
Target: x86_64-native-linuxapp-gcc-shared
  INSTALL-LIB librte_pmd_dpaa2_qdma.so.2.1
  CC ifpga_feature_dev.o
  CC ifpga_fme.o
  CC ifpga_fme_iperf.o
  CC ifpga_fme_dperf.o
  CC ifpga_fme_error.o
  CC ifpga_port.o
  CC ifpga_port_error.o
  CC opae_hw_api.o
  CC opae_debug.o
  CC opae_ifpga_hw_api.o
  CC ifpga_fme_pr.o
  CC ifpga_rawdev.o
--
  CC config.o
  CC test_mbuf.o
  LD testpmd
testpmd.o: In function `mbuf_pool_create':
testpmd.c:(.text+0xbbe): undefined reference to `rte_pktmbuf_pool_create_with_flags'
collect2: error: ld returned 1 exit status
/tmp/UB1604_K4.4.0_GCC5.4.0/x86_64-native-linuxapp-gcc-shared/ecd63ef57c8f44e49e4eb39459eaf2da/dpdk/mk/rte.app.mk:398: recipe for target 'testpmd' failed
make[5]: *** [testpmd] Error 1
/tmp/UB1604_K4.4.0_GCC5.4.0/x86_64-native-linuxapp-gcc-shared/ecd63ef57c8f44e49e4eb39459eaf2da/dpdk/mk/rte.subdir.mk:35: recipe for target 'test-pmd' failed
make[4]: *** [test-pmd] Error 2
make[4]: *** Waiting for unfinished jobs....
  CC test_logs.o
  CC init.o
  CC runtime.o
--
  CC test_ipsec.o
  MKRES test_resource_c.res.o
  LD test
  INSTALL-MAP test.map
  INSTALL-APP test
/tmp/UB1604_K4.4.0_GCC5.4.0/x86_64-native-linuxapp-gcc-shared/ecd63ef57c8f44e49e4eb39459eaf2da/dpdk/mk/rte.sdkbuild.mk:46: recipe for target 'app' failed
make[3]: *** [app] Error 2
/tmp/UB1604_K4.4.0_GCC5.4.0/x86_64-native-linuxapp-gcc-shared/ecd63ef57c8f44e49e4eb39459eaf2da/dpdk/mk/rte.sdkroot.mk:98: recipe for target 'all' failed
make[2]: *** [all] Error 2
/tmp/UB1604_K4.4.0_GCC5.4.0/x86_64-native-linuxapp-gcc-shared/ecd63ef57c8f44e49e4eb39459eaf2da/dpdk/mk/rte.sdkinstall.mk:57: recipe for target 'pre_install' failed
make[1]: *** [pre_install] Error 2
/tmp/UB1604_K4.4.0_GCC5.4.0/x86_64-native-linuxapp-gcc-shared/ecd63ef57c8f44e49e4eb39459eaf2da/dpdk/mk/rte.sdkroot.mk:77: recipe for target 'install' failed
make: *** [install] Error 2

*Failed Build #2:
OS: CENTOS
Target: x86_64-native-linuxapp-gcc-shared
  CC ifpga_api.o
  CC ifpga_feature_dev.o
  CC ifpga_fme.o
  CC ifpga_fme_iperf.o
  CC ifpga_fme_dperf.o
  CC ifpga_fme_error.o
  CC ifpga_port.o
  CC ifpga_port_error.o
  CC opae_hw_api.o
  CC opae_ifpga_hw_api.o
  LD librte_pmd_dpaa2_qdma.so.2.1
  CC opae_debug.o
  INSTALL-LIB librte_pmd_dpaa2_qdma.so.2.1
--
== Build app/test-crypto-perf
  LD testpmd
  CC test_mempool_perf.o
testpmd.o: In function `mbuf_pool_create':
testpmd.c:(.text+0xa66): undefined reference to `rte_pktmbuf_pool_create_with_flags'
collect2: error: ld returned 1 exit status
make[5]: *** [testpmd] Error 1
make[4]: *** [test-pmd] Error 2
make[4]: *** Waiting for unfinished jobs....
  CC test_mbuf.o
  CC main.o

*Failed Build #3:
OS: FC24
Target: x86_64-native-linuxapp-gcc-shared
  LD librte_pmd_skeleton_rawdev.so.1.1
  INSTALL-LIB librte_pmd_skeleton_rawdev.so.1.1
  CC ifpga_fme.o
  CC ifpga_fme_iperf.o
  CC ifpga_fme_dperf.o
  CC ifpga_fme_error.o
  CC ifpga_port.o
  CC ifpga_port_error.o
  CC opae_hw_api.o
  CC opae_ifpga_hw_api.o
  CC opae_debug.o
  CC ifpga_fme_pr.o
  CC ifpga_rawdev.o
--
  CC softnicfwd.o
  CC test_bbdev_vector.o
  LD testpmd
testpmd.o: In function `mbuf_pool_create':
testpmd.c:(.text+0xa2e): undefined reference to `rte_pktmbuf_pool_create_with_flags'
collect2: error: ld returned 1 exit status
/tmp/FC24_K4.9.13_GCC6.2.1/x86_64-native-linuxapp-gcc-shared/ecd63ef57c8f44e49e4eb39459eaf2da/dpdk/mk/rte.app.mk:398: recipe for target 'testpmd' failed
make[5]: *** [testpmd] Error 1
/tmp/FC24_K4.9.13_GCC6.2.1/x86_64-native-linuxapp-gcc-shared/ecd63ef57c8f44e49e4eb39459eaf2da/dpdk/mk/rte.subdir.mk:35: recipe for target 'test-pmd' failed
make[4]: *** [test-pmd] Error 2
make[4]: *** Waiting for unfinished jobs....
  CC test_logs.o
  LD testbbdev
  CC test_memcpy.o
--
  CC test_ipsec.o
  MKRES test_resource_c.res.o
  LD test
  INSTALL-APP test
  INSTALL-MAP test.map
/tmp/FC24_K4.9.13_GCC6.2.1/x86_64-native-linuxapp-gcc-shared/ecd63ef57c8f44e49e4eb39459eaf2da/dpdk/mk/rte.sdkbuild.mk:46: recipe for target 'app' failed
make[3]: *** [app] Error 2
/tmp/FC24_K4.9.13_GCC6.2.1/x86_64-native-linuxapp-gcc-shared/ecd63ef57c8f44e49e4eb39459eaf2da/dpdk/mk/rte.sdkroot.mk:98: recipe for target 'all' failed
make[2]: *** [all] Error 2
/tmp/FC24_K4.9.13_GCC6.2.1/x86_64-native-linuxapp-gcc-shared/ecd63ef57c8f44e49e4eb39459eaf2da/dpdk/mk/rte.sdkinstall.mk:57: recipe for target 'pre_install' failed
make[1]: *** [pre_install] Error 2
/tmp/FC24_K4.9.13_GCC6.2.1/x86_64-native-linuxapp-gcc-shared/ecd63ef57c8f44e49e4eb39459eaf2da/dpdk/mk/rte.sdkroot.mk:77: recipe for target 'install' failed
make: *** [install] Error 2

DPDK STV team


More information about the test-report mailing list