[dpdk-test-report] |FAILURE| pw50832[v2, 6/8] stack: add C11 atomic implementation

sys_stv at intel.com sys_stv at intel.com
Wed Mar 6 10:46:38 CET 2019


Test-Label: Intel-compilation
Test-Status: FAILURE
http://dpdk.org/patch/50832

_Compilation issues_

Submitter: Gage Eads <gage.eads at intel.com>
Date: 2019-03-05 16:42:54
Reply_mail: 20190305164256.2367-7-gage.eads at intel.com
DPDK git baseline: Repo:dpdk-next-crypto, CommitID: c652031bf46709a3a9e7bda21722ad7627f7944e

Build Summary: 24 Builds Done, 1 Successful, 23 Failures

Test environment and configuration as below:

OS: SUSE15
	Kernel Version: 4.12.14-lp150.12.22-default
	CPU info: Intel(R) Xeon(R) CPU E5-2699 v3 @ 2.30GHz
	GCC Version: gcc (SUSE Linux) 7.3.1 20180323 [gcc-7-branch revision 258812]
	Clang Version: 5.0.1 (tags/RELEASE_501/final 312548)
	x86_64-native-linuxapp-gcc

OS: CENTOS76
	Kernel Version: 3.10.0-957.5.1.el7.x86_64
	CPU info: Intel(R) Xeon(R) CPU E5-2699 v4 @ 2.20GHz
	GCC Version: gcc (GCC) 4.8.5 20150623 (Red Hat 4.8.5-36)
	Clang Version: NA
	x86_64-native-linuxapp-gcc

OS: UBT144-32
	Kernel Version: 3.13.0-161-generic
	CPU info: Intel(R) Xeon(R) CPU E5-2699 v3 @ 2.30GHz
	GCC Version: gcc (Ubuntu 4.8.4-2ubuntu1~14.04.4) 4.8.4
	Clang Version: NA
	i686-native-linuxapp-gcc

OS: SUSE12
	Kernel Version: 4.4.73-5-default
	CPU info: Intel(R) Xeon(R) CPU E5-2699 v4 @ 2.20GHz
	GCC Version: gcc (SUSE Linux) 7.1.1 20170607 [gcc-7-branch revision 248970]
	Clang Version: NA
	x86_64-native-linuxapp-gcc

OS: FreeBSD12.0
	Kernel Version: 12.0-RC3
	CPU info: Intel(R) Xeon(R) CPU E5-2699 v3 @ 2.30GHz (2294.76-MHz K8-class CPU)
	GCC Version: gcc (FreeBSD Ports Collection) 7.3.0
	Clang Version: 6.0.1 (tags/RELEASE_601/final 335540) (based on LLVM 6.0.1)
	x86_64-native-bsdapp-clang
	x86_64-native-bsdapp-gcc

OS: UBT144-64
	Kernel Version: 4.2.0-27-generic
	CPU info: Intel(R) Xeon(R) CPU E5-2699 v3 @ 2.30GHz
	GCC Version: gcc (Ubuntu 4.8.4-2ubuntu1~14.04.4) 4.8.4
	Clang Version: NA
	x86_64-native-linuxapp-gcc

OS: CENTOS75
	Kernel Version: 3.10.0-957.5.1.el7.x86_64
	CPU info: Intel(R) Xeon(R) CPU E5-2699 v4 @ 2.20GHz
	GCC Version: gcc (GCC) 4.8.5 20150623 (Red Hat 4.8.5-36)
	Clang Version: 3.4.2 (tags/RELEASE_34/dot2-final)
	x86_64-native-linuxapp-gcc

OS: UBT1804
	Kernel Version: 4.15.0-20-generic
	CPU info: Intel(R) Xeon(R) CPU E5-2699 v3 @ 2.30GHz
	GCC Version: gcc (Ubuntu 7.3.0-27ubuntu1~18.04) 7.3.0
	Clang Version: NA
	x86_64-native-linuxapp-clang
	x86_64-native-linuxapp-gcc
	x86_64-native-linuxapp-icc

OS: UBT1810
	Kernel Version: 4.18.0-10-generic
	CPU info: Intel(R) Xeon(R) CPU E5-2699 v3 @ 2.30GHz
	GCC Version: gcc (Ubuntu 8.2.0-7ubuntu1) 8.2.0
	Clang Version: NA
	x86_64-native-linuxapp-gcc

OS: RHEL74
	Kernel Version: 3.10.0-693.el7.x86_64
	CPU info: Intel(R) Xeon(R) CPU E5-2699 v4 @ 2.20GHz
	GCC Version: gcc (GCC) 4.8.5 20150623 (Red Hat 4.8.5-16)
	Clang Version: NA
	x86_64-native-linuxapp-gcc

OS: CENTOS74
	Kernel Version: 3.10.0-862.14.4.el7.x86_64
	CPU info: Intel(R) Xeon(R) CPU E5-2699 v4 @ 2.20GHz
	GCC Version: gcc (GCC) 4.8.5 20150623 (Red Hat 4.8.5-28)
	Clang Version: 3.4.2 (tags/RELEASE_34/dot2-final)
	x86_64-native-linuxapp-gcc

OS: FreeBSD11.2
	Kernel Version: 11.2-RELEASE
	CPU info: Intel(R) Xeon(R) CPU E5-2699 v3 @ 2.30GHz (2294.73-MHz K8-class CPU)
	GCC Version: gcc (FreeBSD Ports Collection) 6.4.0
	Clang Version: 6.0.0 (tags/RELEASE_600/final 326565) (based on LLVM 6.0.0)
	x86_64-native-bsdapp-clang
	x86_64-native-bsdapp-gcc

OS: UBT164-64
	Kernel Version: 4.4.0-47-generic
	CPU info: Intel(R) Xeon(R) CPU E5-2699 v3 @ 2.30GHz
	GCC Version: gcc (Ubuntu 5.4.0-6ubuntu1~16.04.10) 5.4.0 20160609
	Clang Version: 3.8.0-2ubuntu4 (tags/RELEASE_380/final)
	x86_64-native-linuxapp-gcc

OS: FC28
	Kernel Version: 4.16.3-301.fc28.x86_64
	CPU info: Intel(R) Xeon(R) CPU E5-2699 v4 @ 2.20GHz
	GCC Version: gcc (GCC) 8.1.1 20180712 (Red Hat 8.1.1-5)
	Clang Version: NA
	x86_64-native-linuxapp-gcc
	x86_64-native-linuxapp-clang
	x86_64-native-linuxapp-icc

OS: RHEL76
	Kernel Version: 3.10.0-957.el7.x86_64
	CPU info: Intel(R) Xeon(R) CPU E5-2699 v4 @ 2.20GHz
	GCC Version: gcc (GCC) 4.8.5 20150623 (Red Hat 4.8.5-36)
	Clang Version: NA
	x86_64-native-linuxapp-gcc

OS: FC29
	Kernel Version: 4.18.16-300.fc29.x86_64
	CPU info: Intel(R) Xeon(R) CPU E5-2699 v4 @ 2.20GHz
	GCC Version: gcc (GCC) 8.2.1 20181215 (Red Hat 8.2.1-6)
	Clang Version: NA
	x86_64-native-linuxapp-clang
	x86_64-native-linuxapp-icc

OS: RHEL75
	Kernel Version: 3.10.0-862.el7.x86_64
	CPU info: Intel(R) Xeon(R) CPU E5-2699 v4 @ 2.20GHz
	GCC Version: gcc (GCC) 4.8.5 20150623 (Red Hat 4.8.5-28)
	Clang Version: NA
	x86_64-native-linuxapp-gcc

*Failed Build #1:
OS: UBT144-64
Target: x86_64-native-linuxapp-gcc
  INSTALL-LIB librte_jobstats.a
  CC cmdline_parse.o
In file included from /tmp/UBT144-64_K4.2.0_GCC4.8.4/x86_64-native-linuxapp-gcc/8fbd66d0dc7c470ab7257e8d68ce8b2a/dpdk/lib/librte_stack/rte_stack.h:97:0,
                 from /tmp/UBT144-64_K4.2.0_GCC4.8.4/x86_64-native-linuxapp-gcc/8fbd66d0dc7c470ab7257e8d68ce8b2a/dpdk/lib/librte_stack/rte_stack.c:16:
/tmp/UBT144-64_K4.2.0_GCC4.8.4/x86_64-native-linuxapp-gcc/8fbd66d0dc7c470ab7257e8d68ce8b2a/dpdk/lib/librte_stack/rte_stack_generic.h: In function ‘__rte_stack_lf_push’:
/tmp/UBT144-64_K4.2.0_GCC4.8.4/x86_64-native-linuxapp-gcc/8fbd66d0dc7c470ab7257e8d68ce8b2a/dpdk/lib/librte_stack/rte_stack_generic.h:61:3: warning: implicit declaration of function ‘rte_atomic128_cmp_exchange’ [-Wimplicit-function-declaration]
   success = rte_atomic128_cmp_exchange(
   ^
/tmp/UBT144-64_K4.2.0_GCC4.8.4/x86_64-native-linuxapp-gcc/8fbd66d0dc7c470ab7257e8d68ce8b2a/dpdk/lib/librte_stack/rte_stack_generic.h:61:3: warning: nested extern declaration of ‘rte_atomic128_cmp_exchange’ [-Wnested-externs]
/tmp/UBT144-64_K4.2.0_GCC4.8.4/x86_64-native-linuxapp-gcc/8fbd66d0dc7c470ab7257e8d68ce8b2a/dpdk/lib/librte_stack/rte_stack_generic.h:62:6: error: ‘rte_int128_t’ undeclared (first use in this function)
     (rte_int128_t *)&list->head,
      ^
/tmp/UBT144-64_K4.2.0_GCC4.8.4/x86_64-native-linuxapp-gcc/8fbd66d0dc7c470ab7257e8d68ce8b2a/dpdk/lib/librte_stack/rte_stack_generic.h:62:6: note: each undeclared identifier is reported only once for each function it appears in
/tmp/UBT144-64_K4.2.0_GCC4.8.4/x86_64-native-linuxapp-gcc/8fbd66d0dc7c470ab7257e8d68ce8b2a/dpdk/lib/librte_stack/rte_stack_generic.h:62:20: error: expected expression before ‘)’ token
     (rte_int128_t *)&list->head,
                    ^
/tmp/UBT144-64_K4.2.0_GCC4.8.4/x86_64-native-linuxapp-gcc/8fbd66d0dc7c470ab7257e8d68ce8b2a/dpdk/lib/librte_stack/rte_stack_generic.h:50:28: warning: variable ‘new_head’ set but not used [-Wunused-but-set-variable]
   struct rte_stack_lf_head new_head;
                            ^
/tmp/UBT144-64_K4.2.0_GCC4.8.4/x86_64-native-linuxapp-gcc/8fbd66d0dc7c470ab7257e8d68ce8b2a/dpdk/lib/librte_stack/rte_stack_generic.h: In function ‘__rte_stack_lf_pop’:
/tmp/UBT144-64_K4.2.0_GCC4.8.4/x86_64-native-linuxapp-gcc/8fbd66d0dc7c470ab7257e8d68ce8b2a/dpdk/lib/librte_stack/rte_stack_generic.h:140:6: error: ‘rte_int128_t’ undeclared (first use in this function)
     (rte_int128_t *)&list->head,
      ^
/tmp/UBT144-64_K4.2.0_GCC4.8.4/x86_64-native-linuxapp-gcc/8fbd66d0dc7c470ab7257e8d68ce8b2a/dpdk/lib/librte_stack/rte_stack_generic.h:140:20: error: expected expression before ‘)’ token
     (rte_int128_t *)&list->head,
                    ^
/tmp/UBT144-64_K4.2.0_GCC4.8.4/x86_64-native-linuxapp-gcc/8fbd66d0dc7c470ab7257e8d68ce8b2a/dpdk/lib/librte_stack/rte_stack_generic.h:107:28: warning: variable ‘new_head’ set but not used [-Wunused-but-set-variable]
   struct rte_stack_lf_head new_head;
                            ^
make[5]: *** [rte_stack.o] Error 1
make[4]: *** [librte_stack] Error 2
make[4]: *** Waiting for unfinished jobs....

*Failed Build #2:
OS: UBT164-64
Target: x86_64-native-linuxapp-gcc
  CC rte_jobstats.o
  CC rte_ring.o
In file included from /tmp/UBT164-64_K4.4.0_GCC5.4.0/x86_64-native-linuxapp-gcc/8fbd66d0dc7c470ab7257e8d68ce8b2a/dpdk/lib/librte_stack/rte_stack.h:97:0,
                 from /tmp/UBT164-64_K4.4.0_GCC5.4.0/x86_64-native-linuxapp-gcc/8fbd66d0dc7c470ab7257e8d68ce8b2a/dpdk/lib/librte_stack/rte_stack.c:16:
/tmp/UBT164-64_K4.4.0_GCC5.4.0/x86_64-native-linuxapp-gcc/8fbd66d0dc7c470ab7257e8d68ce8b2a/dpdk/lib/librte_stack/rte_stack_generic.h: In function ‘__rte_stack_lf_push’:
/tmp/UBT164-64_K4.4.0_GCC5.4.0/x86_64-native-linuxapp-gcc/8fbd66d0dc7c470ab7257e8d68ce8b2a/dpdk/lib/librte_stack/rte_stack_generic.h:61:13: warning: implicit declaration of function ‘rte_atomic128_cmp_exchange’ [-Wimplicit-function-declaration]
   success = rte_atomic128_cmp_exchange(
             ^
/tmp/UBT164-64_K4.4.0_GCC5.4.0/x86_64-native-linuxapp-gcc/8fbd66d0dc7c470ab7257e8d68ce8b2a/dpdk/lib/librte_stack/rte_stack_generic.h:61:3: warning: nested extern declaration of ‘rte_atomic128_cmp_exchange’ [-Wnested-externs]
   success = rte_atomic128_cmp_exchange(
   ^
/tmp/UBT164-64_K4.4.0_GCC5.4.0/x86_64-native-linuxapp-gcc/8fbd66d0dc7c470ab7257e8d68ce8b2a/dpdk/lib/librte_stack/rte_stack_generic.h:62:6: error: ‘rte_int128_t’ undeclared (first use in this function)
     (rte_int128_t *)&list->head,
      ^
/tmp/UBT164-64_K4.4.0_GCC5.4.0/x86_64-native-linuxapp-gcc/8fbd66d0dc7c470ab7257e8d68ce8b2a/dpdk/lib/librte_stack/rte_stack_generic.h:62:6: note: each undeclared identifier is reported only once for each function it appears in
/tmp/UBT164-64_K4.4.0_GCC5.4.0/x86_64-native-linuxapp-gcc/8fbd66d0dc7c470ab7257e8d68ce8b2a/dpdk/lib/librte_stack/rte_stack_generic.h:62:20: error: expected expression before ‘)’ token
     (rte_int128_t *)&list->head,
                    ^
/tmp/UBT164-64_K4.4.0_GCC5.4.0/x86_64-native-linuxapp-gcc/8fbd66d0dc7c470ab7257e8d68ce8b2a/dpdk/lib/librte_stack/rte_stack_generic.h:50:28: warning: variable ‘new_head’ set but not used [-Wunused-but-set-variable]
   struct rte_stack_lf_head new_head;
                            ^
/tmp/UBT164-64_K4.4.0_GCC5.4.0/x86_64-native-linuxapp-gcc/8fbd66d0dc7c470ab7257e8d68ce8b2a/dpdk/lib/librte_stack/rte_stack_generic.h: In function ‘__rte_stack_lf_pop’:
/tmp/UBT164-64_K4.4.0_GCC5.4.0/x86_64-native-linuxapp-gcc/8fbd66d0dc7c470ab7257e8d68ce8b2a/dpdk/lib/librte_stack/rte_stack_generic.h:140:6: error: ‘rte_int128_t’ undeclared (first use in this function)
     (rte_int128_t *)&list->head,
      ^
/tmp/UBT164-64_K4.4.0_GCC5.4.0/x86_64-native-linuxapp-gcc/8fbd66d0dc7c470ab7257e8d68ce8b2a/dpdk/lib/librte_stack/rte_stack_generic.h:140:20: error: expected expression before ‘)’ token
     (rte_int128_t *)&list->head,
                    ^
/tmp/UBT164-64_K4.4.0_GCC5.4.0/x86_64-native-linuxapp-gcc/8fbd66d0dc7c470ab7257e8d68ce8b2a/dpdk/lib/librte_stack/rte_stack_generic.h:107:28: warning: variable ‘new_head’ set but not used [-Wunused-but-set-variable]
   struct rte_stack_lf_head new_head;
                            ^
  CC cmdline_parse.o
/tmp/UBT164-64_K4.4.0_GCC5.4.0/x86_64-native-linuxapp-gcc/8fbd66d0dc7c470ab7257e8d68ce8b2a/dpdk/mk/internal/rte.compile-pre.mk:114: recipe for target 'rte_stack.o' failed
make[5]: *** [rte_stack.o] Error 1
/tmp/UBT164-64_K4.4.0_GCC5.4.0/x86_64-native-linuxapp-gcc/8fbd66d0dc7c470ab7257e8d68ce8b2a/dpdk/mk/rte.subdir.mk:35: recipe for target 'librte_stack' failed
make[4]: *** [librte_stack] Error 2
make[4]: *** Waiting for unfinished jobs....
  AR librte_pci.a
  CC cmdline_parse_etheraddr.o
  INSTALL-LIB librte_pci.a
--
  INSTALL-LIB librte_jobstats.a
  AR librte_cmdline.a
  INSTALL-LIB librte_cmdline.a
  AR librte_acl.a
  INSTALL-LIB librte_acl.a
/tmp/UBT164-64_K4.4.0_GCC5.4.0/x86_64-native-linuxapp-gcc/8fbd66d0dc7c470ab7257e8d68ce8b2a/dpdk/mk/rte.sdkbuild.mk:49: recipe for target 'lib' failed
make[3]: *** [lib] Error 2
/tmp/UBT164-64_K4.4.0_GCC5.4.0/x86_64-native-linuxapp-gcc/8fbd66d0dc7c470ab7257e8d68ce8b2a/dpdk/mk/rte.sdkroot.mk:100: recipe for target 'all' failed
make[2]: *** [all] Error 2
/tmp/UBT164-64_K4.4.0_GCC5.4.0/x86_64-native-linuxapp-gcc/8fbd66d0dc7c470ab7257e8d68ce8b2a/dpdk/mk/rte.sdkinstall.mk:57: recipe for target 'pre_install' failed
make[1]: *** [pre_install] Error 2
/tmp/UBT164-64_K4.4.0_GCC5.4.0/x86_64-native-linuxapp-gcc/8fbd66d0dc7c470ab7257e8d68ce8b2a/dpdk/mk/rte.sdkroot.mk:79: recipe for target 'install' failed
make: *** [install] Error 2

*Failed Build #3:
OS: UBT1804
Target: x86_64-native-linuxapp-clang
  SYMLINK-FILE include/cmdline_rdline.h
  SYMLINK-FILE include/cmdline_vt100.h
  SYMLINK-FILE include/cmdline_socket.h
In file included from /tmp/UBT1804_K4.15.0_Clang6.0.0/x86_64-native-linuxapp-clang/8fbd66d0dc7c470ab7257e8d68ce8b2a/dpdk/lib/librte_stack/rte_stack.c:16:
In file included from /tmp/UBT1804_K4.15.0_Clang6.0.0/x86_64-native-linuxapp-clang/8fbd66d0dc7c470ab7257e8d68ce8b2a/dpdk/lib/librte_stack/rte_stack.h:97:
/tmp/UBT1804_K4.15.0_Clang6.0.0/x86_64-native-linuxapp-clang/8fbd66d0dc7c470ab7257e8d68ce8b2a/dpdk/lib/librte_stack/rte_stack_generic.h:61:13: warning: implicit declaration of function 'rte_atomic128_cmp_exchange' is invalid in C99 [-Wimplicit-function-declaration]
                success = rte_atomic128_cmp_exchange(
                          ^
/tmp/UBT1804_K4.15.0_Clang6.0.0/x86_64-native-linuxapp-clang/8fbd66d0dc7c470ab7257e8d68ce8b2a/dpdk/lib/librte_stack/rte_stack_generic.h:61:13: warning: this function declaration is not a prototype [-Wstrict-prototypes]
/tmp/UBT1804_K4.15.0_Clang6.0.0/x86_64-native-linuxapp-clang/8fbd66d0dc7c470ab7257e8d68ce8b2a/dpdk/lib/librte_stack/rte_stack_generic.h:62:20: error: expected expression
                                (rte_int128_t *)&list->head,
                                               ^
  SYMLINK-FILE include/cmdline_cirbuf.h
  SYMLINK-FILE include/cmdline_parse_portlist.h
/tmp/UBT1804_K4.15.0_Clang6.0.0/x86_64-native-linuxapp-clang/8fbd66d0dc7c470ab7257e8d68ce8b2a/dpdk/lib/librte_stack/rte_stack_generic.h:62:6: error: use of undeclared identifier 'rte_int128_t'
                                (rte_int128_t *)&list->head,
                                 ^
/tmp/UBT1804_K4.15.0_Clang6.0.0/x86_64-native-linuxapp-clang/8fbd66d0dc7c470ab7257e8d68ce8b2a/dpdk/lib/librte_stack/rte_stack_generic.h:63:20: error: expected expression
                                (rte_int128_t *)&old_head,
                                               ^
/tmp/UBT1804_K4.15.0_Clang6.0.0/x86_64-native-linuxapp-clang/8fbd66d0dc7c470ab7257e8d68ce8b2a/dpdk/lib/librte_stack/rte_stack_generic.h:63:6: error: use of undeclared identifier 'rte_int128_t'
                                (rte_int128_t *)&old_head,
                                 ^
/tmp/UBT1804_K4.15.0_Clang6.0.0/x86_64-native-linuxapp-clang/8fbd66d0dc7c470ab7257e8d68ce8b2a/dpdk/lib/librte_stack/rte_stack_generic.h:64:20: error: expected expression
                                (rte_int128_t *)&new_head,
                                               ^
/tmp/UBT1804_K4.15.0_Clang6.0.0/x86_64-native-linuxapp-clang/8fbd66d0dc7c470ab7257e8d68ce8b2a/dpdk/lib/librte_stack/rte_stack_generic.h:64:6: error: use of undeclared identifier 'rte_int128_t'
                                (rte_int128_t *)&new_head,
                                 ^
/tmp/UBT1804_K4.15.0_Clang6.0.0/x86_64-native-linuxapp-clang/8fbd66d0dc7c470ab7257e8d68ce8b2a/dpdk/lib/librte_stack/rte_stack_generic.h:139:13: warning: implicit declaration of function 'rte_atomic128_cmp_exchange' is invalid in C99 [-Wimplicit-function-declaration]
                success = rte_atomic128_cmp_exchange(
                          ^
/tmp/UBT1804_K4.15.0_Clang6.0.0/x86_64-native-linuxapp-clang/8fbd66d0dc7c470ab7257e8d68ce8b2a/dpdk/lib/librte_stack/rte_stack_generic.h:140:20: error: expected expression
                                (rte_int128_t *)&list->head,
                                               ^
/tmp/UBT1804_K4.15.0_Clang6.0.0/x86_64-native-linuxapp-clang/8fbd66d0dc7c470ab7257e8d68ce8b2a/dpdk/lib/librte_stack/rte_stack_generic.h:140:6: error: use of undeclared identifier 'rte_int128_t'
                                (rte_int128_t *)&list->head,
                                 ^
  AR librte_pci.a
/tmp/UBT1804_K4.15.0_Clang6.0.0/x86_64-native-linuxapp-clang/8fbd66d0dc7c470ab7257e8d68ce8b2a/dpdk/lib/librte_stack/rte_stack_generic.h:141:20: error: expected expression
                                (rte_int128_t *)&old_head,
                                               ^
/tmp/UBT1804_K4.15.0_Clang6.0.0/x86_64-native-linuxapp-clang/8fbd66d0dc7c470ab7257e8d68ce8b2a/dpdk/lib/librte_stack/rte_stack_generic.h:141:6: error: use of undeclared identifier 'rte_int128_t'
                                (rte_int128_t *)&old_head,
                                 ^
/tmp/UBT1804_K4.15.0_Clang6.0.0/x86_64-native-linuxapp-clang/8fbd66d0dc7c470ab7257e8d68ce8b2a/dpdk/lib/librte_stack/rte_stack_generic.h:142:20: error: expected expression
                                (rte_int128_t *)&new_head,
                                               ^
/tmp/UBT1804_K4.15.0_Clang6.0.0/x86_64-native-linuxapp-clang/8fbd66d0dc7c470ab7257e8d68ce8b2a/dpdk/lib/librte_stack/rte_stack_generic.h:142:6: error: use of undeclared identifier 'rte_int128_t'
                                (rte_int128_t *)&new_head,
                                 ^
3 warnings and 12 errors generated.
  CC cmdline.o
/tmp/UBT1804_K4.15.0_Clang6.0.0/x86_64-native-linuxapp-clang/8fbd66d0dc7c470ab7257e8d68ce8b2a/dpdk/mk/internal/rte.compile-pre.mk:114: recipe for target 'rte_stack.o' failed
make[5]: *** [rte_stack.o] Error 1
/tmp/UBT1804_K4.15.0_Clang6.0.0/x86_64-native-linuxapp-clang/8fbd66d0dc7c470ab7257e8d68ce8b2a/dpdk/mk/rte.subdir.mk:35: recipe for target 'librte_stack' failed
make[4]: *** [librte_stack] Error 2
make[4]: *** Waiting for unfinished jobs....
  CC rte_acl.o
  INSTALL-LIB librte_pci.a
  CC cmdline_cirbuf.o
--
  CC acl_run_avx2.o
  AR librte_cmdline.a
  INSTALL-LIB librte_cmdline.a
  AR librte_acl.a
  INSTALL-LIB librte_acl.a
/tmp/UBT1804_K4.15.0_Clang6.0.0/x86_64-native-linuxapp-clang/8fbd66d0dc7c470ab7257e8d68ce8b2a/dpdk/mk/rte.sdkbuild.mk:49: recipe for target 'lib' failed
make[3]: *** [lib] Error 2
/tmp/UBT1804_K4.15.0_Clang6.0.0/x86_64-native-linuxapp-clang/8fbd66d0dc7c470ab7257e8d68ce8b2a/dpdk/mk/rte.sdkroot.mk:100: recipe for target 'all' failed
make[2]: *** [all] Error 2
/tmp/UBT1804_K4.15.0_Clang6.0.0/x86_64-native-linuxapp-clang/8fbd66d0dc7c470ab7257e8d68ce8b2a/dpdk/mk/rte.sdkinstall.mk:57: recipe for target 'pre_install' failed
make[1]: *** [pre_install] Error 2
/tmp/UBT1804_K4.15.0_Clang6.0.0/x86_64-native-linuxapp-clang/8fbd66d0dc7c470ab7257e8d68ce8b2a/dpdk/mk/rte.sdkroot.mk:79: recipe for target 'install' failed
make: *** [install] Error 2

*Failed Build #4:
OS: UBT1804
Target: x86_64-native-linuxapp-gcc
  CC rte_meter.o
  SYMLINK-FILE include/cmdline.h
In file included from /tmp/UBT1804_K4.15.0_GCC7.3.0/x86_64-native-linuxapp-gcc/8fbd66d0dc7c470ab7257e8d68ce8b2a/dpdk/lib/librte_stack/rte_stack.h:97:0,
                 from /tmp/UBT1804_K4.15.0_GCC7.3.0/x86_64-native-linuxapp-gcc/8fbd66d0dc7c470ab7257e8d68ce8b2a/dpdk/lib/librte_stack/rte_stack.c:16:
/tmp/UBT1804_K4.15.0_GCC7.3.0/x86_64-native-linuxapp-gcc/8fbd66d0dc7c470ab7257e8d68ce8b2a/dpdk/lib/librte_stack/rte_stack_generic.h: In function ‘__rte_stack_lf_push’:
/tmp/UBT1804_K4.15.0_GCC7.3.0/x86_64-native-linuxapp-gcc/8fbd66d0dc7c470ab7257e8d68ce8b2a/dpdk/lib/librte_stack/rte_stack_generic.h:61:13: warning: implicit declaration of function ‘rte_atomic128_cmp_exchange’; did you mean ‘rte_atomic32_exchange’? [-Wimplicit-function-declaration]
   success = rte_atomic128_cmp_exchange(
             ^~~~~~~~~~~~~~~~~~~~~~~~~~
             rte_atomic32_exchange
/tmp/UBT1804_K4.15.0_GCC7.3.0/x86_64-native-linuxapp-gcc/8fbd66d0dc7c470ab7257e8d68ce8b2a/dpdk/lib/librte_stack/rte_stack_generic.h:61:13: warning: nested extern declaration of ‘rte_atomic128_cmp_exchange’ [-Wnested-externs]
/tmp/UBT1804_K4.15.0_GCC7.3.0/x86_64-native-linuxapp-gcc/8fbd66d0dc7c470ab7257e8d68ce8b2a/dpdk/lib/librte_stack/rte_stack_generic.h:62:6: error: ‘rte_int128_t’ undeclared (first use in this function); did you mean ‘__int128_t’?
     (rte_int128_t *)&list->head,
      ^~~~~~~~~~~~
      __int128_t
/tmp/UBT1804_K4.15.0_GCC7.3.0/x86_64-native-linuxapp-gcc/8fbd66d0dc7c470ab7257e8d68ce8b2a/dpdk/lib/librte_stack/rte_stack_generic.h:62:6: note: each undeclared identifier is reported only once for each function it appears in
/tmp/UBT1804_K4.15.0_GCC7.3.0/x86_64-native-linuxapp-gcc/8fbd66d0dc7c470ab7257e8d68ce8b2a/dpdk/lib/librte_stack/rte_stack_generic.h:62:20: error: expected expression before ‘)’ token
     (rte_int128_t *)&list->head,
                    ^
/tmp/UBT1804_K4.15.0_GCC7.3.0/x86_64-native-linuxapp-gcc/8fbd66d0dc7c470ab7257e8d68ce8b2a/dpdk/lib/librte_stack/rte_stack_generic.h:50:28: warning: variable ‘new_head’ set but not used [-Wunused-but-set-variable]
   struct rte_stack_lf_head new_head;
                            ^~~~~~~~
/tmp/UBT1804_K4.15.0_GCC7.3.0/x86_64-native-linuxapp-gcc/8fbd66d0dc7c470ab7257e8d68ce8b2a/dpdk/lib/librte_stack/rte_stack_generic.h: In function ‘__rte_stack_lf_pop’:
/tmp/UBT1804_K4.15.0_GCC7.3.0/x86_64-native-linuxapp-gcc/8fbd66d0dc7c470ab7257e8d68ce8b2a/dpdk/lib/librte_stack/rte_stack_generic.h:140:6: error: ‘rte_int128_t’ undeclared (first use in this function); did you mean ‘__int128_t’?
     (rte_int128_t *)&list->head,
      ^~~~~~~~~~~~
      __int128_t
/tmp/UBT1804_K4.15.0_GCC7.3.0/x86_64-native-linuxapp-gcc/8fbd66d0dc7c470ab7257e8d68ce8b2a/dpdk/lib/librte_stack/rte_stack_generic.h:140:20: error: expected expression before ‘)’ token
     (rte_int128_t *)&list->head,
                    ^
/tmp/UBT1804_K4.15.0_GCC7.3.0/x86_64-native-linuxapp-gcc/8fbd66d0dc7c470ab7257e8d68ce8b2a/dpdk/lib/librte_stack/rte_stack_generic.h:107:28: warning: variable ‘new_head’ set but not used [-Wunused-but-set-variable]
   struct rte_stack_lf_head new_head;
                            ^~~~~~~~
/tmp/UBT1804_K4.15.0_GCC7.3.0/x86_64-native-linuxapp-gcc/8fbd66d0dc7c470ab7257e8d68ce8b2a/dpdk/mk/internal/rte.compile-pre.mk:114: recipe for target 'rte_stack.o' failed
make[5]: *** [rte_stack.o] Error 1
/tmp/UBT1804_K4.15.0_GCC7.3.0/x86_64-native-linuxapp-gcc/8fbd66d0dc7c470ab7257e8d68ce8b2a/dpdk/mk/rte.subdir.mk:35: recipe for target 'librte_stack' failed
make[4]: *** [librte_stack] Error 2
make[4]: *** Waiting for unfinished jobs....
  SYMLINK-FILE include/cmdline_parse.h
  SYMLINK-FILE include/cmdline_parse_num.h
  SYMLINK-FILE include/cmdline_parse_ipaddr.h
--
  CC acl_run_avx2.o
  AR librte_cmdline.a
  INSTALL-LIB librte_cmdline.a
  AR librte_acl.a
  INSTALL-LIB librte_acl.a
/tmp/UBT1804_K4.15.0_GCC7.3.0/x86_64-native-linuxapp-gcc/8fbd66d0dc7c470ab7257e8d68ce8b2a/dpdk/mk/rte.sdkbuild.mk:49: recipe for target 'lib' failed
make[3]: *** [lib] Error 2
/tmp/UBT1804_K4.15.0_GCC7.3.0/x86_64-native-linuxapp-gcc/8fbd66d0dc7c470ab7257e8d68ce8b2a/dpdk/mk/rte.sdkroot.mk:100: recipe for target 'all' failed
make[2]: *** [all] Error 2
/tmp/UBT1804_K4.15.0_GCC7.3.0/x86_64-native-linuxapp-gcc/8fbd66d0dc7c470ab7257e8d68ce8b2a/dpdk/mk/rte.sdkinstall.mk:57: recipe for target 'pre_install' failed
make[1]: *** [pre_install] Error 2
/tmp/UBT1804_K4.15.0_GCC7.3.0/x86_64-native-linuxapp-gcc/8fbd66d0dc7c470ab7257e8d68ce8b2a/dpdk/mk/rte.sdkroot.mk:79: recipe for target 'install' failed
make: *** [install] Error 2

*Failed Build #5:
OS: UBT1804
Target: x86_64-native-linuxapp-icc
  AR librte_pci.a
  INSTALL-LIB librte_pci.a
In file included from /tmp/UBT1804_K4.15.0_ICC19.0.0/x86_64-native-linuxapp-icc/8fbd66d0dc7c470ab7257e8d68ce8b2a/dpdk/lib/librte_stack/rte_stack.h(97),
                 from /tmp/UBT1804_K4.15.0_ICC19.0.0/x86_64-native-linuxapp-icc/8fbd66d0dc7c470ab7257e8d68ce8b2a/dpdk/lib/librte_stack/rte_stack.c(16):
  SYMLINK-FILE include/cmdline_parse_string.h
/tmp/UBT1804_K4.15.0_ICC19.0.0/x86_64-native-linuxapp-icc/8fbd66d0dc7c470ab7257e8d68ce8b2a/dpdk/lib/librte_stack/rte_stack_generic.h(61): warning #266: function "rte_atomic128_cmp_exchange" declared implicitly
  		success = rte_atomic128_cmp_exchange(
  		          ^

In file included from /tmp/UBT1804_K4.15.0_ICC19.0.0/x86_64-native-linuxapp-icc/8fbd66d0dc7c470ab7257e8d68ce8b2a/dpdk/lib/librte_stack/rte_stack.h(97),
                 from /tmp/UBT1804_K4.15.0_ICC19.0.0/x86_64-native-linuxapp-icc/8fbd66d0dc7c470ab7257e8d68ce8b2a/dpdk/lib/librte_stack/rte_stack.c(16):
/tmp/UBT1804_K4.15.0_ICC19.0.0/x86_64-native-linuxapp-icc/8fbd66d0dc7c470ab7257e8d68ce8b2a/dpdk/lib/librte_stack/rte_stack_generic.h(62): error: identifier "rte_int128_t" is undefined
  				(rte_int128_t *)&list->head,
  				 ^

In file included from /tmp/UBT1804_K4.15.0_ICC19.0.0/x86_64-native-linuxapp-icc/8fbd66d0dc7c470ab7257e8d68ce8b2a/dpdk/lib/librte_stack/rte_stack.h(97),
                 from /tmp/UBT1804_K4.15.0_ICC19.0.0/x86_64-native-linuxapp-icc/8fbd66d0dc7c470ab7257e8d68ce8b2a/dpdk/lib/librte_stack/rte_stack.c(16):
/tmp/UBT1804_K4.15.0_ICC19.0.0/x86_64-native-linuxapp-icc/8fbd66d0dc7c470ab7257e8d68ce8b2a/dpdk/lib/librte_stack/rte_stack_generic.h(62): error: expected an expression
  				(rte_int128_t *)&list->head,
  				               ^

In file included from /tmp/UBT1804_K4.15.0_ICC19.0.0/x86_64-native-linuxapp-icc/8fbd66d0dc7c470ab7257e8d68ce8b2a/dpdk/lib/librte_stack/rte_stack.h(97),
                 from /tmp/UBT1804_K4.15.0_ICC19.0.0/x86_64-native-linuxapp-icc/8fbd66d0dc7c470ab7257e8d68ce8b2a/dpdk/lib/librte_stack/rte_stack.c(16):
/tmp/UBT1804_K4.15.0_ICC19.0.0/x86_64-native-linuxapp-icc/8fbd66d0dc7c470ab7257e8d68ce8b2a/dpdk/lib/librte_stack/rte_stack_generic.h(62): error: expression must have integral type
  				(rte_int128_t *)&list->head,
  				                 ^

In file included from /tmp/UBT1804_K4.15.0_ICC19.0.0/x86_64-native-linuxapp-icc/8fbd66d0dc7c470ab7257e8d68ce8b2a/dpdk/lib/librte_stack/rte_stack.h(97),
                 from /tmp/UBT1804_K4.15.0_ICC19.0.0/x86_64-native-linuxapp-icc/8fbd66d0dc7c470ab7257e8d68ce8b2a/dpdk/lib/librte_stack/rte_stack.c(16):
/tmp/UBT1804_K4.15.0_ICC19.0.0/x86_64-native-linuxapp-icc/8fbd66d0dc7c470ab7257e8d68ce8b2a/dpdk/lib/librte_stack/rte_stack_generic.h(63): error: expected an expression
  				(rte_int128_t *)&old_head,
  				               ^

In file included from /tmp/UBT1804_K4.15.0_ICC19.0.0/x86_64-native-linuxapp-icc/8fbd66d0dc7c470ab7257e8d68ce8b2a/dpdk/lib/librte_stack/rte_stack.h(97),
                 from /tmp/UBT1804_K4.15.0_ICC19.0.0/x86_64-native-linuxapp-icc/8fbd66d0dc7c470ab7257e8d68ce8b2a/dpdk/lib/librte_stack/rte_stack.c(16):
/tmp/UBT1804_K4.15.0_ICC19.0.0/x86_64-native-linuxapp-icc/8fbd66d0dc7c470ab7257e8d68ce8b2a/dpdk/lib/librte_stack/rte_stack_generic.h(63): error: expression must have integral type
  				(rte_int128_t *)&old_head,
  				                 ^

In file included from /tmp/UBT1804_K4.15.0_ICC19.0.0/x86_64-native-linuxapp-icc/8fbd66d0dc7c470ab7257e8d68ce8b2a/dpdk/lib/librte_stack/rte_stack.h(97),
                 from /tmp/UBT1804_K4.15.0_ICC19.0.0/x86_64-native-linuxapp-icc/8fbd66d0dc7c470ab7257e8d68ce8b2a/dpdk/lib/librte_stack/rte_stack.c(16):
/tmp/UBT1804_K4.15.0_ICC19.0.0/x86_64-native-linuxapp-icc/8fbd66d0dc7c470ab7257e8d68ce8b2a/dpdk/lib/librte_stack/rte_stack_generic.h(64): error: expected an expression
  				(rte_int128_t *)&new_head,
  				               ^

In file included from /tmp/UBT1804_K4.15.0_ICC19.0.0/x86_64-native-linuxapp-icc/8fbd66d0dc7c470ab7257e8d68ce8b2a/dpdk/lib/librte_stack/rte_stack.h(97),
                 from /tmp/UBT1804_K4.15.0_ICC19.0.0/x86_64-native-linuxapp-icc/8fbd66d0dc7c470ab7257e8d68ce8b2a/dpdk/lib/librte_stack/rte_stack.c(16):
/tmp/UBT1804_K4.15.0_ICC19.0.0/x86_64-native-linuxapp-icc/8fbd66d0dc7c470ab7257e8d68ce8b2a/dpdk/lib/librte_stack/rte_stack_generic.h(64): error: expression must have integral type
  				(rte_int128_t *)&new_head,
  				                 ^

In file included from /tmp/UBT1804_K4.15.0_ICC19.0.0/x86_64-native-linuxapp-icc/8fbd66d0dc7c470ab7257e8d68ce8b2a/dpdk/lib/librte_stack/rte_stack.h(97),
                 from /tmp/UBT1804_K4.15.0_ICC19.0.0/x86_64-native-linuxapp-icc/8fbd66d0dc7c470ab7257e8d68ce8b2a/dpdk/lib/librte_stack/rte_stack.c(16):
/tmp/UBT1804_K4.15.0_ICC19.0.0/x86_64-native-linuxapp-icc/8fbd66d0dc7c470ab7257e8d68ce8b2a/dpdk/lib/librte_stack/rte_stack_generic.h(139): warning #266: function "rte_atomic128_cmp_exchange" declared implicitly
  		success = rte_atomic128_cmp_exchange(
  		          ^

In file included from /tmp/UBT1804_K4.15.0_ICC19.0.0/x86_64-native-linuxapp-icc/8fbd66d0dc7c470ab7257e8d68ce8b2a/dpdk/lib/librte_stack/rte_stack.h(97),
                 from /tmp/UBT1804_K4.15.0_ICC19.0.0/x86_64-native-linuxapp-icc/8fbd66d0dc7c470ab7257e8d68ce8b2a/dpdk/lib/librte_stack/rte_stack.c(16):
/tmp/UBT1804_K4.15.0_ICC19.0.0/x86_64-native-linuxapp-icc/8fbd66d0dc7c470ab7257e8d68ce8b2a/dpdk/lib/librte_stack/rte_stack_generic.h(140): error: identifier "rte_int128_t" is undefined
  				(rte_int128_t *)&list->head,
  				 ^

In file included from /tmp/UBT1804_K4.15.0_ICC19.0.0/x86_64-native-linuxapp-icc/8fbd66d0dc7c470ab7257e8d68ce8b2a/dpdk/lib/librte_stack/rte_stack.h(97),
                 from /tmp/UBT1804_K4.15.0_ICC19.0.0/x86_64-native-linuxapp-icc/8fbd66d0dc7c470ab7257e8d68ce8b2a/dpdk/lib/librte_stack/rte_stack.c(16):
/tmp/UBT1804_K4.15.0_ICC19.0.0/x86_64-native-linuxapp-icc/8fbd66d0dc7c470ab7257e8d68ce8b2a/dpdk/lib/librte_stack/rte_stack_generic.h(140): error: expected an expression
  				(rte_int128_t *)&list->head,
  				               ^

In file included from /tmp/UBT1804_K4.15.0_ICC19.0.0/x86_64-native-linuxapp-icc/8fbd66d0dc7c470ab7257e8d68ce8b2a/dpdk/lib/librte_stack/rte_stack.h(97),
                 from /tmp/UBT1804_K4.15.0_ICC19.0.0/x86_64-native-linuxapp-icc/8fbd66d0dc7c470ab7257e8d68ce8b2a/dpdk/lib/librte_stack/rte_stack.c(16):
/tmp/UBT1804_K4.15.0_ICC19.0.0/x86_64-native-linuxapp-icc/8fbd66d0dc7c470ab7257e8d68ce8b2a/dpdk/lib/librte_stack/rte_stack_generic.h(140): error: expression must have integral type
  				(rte_int128_t *)&list->head,
  				                 ^

In file included from /tmp/UBT1804_K4.15.0_ICC19.0.0/x86_64-native-linuxapp-icc/8fbd66d0dc7c470ab7257e8d68ce8b2a/dpdk/lib/librte_stack/rte_stack.h(97),
                 from /tmp/UBT1804_K4.15.0_ICC19.0.0/x86_64-native-linuxapp-icc/8fbd66d0dc7c470ab7257e8d68ce8b2a/dpdk/lib/librte_stack/rte_stack.c(16):
/tmp/UBT1804_K4.15.0_ICC19.0.0/x86_64-native-linuxapp-icc/8fbd66d0dc7c470ab7257e8d68ce8b2a/dpdk/lib/librte_stack/rte_stack_generic.h(141): error: expected an expression
  				(rte_int128_t *)&old_head,
  				               ^

In file included from /tmp/UBT1804_K4.15.0_ICC19.0.0/x86_64-native-linuxapp-icc/8fbd66d0dc7c470ab7257e8d68ce8b2a/dpdk/lib/librte_stack/rte_stack.h(97),
                 from /tmp/UBT1804_K4.15.0_ICC19.0.0/x86_64-native-linuxapp-icc/8fbd66d0dc7c470ab7257e8d68ce8b2a/dpdk/lib/librte_stack/rte_stack.c(16):
/tmp/UBT1804_K4.15.0_ICC19.0.0/x86_64-native-linuxapp-icc/8fbd66d0dc7c470ab7257e8d68ce8b2a/dpdk/lib/librte_stack/rte_stack_generic.h(141): error: expression must have integral type
  				(rte_int128_t *)&old_head,
  				                 ^

In file included from /tmp/UBT1804_K4.15.0_ICC19.0.0/x86_64-native-linuxapp-icc/8fbd66d0dc7c470ab7257e8d68ce8b2a/dpdk/lib/librte_stack/rte_stack.h(97),
                 from /tmp/UBT1804_K4.15.0_ICC19.0.0/x86_64-native-linuxapp-icc/8fbd66d0dc7c470ab7257e8d68ce8b2a/dpdk/lib/librte_stack/rte_stack.c(16):
/tmp/UBT1804_K4.15.0_ICC19.0.0/x86_64-native-linuxapp-icc/8fbd66d0dc7c470ab7257e8d68ce8b2a/dpdk/lib/librte_stack/rte_stack_generic.h(142): error: expected an expression
  				(rte_int128_t *)&new_head,
  				               ^

In file included from /tmp/UBT1804_K4.15.0_ICC19.0.0/x86_64-native-linuxapp-icc/8fbd66d0dc7c470ab7257e8d68ce8b2a/dpdk/lib/librte_stack/rte_stack.h(97),
                 from /tmp/UBT1804_K4.15.0_ICC19.0.0/x86_64-native-linuxapp-icc/8fbd66d0dc7c470ab7257e8d68ce8b2a/dpdk/lib/librte_stack/rte_stack.c(16):
/tmp/UBT1804_K4.15.0_ICC19.0.0/x86_64-native-linuxapp-icc/8fbd66d0dc7c470ab7257e8d68ce8b2a/dpdk/lib/librte_stack/rte_stack_generic.h(142): error: expression must have integral type
  				(rte_int128_t *)&new_head,
  				                 ^

compilation aborted for /tmp/UBT1804_K4.15.0_ICC19.0.0/x86_64-native-linuxapp-icc/8fbd66d0dc7c470ab7257e8d68ce8b2a/dpdk/lib/librte_stack/rte_stack.c (code 2)
/tmp/UBT1804_K4.15.0_ICC19.0.0/x86_64-native-linuxapp-icc/8fbd66d0dc7c470ab7257e8d68ce8b2a/dpdk/mk/internal/rte.compile-pre.mk:114: recipe for target 'rte_stack.o' failed
make[5]: *** [rte_stack.o] Error 2
/tmp/UBT1804_K4.15.0_ICC19.0.0/x86_64-native-linuxapp-icc/8fbd66d0dc7c470ab7257e8d68ce8b2a/dpdk/mk/rte.subdir.mk:35: recipe for target 'librte_stack' failed
make[4]: *** [librte_stack] Error 2
make[4]: *** Waiting for unfinished jobs....
  SYMLINK-FILE include/cmdline_rdline.h
  SYMLINK-FILE include/cmdline_vt100.h
  CC acl_run_scalar.o
--
  INSTALL-LIB librte_acl.a
  AR librte_mempool.a
  INSTALL-LIB librte_mempool.a
  AR librte_hash.a
  INSTALL-LIB librte_hash.a
/tmp/UBT1804_K4.15.0_ICC19.0.0/x86_64-native-linuxapp-icc/8fbd66d0dc7c470ab7257e8d68ce8b2a/dpdk/mk/rte.sdkbuild.mk:49: recipe for target 'lib' failed
make[3]: *** [lib] Error 2
/tmp/UBT1804_K4.15.0_ICC19.0.0/x86_64-native-linuxapp-icc/8fbd66d0dc7c470ab7257e8d68ce8b2a/dpdk/mk/rte.sdkroot.mk:100: recipe for target 'all' failed
make[2]: *** [all] Error 2
/tmp/UBT1804_K4.15.0_ICC19.0.0/x86_64-native-linuxapp-icc/8fbd66d0dc7c470ab7257e8d68ce8b2a/dpdk/mk/rte.sdkinstall.mk:57: recipe for target 'pre_install' failed
make[1]: *** [pre_install] Error 2
/tmp/UBT1804_K4.15.0_ICC19.0.0/x86_64-native-linuxapp-icc/8fbd66d0dc7c470ab7257e8d68ce8b2a/dpdk/mk/rte.sdkroot.mk:79: recipe for target 'install' failed
make: *** [install] Error 2

*Failed Build #6:
OS: UBT1810
Target: x86_64-native-linuxapp-gcc
  CC acl_bld.o
  INSTALL-LIB librte_timer.a
In file included from /tmp/UBT1810_K4.18.0_GCC8.2.0/x86_64-native-linuxapp-gcc/8fbd66d0dc7c470ab7257e8d68ce8b2a/dpdk/lib/librte_stack/rte_stack.h:97,
                 from /tmp/UBT1810_K4.18.0_GCC8.2.0/x86_64-native-linuxapp-gcc/8fbd66d0dc7c470ab7257e8d68ce8b2a/dpdk/lib/librte_stack/rte_stack.c:16:
/tmp/UBT1810_K4.18.0_GCC8.2.0/x86_64-native-linuxapp-gcc/8fbd66d0dc7c470ab7257e8d68ce8b2a/dpdk/lib/librte_stack/rte_stack_generic.h: In function ‘__rte_stack_lf_push’:
/tmp/UBT1810_K4.18.0_GCC8.2.0/x86_64-native-linuxapp-gcc/8fbd66d0dc7c470ab7257e8d68ce8b2a/dpdk/lib/librte_stack/rte_stack_generic.h:61:13: warning: implicit declaration of function ‘rte_atomic128_cmp_exchange’; did you mean ‘rte_atomic32_exchange’? [-Wimplicit-function-declaration]
   success = rte_atomic128_cmp_exchange(
             ^~~~~~~~~~~~~~~~~~~~~~~~~~
             rte_atomic32_exchange
/tmp/UBT1810_K4.18.0_GCC8.2.0/x86_64-native-linuxapp-gcc/8fbd66d0dc7c470ab7257e8d68ce8b2a/dpdk/lib/librte_stack/rte_stack_generic.h:61:13: warning: nested extern declaration of ‘rte_atomic128_cmp_exchange’ [-Wnested-externs]
/tmp/UBT1810_K4.18.0_GCC8.2.0/x86_64-native-linuxapp-gcc/8fbd66d0dc7c470ab7257e8d68ce8b2a/dpdk/lib/librte_stack/rte_stack_generic.h:62:6: error: ‘rte_int128_t’ undeclared (first use in this function); did you mean ‘rte_iova_t’?
     (rte_int128_t *)&list->head,
      ^~~~~~~~~~~~
      rte_iova_t
/tmp/UBT1810_K4.18.0_GCC8.2.0/x86_64-native-linuxapp-gcc/8fbd66d0dc7c470ab7257e8d68ce8b2a/dpdk/lib/librte_stack/rte_stack_generic.h:62:6: note: each undeclared identifier is reported only once for each function it appears in
/tmp/UBT1810_K4.18.0_GCC8.2.0/x86_64-native-linuxapp-gcc/8fbd66d0dc7c470ab7257e8d68ce8b2a/dpdk/lib/librte_stack/rte_stack_generic.h:62:20: error: expected expression before ‘)’ token
     (rte_int128_t *)&list->head,
                    ^
/tmp/UBT1810_K4.18.0_GCC8.2.0/x86_64-native-linuxapp-gcc/8fbd66d0dc7c470ab7257e8d68ce8b2a/dpdk/lib/librte_stack/rte_stack_generic.h:50:28: warning: variable ‘new_head’ set but not used [-Wunused-but-set-variable]
   struct rte_stack_lf_head new_head;
                            ^~~~~~~~
/tmp/UBT1810_K4.18.0_GCC8.2.0/x86_64-native-linuxapp-gcc/8fbd66d0dc7c470ab7257e8d68ce8b2a/dpdk/lib/librte_stack/rte_stack_generic.h: In function ‘__rte_stack_lf_pop’:
/tmp/UBT1810_K4.18.0_GCC8.2.0/x86_64-native-linuxapp-gcc/8fbd66d0dc7c470ab7257e8d68ce8b2a/dpdk/lib/librte_stack/rte_stack_generic.h:140:6: error: ‘rte_int128_t’ undeclared (first use in this function); did you mean ‘rte_iova_t’?
     (rte_int128_t *)&list->head,
      ^~~~~~~~~~~~
      rte_iova_t
/tmp/UBT1810_K4.18.0_GCC8.2.0/x86_64-native-linuxapp-gcc/8fbd66d0dc7c470ab7257e8d68ce8b2a/dpdk/lib/librte_stack/rte_stack_generic.h:140:20: error: expected expression before ‘)’ token
     (rte_int128_t *)&list->head,
                    ^
/tmp/UBT1810_K4.18.0_GCC8.2.0/x86_64-native-linuxapp-gcc/8fbd66d0dc7c470ab7257e8d68ce8b2a/dpdk/lib/librte_stack/rte_stack_generic.h:107:28: warning: variable ‘new_head’ set but not used [-Wunused-but-set-variable]
   struct rte_stack_lf_head new_head;
                            ^~~~~~~~
  AR librte_jobstats.a
  CC cmdline.o
  INSTALL-LIB librte_jobstats.a

*Failed Build #7:
OS: RHEL75
Target: x86_64-native-linuxapp-gcc
  CC rte_acl.o
  SYMLINK-FILE include/cmdline_parse_portlist.h
In file included from /tmp/RHEL75_K3.10.0_GCC4.8.5/x86_64-native-linuxapp-gcc/8fbd66d0dc7c470ab7257e8d68ce8b2a/dpdk/lib/librte_stack/rte_stack.h:97:0,
                 from /tmp/RHEL75_K3.10.0_GCC4.8.5/x86_64-native-linuxapp-gcc/8fbd66d0dc7c470ab7257e8d68ce8b2a/dpdk/lib/librte_stack/rte_stack.c:16:
/tmp/RHEL75_K3.10.0_GCC4.8.5/x86_64-native-linuxapp-gcc/8fbd66d0dc7c470ab7257e8d68ce8b2a/dpdk/lib/librte_stack/rte_stack_generic.h: In function ‘__rte_stack_lf_push’:
/tmp/RHEL75_K3.10.0_GCC4.8.5/x86_64-native-linuxapp-gcc/8fbd66d0dc7c470ab7257e8d68ce8b2a/dpdk/lib/librte_stack/rte_stack_generic.h:61:3: warning: implicit declaration of function ‘rte_atomic128_cmp_exchange’ [-Wimplicit-function-declaration]
   success = rte_atomic128_cmp_exchange(
   ^
/tmp/RHEL75_K3.10.0_GCC4.8.5/x86_64-native-linuxapp-gcc/8fbd66d0dc7c470ab7257e8d68ce8b2a/dpdk/lib/librte_stack/rte_stack_generic.h:61:3: warning: nested extern declaration of ‘rte_atomic128_cmp_exchange’ [-Wnested-externs]
/tmp/RHEL75_K3.10.0_GCC4.8.5/x86_64-native-linuxapp-gcc/8fbd66d0dc7c470ab7257e8d68ce8b2a/dpdk/lib/librte_stack/rte_stack_generic.h:62:6: error: ‘rte_int128_t’ undeclared (first use in this function)
     (rte_int128_t *)&list->head,
      ^
/tmp/RHEL75_K3.10.0_GCC4.8.5/x86_64-native-linuxapp-gcc/8fbd66d0dc7c470ab7257e8d68ce8b2a/dpdk/lib/librte_stack/rte_stack_generic.h:62:6: note: each undeclared identifier is reported only once for each function it appears in
/tmp/RHEL75_K3.10.0_GCC4.8.5/x86_64-native-linuxapp-gcc/8fbd66d0dc7c470ab7257e8d68ce8b2a/dpdk/lib/librte_stack/rte_stack_generic.h:62:20: error: expected expression before ‘)’ token
     (rte_int128_t *)&list->head,
                    ^
/tmp/RHEL75_K3.10.0_GCC4.8.5/x86_64-native-linuxapp-gcc/8fbd66d0dc7c470ab7257e8d68ce8b2a/dpdk/lib/librte_stack/rte_stack_generic.h:50:28: warning: variable ‘new_head’ set but not used [-Wunused-but-set-variable]
   struct rte_stack_lf_head new_head;
                            ^
/tmp/RHEL75_K3.10.0_GCC4.8.5/x86_64-native-linuxapp-gcc/8fbd66d0dc7c470ab7257e8d68ce8b2a/dpdk/lib/librte_stack/rte_stack_generic.h: In function ‘__rte_stack_lf_pop’:
/tmp/RHEL75_K3.10.0_GCC4.8.5/x86_64-native-linuxapp-gcc/8fbd66d0dc7c470ab7257e8d68ce8b2a/dpdk/lib/librte_stack/rte_stack_generic.h:140:6: error: ‘rte_int128_t’ undeclared (first use in this function)
     (rte_int128_t *)&list->head,
      ^
/tmp/RHEL75_K3.10.0_GCC4.8.5/x86_64-native-linuxapp-gcc/8fbd66d0dc7c470ab7257e8d68ce8b2a/dpdk/lib/librte_stack/rte_stack_generic.h:140:20: error: expected expression before ‘)’ token
     (rte_int128_t *)&list->head,
                    ^
/tmp/RHEL75_K3.10.0_GCC4.8.5/x86_64-native-linuxapp-gcc/8fbd66d0dc7c470ab7257e8d68ce8b2a/dpdk/lib/librte_stack/rte_stack_generic.h:107:28: warning: variable ‘new_head’ set but not used [-Wunused-but-set-variable]
   struct rte_stack_lf_head new_head;
                            ^
make[5]: *** [rte_stack.o] Error 1
make[4]: *** [librte_stack] Error 2
make[4]: *** Waiting for unfinished jobs....

*Failed Build #8:
OS: FC28
Target: x86_64-native-linuxapp-gcc
  CC acl_bld.o
  SYMLINK-FILE include/cmdline_cirbuf.h
In file included from /tmp/FC28_K4.16.3_GCC8.0.1/x86_64-native-linuxapp-gcc/8fbd66d0dc7c470ab7257e8d68ce8b2a/dpdk/lib/librte_stack/rte_stack.h:97,
                 from /tmp/FC28_K4.16.3_GCC8.0.1/x86_64-native-linuxapp-gcc/8fbd66d0dc7c470ab7257e8d68ce8b2a/dpdk/lib/librte_stack/rte_stack.c:16:
/tmp/FC28_K4.16.3_GCC8.0.1/x86_64-native-linuxapp-gcc/8fbd66d0dc7c470ab7257e8d68ce8b2a/dpdk/lib/librte_stack/rte_stack_generic.h: In function ‘__rte_stack_lf_push’:
/tmp/FC28_K4.16.3_GCC8.0.1/x86_64-native-linuxapp-gcc/8fbd66d0dc7c470ab7257e8d68ce8b2a/dpdk/lib/librte_stack/rte_stack_generic.h:61:13: warning: implicit declaration of function ‘rte_atomic128_cmp_exchange’; did you mean ‘rte_atomic32_exchange’? [-Wimplicit-function-declaration]
   success = rte_atomic128_cmp_exchange(
             ^~~~~~~~~~~~~~~~~~~~~~~~~~
             rte_atomic32_exchange
/tmp/FC28_K4.16.3_GCC8.0.1/x86_64-native-linuxapp-gcc/8fbd66d0dc7c470ab7257e8d68ce8b2a/dpdk/lib/librte_stack/rte_stack_generic.h:61:13: warning: nested extern declaration of ‘rte_atomic128_cmp_exchange’ [-Wnested-externs]
/tmp/FC28_K4.16.3_GCC8.0.1/x86_64-native-linuxapp-gcc/8fbd66d0dc7c470ab7257e8d68ce8b2a/dpdk/lib/librte_stack/rte_stack_generic.h:62:6: error: ‘rte_int128_t’ undeclared (first use in this function); did you mean ‘rte_iova_t’?
     (rte_int128_t *)&list->head,
      ^~~~~~~~~~~~
      rte_iova_t
/tmp/FC28_K4.16.3_GCC8.0.1/x86_64-native-linuxapp-gcc/8fbd66d0dc7c470ab7257e8d68ce8b2a/dpdk/lib/librte_stack/rte_stack_generic.h:62:6: note: each undeclared identifier is reported only once for each function it appears in
/tmp/FC28_K4.16.3_GCC8.0.1/x86_64-native-linuxapp-gcc/8fbd66d0dc7c470ab7257e8d68ce8b2a/dpdk/lib/librte_stack/rte_stack_generic.h:62:20: error: expected expression before ‘)’ token
     (rte_int128_t *)&list->head,
                    ^
/tmp/FC28_K4.16.3_GCC8.0.1/x86_64-native-linuxapp-gcc/8fbd66d0dc7c470ab7257e8d68ce8b2a/dpdk/lib/librte_stack/rte_stack_generic.h:50:28: warning: variable ‘new_head’ set but not used [-Wunused-but-set-variable]
   struct rte_stack_lf_head new_head;
                            ^~~~~~~~
/tmp/FC28_K4.16.3_GCC8.0.1/x86_64-native-linuxapp-gcc/8fbd66d0dc7c470ab7257e8d68ce8b2a/dpdk/lib/librte_stack/rte_stack_generic.h: In function ‘__rte_stack_lf_pop’:
/tmp/FC28_K4.16.3_GCC8.0.1/x86_64-native-linuxapp-gcc/8fbd66d0dc7c470ab7257e8d68ce8b2a/dpdk/lib/librte_stack/rte_stack_generic.h:140:6: error: ‘rte_int128_t’ undeclared (first use in this function); did you mean ‘rte_iova_t’?
     (rte_int128_t *)&list->head,
      ^~~~~~~~~~~~
      rte_iova_t
/tmp/FC28_K4.16.3_GCC8.0.1/x86_64-native-linuxapp-gcc/8fbd66d0dc7c470ab7257e8d68ce8b2a/dpdk/lib/librte_stack/rte_stack_generic.h:140:20: error: expected expression before ‘)’ token
     (rte_int128_t *)&list->head,
                    ^
/tmp/FC28_K4.16.3_GCC8.0.1/x86_64-native-linuxapp-gcc/8fbd66d0dc7c470ab7257e8d68ce8b2a/dpdk/lib/librte_stack/rte_stack_generic.h:107:28: warning: variable ‘new_head’ set but not used [-Wunused-but-set-variable]
   struct rte_stack_lf_head new_head;
                            ^~~~~~~~
make[5]: *** [/tmp/FC28_K4.16.3_GCC8.0.1/x86_64-native-linuxapp-gcc/8fbd66d0dc7c470ab7257e8d68ce8b2a/dpdk/mk/internal/rte.compile-pre.mk:116: rte_stack.o] Error 1
make[4]: *** [/tmp/FC28_K4.16.3_GCC8.0.1/x86_64-native-linuxapp-gcc/8fbd66d0dc7c470ab7257e8d68ce8b2a/dpdk/mk/rte.subdir.mk:37: librte_stack] Error 2
make[4]: *** Waiting for unfinished jobs....

*Failed Build #9:
OS: FC28
Target: x86_64-native-linuxapp-clang
  SYMLINK-FILE include/cmdline_socket.h
  SYMLINK-FILE include/cmdline_cirbuf.h
  AR librte_ring.a
In file included from /tmp/FC28_K4.16.3_Clang6.0.1/x86_64-native-linuxapp-clang/8fbd66d0dc7c470ab7257e8d68ce8b2a/dpdk/lib/librte_stack/rte_stack.c:16:
In file included from /tmp/FC28_K4.16.3_Clang6.0.1/x86_64-native-linuxapp-clang/8fbd66d0dc7c470ab7257e8d68ce8b2a/dpdk/lib/librte_stack/rte_stack.h:97:
/tmp/FC28_K4.16.3_Clang6.0.1/x86_64-native-linuxapp-clang/8fbd66d0dc7c470ab7257e8d68ce8b2a/dpdk/lib/librte_stack/rte_stack_generic.h:61:13: warning: implicit declaration of function 'rte_atomic128_cmp_exchange' is invalid in C99 [-Wimplicit-function-declaration]
                success = rte_atomic128_cmp_exchange(
                          ^
/tmp/FC28_K4.16.3_Clang6.0.1/x86_64-native-linuxapp-clang/8fbd66d0dc7c470ab7257e8d68ce8b2a/dpdk/lib/librte_stack/rte_stack_generic.h:61:13: warning: this function declaration is not a prototype [-Wstrict-prototypes]
  AR librte_timer.a
/tmp/FC28_K4.16.3_Clang6.0.1/x86_64-native-linuxapp-clang/8fbd66d0dc7c470ab7257e8d68ce8b2a/dpdk/lib/librte_stack/rte_stack_generic.h:62:20: error: expected expression
                                (rte_int128_t *)&list->head,
                                               ^
  INSTALL-LIB librte_ring.a
/tmp/FC28_K4.16.3_Clang6.0.1/x86_64-native-linuxapp-clang/8fbd66d0dc7c470ab7257e8d68ce8b2a/dpdk/lib/librte_stack/rte_stack_generic.h:62:6: error: use of undeclared identifier 'rte_int128_t'
                                (rte_int128_t *)&list->head,
                                 ^
/tmp/FC28_K4.16.3_Clang6.0.1/x86_64-native-linuxapp-clang/8fbd66d0dc7c470ab7257e8d68ce8b2a/dpdk/lib/librte_stack/rte_stack_generic.h:63:20: error: expected expression
                                (rte_int128_t *)&old_head,
                                               ^
/tmp/FC28_K4.16.3_Clang6.0.1/x86_64-native-linuxapp-clang/8fbd66d0dc7c470ab7257e8d68ce8b2a/dpdk/lib/librte_stack/rte_stack_generic.h:63:6: error: use of undeclared identifier 'rte_int128_t'
                                (rte_int128_t *)&old_head,
                                 ^
/tmp/FC28_K4.16.3_Clang6.0.1/x86_64-native-linuxapp-clang/8fbd66d0dc7c470ab7257e8d68ce8b2a/dpdk/lib/librte_stack/rte_stack_generic.h:64:20: error: expected expression
                                (rte_int128_t *)&new_head,
                                               ^
/tmp/FC28_K4.16.3_Clang6.0.1/x86_64-native-linuxapp-clang/8fbd66d0dc7c470ab7257e8d68ce8b2a/dpdk/lib/librte_stack/rte_stack_generic.h:64:6: error: use of undeclared identifier 'rte_int128_t'
                                (rte_int128_t *)&new_head,
                                 ^
/tmp/FC28_K4.16.3_Clang6.0.1/x86_64-native-linuxapp-clang/8fbd66d0dc7c470ab7257e8d68ce8b2a/dpdk/lib/librte_stack/rte_stack_generic.h:139:13: warning: implicit declaration of function 'rte_atomic128_cmp_exchange' is invalid in C99 [-Wimplicit-function-declaration]
                success = rte_atomic128_cmp_exchange(
                          ^
/tmp/FC28_K4.16.3_Clang6.0.1/x86_64-native-linuxapp-clang/8fbd66d0dc7c470ab7257e8d68ce8b2a/dpdk/lib/librte_stack/rte_stack_generic.h:140:20: error: expected expression
                                (rte_int128_t *)&list->head,
                                               ^
/tmp/FC28_K4.16.3_Clang6.0.1/x86_64-native-linuxapp-clang/8fbd66d0dc7c470ab7257e8d68ce8b2a/dpdk/lib/librte_stack/rte_stack_generic.h:140:6: error: use of undeclared identifier 'rte_int128_t'
                                (rte_int128_t *)&list->head,
                                 ^
/tmp/FC28_K4.16.3_Clang6.0.1/x86_64-native-linuxapp-clang/8fbd66d0dc7c470ab7257e8d68ce8b2a/dpdk/lib/librte_stack/rte_stack_generic.h:141:20: error: expected expression
                                (rte_int128_t *)&old_head,
                                               ^
/tmp/FC28_K4.16.3_Clang6.0.1/x86_64-native-linuxapp-clang/8fbd66d0dc7c470ab7257e8d68ce8b2a/dpdk/lib/librte_stack/rte_stack_generic.h:141:6: error: use of undeclared identifier 'rte_int128_t'
                                (rte_int128_t *)&old_head,
                                 ^
  INSTALL-LIB librte_timer.a
/tmp/FC28_K4.16.3_Clang6.0.1/x86_64-native-linuxapp-clang/8fbd66d0dc7c470ab7257e8d68ce8b2a/dpdk/lib/librte_stack/rte_stack_generic.h:142:20: error: expected expression
                                (rte_int128_t *)&new_head,
                                               ^
/tmp/FC28_K4.16.3_Clang6.0.1/x86_64-native-linuxapp-clang/8fbd66d0dc7c470ab7257e8d68ce8b2a/dpdk/lib/librte_stack/rte_stack_generic.h:142:6: error: use of undeclared identifier 'rte_int128_t'
                                (rte_int128_t *)&new_head,
                                 ^
3 warnings and 12 errors generated.
  SYMLINK-FILE include/cmdline_parse_portlist.h
make[5]: *** [/tmp/FC28_K4.16.3_Clang6.0.1/x86_64-native-linuxapp-clang/8fbd66d0dc7c470ab7257e8d68ce8b2a/dpdk/mk/internal/rte.compile-pre.mk:116: rte_stack.o] Error 1
== Build lib/librte_mempool
make[4]: *** [/tmp/FC28_K4.16.3_Clang6.0.1/x86_64-native-linuxapp-clang/8fbd66d0dc7c470ab7257e8d68ce8b2a/dpdk/mk/rte.subdir.mk:35: librte_stack] Error 2
make[4]: *** Waiting for unfinished jobs....

*Failed Build #10:
OS: SUSE15
Target: x86_64-native-linuxapp-gcc
  AR librte_ring.a
  SYMLINK-FILE include/cmdline_vt100.h
In file included from /tmp/SUSE15_K4.12.14_GCC7.3.1/x86_64-native-linuxapp-gcc/8fbd66d0dc7c470ab7257e8d68ce8b2a/dpdk/lib/librte_stack/rte_stack.h:97:0,
                 from /tmp/SUSE15_K4.12.14_GCC7.3.1/x86_64-native-linuxapp-gcc/8fbd66d0dc7c470ab7257e8d68ce8b2a/dpdk/lib/librte_stack/rte_stack.c:16:
/tmp/SUSE15_K4.12.14_GCC7.3.1/x86_64-native-linuxapp-gcc/8fbd66d0dc7c470ab7257e8d68ce8b2a/dpdk/lib/librte_stack/rte_stack_generic.h: In function ‘__rte_stack_lf_push’:
/tmp/SUSE15_K4.12.14_GCC7.3.1/x86_64-native-linuxapp-gcc/8fbd66d0dc7c470ab7257e8d68ce8b2a/dpdk/lib/librte_stack/rte_stack_generic.h:61:13: warning: implicit declaration of function ‘rte_atomic128_cmp_exchange’; did you mean ‘rte_atomic32_exchange’? [-Wimplicit-function-declaration]
   success = rte_atomic128_cmp_exchange(
             ^~~~~~~~~~~~~~~~~~~~~~~~~~
             rte_atomic32_exchange
/tmp/SUSE15_K4.12.14_GCC7.3.1/x86_64-native-linuxapp-gcc/8fbd66d0dc7c470ab7257e8d68ce8b2a/dpdk/lib/librte_stack/rte_stack_generic.h:61:13: warning: nested extern declaration of ‘rte_atomic128_cmp_exchange’ [-Wnested-externs]
/tmp/SUSE15_K4.12.14_GCC7.3.1/x86_64-native-linuxapp-gcc/8fbd66d0dc7c470ab7257e8d68ce8b2a/dpdk/lib/librte_stack/rte_stack_generic.h:62:6: error: ‘rte_int128_t’ undeclared (first use in this function); did you mean ‘__int128_t’?
     (rte_int128_t *)&list->head,
      ^~~~~~~~~~~~
      __int128_t
/tmp/SUSE15_K4.12.14_GCC7.3.1/x86_64-native-linuxapp-gcc/8fbd66d0dc7c470ab7257e8d68ce8b2a/dpdk/lib/librte_stack/rte_stack_generic.h:62:6: note: each undeclared identifier is reported only once for each function it appears in
/tmp/SUSE15_K4.12.14_GCC7.3.1/x86_64-native-linuxapp-gcc/8fbd66d0dc7c470ab7257e8d68ce8b2a/dpdk/lib/librte_stack/rte_stack_generic.h:62:20: error: expected expression before ‘)’ token
     (rte_int128_t *)&list->head,
                    ^
/tmp/SUSE15_K4.12.14_GCC7.3.1/x86_64-native-linuxapp-gcc/8fbd66d0dc7c470ab7257e8d68ce8b2a/dpdk/lib/librte_stack/rte_stack_generic.h:50:28: warning: variable ‘new_head’ set but not used [-Wunused-but-set-variable]
   struct rte_stack_lf_head new_head;
                            ^~~~~~~~
/tmp/SUSE15_K4.12.14_GCC7.3.1/x86_64-native-linuxapp-gcc/8fbd66d0dc7c470ab7257e8d68ce8b2a/dpdk/lib/librte_stack/rte_stack_generic.h: In function ‘__rte_stack_lf_pop’:
/tmp/SUSE15_K4.12.14_GCC7.3.1/x86_64-native-linuxapp-gcc/8fbd66d0dc7c470ab7257e8d68ce8b2a/dpdk/lib/librte_stack/rte_stack_generic.h:140:6: error: ‘rte_int128_t’ undeclared (first use in this function); did you mean ‘__int128_t’?
     (rte_int128_t *)&list->head,
      ^~~~~~~~~~~~
      __int128_t
/tmp/SUSE15_K4.12.14_GCC7.3.1/x86_64-native-linuxapp-gcc/8fbd66d0dc7c470ab7257e8d68ce8b2a/dpdk/lib/librte_stack/rte_stack_generic.h:140:20: error: expected expression before ‘)’ token
     (rte_int128_t *)&list->head,
                    ^
/tmp/SUSE15_K4.12.14_GCC7.3.1/x86_64-native-linuxapp-gcc/8fbd66d0dc7c470ab7257e8d68ce8b2a/dpdk/lib/librte_stack/rte_stack_generic.h:107:28: warning: variable ‘new_head’ set but not used [-Wunused-but-set-variable]
   struct rte_stack_lf_head new_head;
                            ^~~~~~~~
  INSTALL-LIB librte_ring.a
  AR librte_jobstats.a
  INSTALL-LIB librte_jobstats.a

*Failed Build #11:
OS: FreeBSD12.0
Target: x86_64-native-bsdapp-clang
/tmp/FreeBSD12.0_K19.02_Clang6.0.1/x86_64-native-bsdapp-clang/8fbd66d0dc7c470ab7257e8d68ce8b2a/dpdk/lib/librte_stack/rte_stack_generic.h  AR librte_ring.a
  SYMLINK-FILE include/cmdline_parse_num.h
  CC rte_acl.o
  INSTALL-LIB librte_ring.a
:61:13  SYMLINK-FILE include/rte_jobstats.h
: warning: implicit declaration of function 'rte_atomic128_cmp_exchange' is invalid in C99 [-Wimplicit-function-declaration]
  CC acl_bld.o
  SYMLINK-FILE include/cmdline_parse_ipaddr.h
                success = rte_atomic128_cmp_exchange(
                          ^
/tmp/FreeBSD12.0_K19.02_Clang6.0.1/x86_64-native-bsdapp-clang/8fbd66d0dc7c470ab7257e8d68ce8b2a/dpdk/lib/librte_stack/rte_stack_generic.h:61:13: warning: this function declaration is not a prototype [-Wstrict-prototypes]
  CC rte_jobstats.o
  AR librte_meter.a
  AR librte_metrics.a
  INSTALL-LIB librte_metrics.a
  AR librte_pci.a
--
  CC acl_gen.o
  CC acl_run_scalar.o
== Build lib/librte_mempool
  SYMLINK-FILE include/cmdline_parse_string.h
  CC acl_run_sse.o
/tmp/FreeBSD12.0_K19.02_Clang6.0.1/x86_64-native-bsdapp-clang/8fbd66d0dc7c470ab7257e8d68ce8b2a/dpdk/lib/librte_stack/rte_stack_generic.h:62:20: error: expected expression
                                (rte_int128_t *)&list->head,
                                               ^
  SYMLINK-FILE include/cmdline_rdline.h
  SYMLINK-FILE include/cmdline_vt100.h
  CC acl_run_avx2.o
/tmp/FreeBSD12.0_K19.02_Clang6.0.1/x86_64-native-bsdapp-clang/8fbd66d0dc7c470ab7257e8d68ce8b2a/dpdk/lib/librte_stack/rte_stack_generic.h:62:6: error: use of undeclared identifier 'rte_int128_t'
                                (rte_int128_t *)&list->head,
                                 ^
/tmp/FreeBSD12.0_K19.02_Clang6.0.1/x86_64-native-bsdapp-clang/8fbd66d0dc7c470ab7257e8d68ce8b2a/dpdk/lib/librte_stack/rte_stack_generic.h:63:20: error: expected expression
                                (rte_int128_t *)&old_head,
                                               ^
/tmp/FreeBSD12.0_K19.02_Clang6.0.1/x86_64-native-bsdapp-clang/8fbd66d0dc7c470ab7257e8d68ce8b2a/dpdk/lib/librte_stack/rte_stack_generic.h:63:6: error: use of undeclared identifier 'rte_int128_t'
                                (rte_int128_t *)&old_head,
                                 ^
/tmp/FreeBSD12.0_K19.02_Clang6.0.1/x86_64-native-bsdapp-clang/8fbd66d0dc7c470ab7257e8d68ce8b2a/dpdk/lib/librte_stack/rte_stack_generic.h:64:20: error: expected expression
                                (rte_int128_t *)&new_head,
                                               ^
/tmp/FreeBSD12.0_K19.02_Clang6.0.1/x86_64-native-bsdapp-clang/8fbd66d0dc7c470ab7257e8d68ce8b2a/dpdk/lib/librte_stack/rte_stack_generic.h:64:6: error: use of undeclared identifier 'rte_int128_t'
                                (rte_int128_t *)&new_head,
                                 ^
/tmp/FreeBSD12.0_K19.02_Clang6.0.1/x86_64-native-bsdapp-clang/8fbd66d0dc7c470ab7257e8d68ce8b2a/dpdk/lib/librte_stack/rte_stack_generic.h:139:13: warning: implicit declaration of function 'rte_atomic128_cmp_exchange' is invalid in C99 [-Wimplicit-function-declaration]
                success = rte_atomic128_cmp_exchange(
                          ^
/tmp/FreeBSD12.0_K19.02_Clang6.0.1/x86_64-native-bsdapp-clang/8fbd66d0dc7c470ab7257e8d68ce8b2a/dpdk/lib/librte_stack/rte_stack_generic.h:140:20: error: expected expression
                                (rte_int128_t *)&list->head,
                                               ^
/tmp/FreeBSD12.0_K19.02_Clang6.0.1/x86_64-native-bsdapp-clang/8fbd66d0dc7c470ab7257e8d68ce8b2a/dpdk/lib/librte_stack/rte_stack_generic.h:140:6: error: use of undeclared identifier 'rte_int128_t'
                                (rte_int128_t *)&list->head,
                                 ^
/tmp/FreeBSD12.0_K19.02_Clang6.0.1/x86_64-native-bsdapp-clang/8fbd66d0dc7c470ab7257e8d68ce8b2a/dpdk/lib/librte_stack/rte_stack_generic.h:141:20:   SYMLINK-FILE include/cmdline_socket.h
error: expected expression
                                (rte_int128_t *)&old_head,
                                               ^
/tmp/FreeBSD12.0_K19.02_Clang6.0.1/x86_64-native-bsdapp-clang/8fbd66d0dc7c470ab7257e8d68ce8b2a/dpdk/lib/librte_stack/rte_stack_generic.h:141:6: error: use of undeclared identifier 'rte_int128_t'
                                (rte_int128_t *)&old_head,
                                 ^
/tmp/FreeBSD12.0_K19.02_Clang6.0.1/x86_64-native-bsdapp-clang/8fbd66d0dc7c470ab7257e8d68ce8b2a/dpdk/lib/librte_stack/rte_stack_generic.h:142:20: error: expected expression
                                (rte_int128_t *)&new_head,
                                               ^
/tmp/FreeBSD12.0_K19.02_Clang6.0.1/x86_64-native-bsdapp-clang/8fbd66d0dc7c470ab7257e8d68ce8b2a/dpdk/lib/librte_stack/rte_stack_generic.h:142:6: error: use of undeclared identifier 'rte_int128_t'
                                (rte_int128_t *)&new_head,
                                 ^
3 warnings and 12 errors generated.
gmake[5]: *** [/tmp/FreeBSD12.0_K19.02_Clang6.0.1/x86_64-native-bsdapp-clang/8fbd66d0dc7c470ab7257e8d68ce8b2a/dpdk/mk/internal/rte.compile-pre.mk:116: rte_stack.o] Error 1
gmake[4]: *** [/tmp/FreeBSD12.0_K19.02_Clang6.0.1/x86_64-native-bsdapp-clang/8fbd66d0dc7c470ab7257e8d68ce8b2a/dpdk/mk/rte.subdir.mk:37: librte_stack] Error 2
gmake[4]: *** Waiting for unfinished jobs....
  SYMLINK-FILE include/cmdline_cirbuf.h
  SYMLINK-FILE include/cmdline_parse_portlist.h

*Failed Build #12:
OS: FreeBSD11.2
Target: x86_64-native-bsdapp-clang
  INSTALL-LIB librte_metrics.a
  INSTALL-LIB librte_timer.a
In file included from /tmp/FreeBSD11.2_K11.2_Clang6.0.0/x86_64-native-bsdapp-clang/8fbd66d0dc7c470ab7257e8d68ce8b2a/dpdk/lib/librte_stack/rte_stack.c  INSTALL-LIB librte_pci.a
:16:
In file included from /tmp/FreeBSD11.2_K11.2_Clang6.0.0/x86_64-native-bsdapp-clang/8fbd66d0dc7c470ab7257e8d68ce8b2a/dpdk/lib/librte_stack/rte_stack.h:97:
/tmp/FreeBSD11.2_K11.2_Clang6.0.0/x86_64-native-bsdapp-clang/8fbd66d0dc7c470ab7257e8d68ce8b2a/dpdk/lib/librte_stack/rte_stack_generic.h:61:13: warning: implicit declaration of function 'rte_atomic128_cmp_exchange' is invalid in C99 [-Wimplicit-function-declaration]
                success = rte_atomic128_cmp_exchange(
                          ^
/tmp/FreeBSD11.2_K11.2_Clang6.0.0/x86_64-native-bsdapp-clang/8fbd66d0dc7c470ab7257e8d68ce8b2a/dpdk/lib/librte_stack/rte_stack_generic.h:61:13: warning: this function declaration is not a prototype [-Wstrict-prototypes]
  SYMLINK-FILE include/cmdline_parse_ipaddr.h
/tmp/FreeBSD11.2_K11.2_Clang6.0.0/x86_64-native-bsdapp-clang/8fbd66d0dc7c470ab7257e8d68ce8b2a/dpdk/lib/librte_stack/rte_stack_generic.h:62:20: error: expected expression
                                (rte_int128_t *)&list->head,
                                               ^
/tmp/FreeBSD11.2_K11.2_Clang6.0.0/x86_64-native-bsdapp-clang/8fbd66d0dc7c470ab7257e8d68ce8b2a/dpdk/lib/librte_stack/rte_stack_generic.h:62:6: error: use of undeclared identifier 'rte_int128_t'
                                (rte_int128_t *)&list->head,
                                 ^
/tmp/FreeBSD11.2_K11.2_Clang6.0.0/x86_64-native-bsdapp-clang/8fbd66d0dc7c470ab7257e8d68ce8b2a/dpdk/lib/librte_stack/rte_stack_generic.h:63:20: error: expected expression
                                (rte_int128_t *)&old_head,
                                               ^
/tmp/FreeBSD11.2_K11.2_Clang6.0.0/x86_64-native-bsdapp-clang/8fbd66d0dc7c470ab7257e8d68ce8b2a/dpdk/lib/librte_stack/rte_stack_generic.h:63:6: error: use of undeclared identifier 'rte_int128_t'
                                (rte_int128_t *)&old_head,
                                 ^
/tmp/FreeBSD11.2_K11.2_Clang6.0.0/x86_64-native-bsdapp-clang/8fbd66d0dc7c470ab7257e8d68ce8b2a/dpdk/lib/librte_stack/rte_stack_generic.h:64:20: error: expected expression
                                (rte_int128_t *)&new_head,
                                               ^
/tmp/FreeBSD11.2_K11.2_Clang6.0.0/x86_64-native-bsdapp-clang/8fbd66d0dc7c470ab7257e8d68ce8b2a/dpdk/lib/librte_stack/rte_stack_generic.h:64:6: error: use of undeclared identifier 'rte_int128_t'
                                (rte_int128_t *)&new_head,
                                 ^
/tmp/FreeBSD11.2_K11.2_Clang6.0.0/x86_64-native-bsdapp-clang/8fbd66d0dc7c470ab7257e8d68ce8b2a/dpdk/lib/librte_stack/rte_stack_generic.h:139:13: warning: implicit declaration of function 'rte_atomic128_cmp_exchange' is invalid in C99 [-Wimplicit-function-declaration]
                success = rte_atomic128_cmp_exchange(
                          ^
/tmp/FreeBSD11.2_K11.2_Clang6.0.0/x86_64-native-bsdapp-clang/8fbd66d0dc7c470ab7257e8d68ce8b2a/dpdk/lib/librte_stack/rte_stack_generic.h  SYMLINK-FILE include/cmdline_parse_etheraddr.h
:140  CC acl_gen.o
  CC acl_bld.o
:20: error: expected expression
                                (rte_int128_t *)&list->head,
                                               ^
/tmp/FreeBSD11.2_K11.2_Clang6.0.0/x86_64-native-bsdapp-clang/8fbd66d0dc7c470ab7257e8d68ce8b2a/dpdk/lib/librte_stack/rte_stack_generic.h:140:6: error: use of undeclared identifier 'rte_int128_t'
                                (rte_int128_t *)&list->head,
                                 ^
/tmp/FreeBSD11.2_K11.2_Clang6.0.0/x86_64-native-bsdapp-clang/8fbd66d0dc7c470ab7257e8d68ce8b2a/dpdk/lib/librte_stack/rte_stack_generic.h:141:20: error: expected expression
                                (rte_int128_t *)&old_head,
                                               ^
/tmp/FreeBSD11.2_K11.2_Clang6.0.0/x86_64-native-bsdapp-clang/8fbd66d0dc7c470ab7257e8d68ce8b2a/dpdk/lib/librte_stack/rte_stack_generic.h:141:6: error: use of undeclared identifier 'rte_int128_t'
                                (rte_int128_t *)&old_head,
                                 ^
/tmp/FreeBSD11.2_K11.2_Clang6.0.0/x86_64-native-bsdapp-clang/8fbd66d0dc7c470ab7257e8d68ce8b2a/dpdk/lib/librte_stack/rte_stack_generic.h:142:20: error: expected expression
                                (rte_int128_t *)&new_head,
                                               ^
/tmp/FreeBSD11.2_K11.2_Clang6.0.0/x86_64-native-bsdapp-clang/8fbd66d0dc7c470ab7257e8d68ce8b2a/dpdk/lib/librte_stack/rte_stack_generic.h:142:6: error: use of undeclared identifier 'rte_int128_t'
                                (rte_int128_t *)&new_head,
                                 ^
3 warnings and 12 errors generated.
gmake[5]: *** [/tmp/FreeBSD11.2_K11.2_Clang6.0.0/x86_64-native-bsdapp-clang/8fbd66d0dc7c470ab7257e8d68ce8b2a/dpdk/mk/internal/rte.compile-pre.mk:116: rte_stack.o] Error 1
gmake[4]: *** [/tmp/FreeBSD11.2_K11.2_Clang6.0.0/x86_64-native-bsdapp-clang/8fbd66d0dc7c470ab7257e8d68ce8b2a/dpdk/mk/rte.subdir.mk:35: librte_stack] Error 2
gmake[4]: *** Waiting for unfinished jobs....
  CC acl_run_scalar.o
  SYMLINK-FILE include/cmdline_parse_string.h

*Failed Build #13:
OS: FreeBSD11.2
Target: x86_64-native-bsdapp-gcc
  SYMLINK-FILE include/rte_pci.h
  CC rte_pci.o
In file included from /tmp/FreeBSD11.2_K11.2_GCC6.4.0/x86_64-native-bsdapp-gcc/8fbd66d0dc7c470ab7257e8d68ce8b2a/dpdk/lib/librte_stack/rte_stack.h:97:0,
                 from /tmp/FreeBSD11.2_K11.2_GCC6.4.0/x86_64-native-bsdapp-gcc/8fbd66d0dc7c470ab7257e8d68ce8b2a/dpdk/lib/librte_stack/rte_stack.c:16:
/tmp/FreeBSD11.2_K11.2_GCC6.4.0/x86_64-native-bsdapp-gcc/8fbd66d0dc7c470ab7257e8d68ce8b2a/dpdk/lib/librte_stack/rte_stack_generic.h: In function '__rte_stack_lf_push':
/tmp/FreeBSD11.2_K11.2_GCC6.4.0/x86_64-native-bsdapp-gcc/8fbd66d0dc7c470ab7257e8d68ce8b2a/dpdk/lib/librte_stack/rte_stack_generic.h:61:13: warning: implicit declaration of function 'rte_atomic128_cmp_exchange' [-Wimplicit-function-declaration]
   success = rte_atomic128_cmp_exchange(
             ^~~~~~~~~~~~~~~~~~~~~~~~~~
/tmp/FreeBSD11.2_K11.2_GCC6.4.0/x86_64-native-bsdapp-gcc/8fbd66d0dc7c470ab7257e8d68ce8b2a/dpdk/lib/librte_stack/rte_stack_generic.h:61:3: warning: nested extern declaration of 'rte_atomic128_cmp_exchange' [-Wnested-externs]
   success = rte_atomic128_cmp_exchange(
   ^~~~~~~
/tmp/FreeBSD11.2_K11.2_GCC6.4.0/x86_64-native-bsdapp-gcc/8fbd66d0dc7c470ab7257e8d68ce8b2a/dpdk/lib/librte_stack/rte_stack_generic.h:62:6: error: 'rte_int128_t' undeclared (first use in this function)
     (rte_int128_t *)&list->head,
      ^~~~~~~~~~~~
/tmp/FreeBSD11.2_K11.2_GCC6.4.0/x86_64-native-bsdapp-gcc/8fbd66d0dc7c470ab7257e8d68ce8b2a/dpdk/lib/librte_stack/rte_stack_generic.h:62:6: note: each undeclared identifier is reported only once for each function it appears in
/tmp/FreeBSD11.2_K11.2_GCC6.4.0/x86_64-native-bsdapp-gcc/8fbd66d0dc7c470ab7257e8d68ce8b2a/dpdk/lib/librte_stack/rte_stack_generic.h:62:20: error: expected expression before ')' token
     (rte_int128_t *)&list->head,
                    ^
/tmp/FreeBSD11.2_K11.2_GCC6.4.0/x86_64-native-bsdapp-gcc/8fbd66d0dc7c470ab7257e8d68ce8b2a/dpdk/lib/librte_stack/rte_stack_generic.h:50:28: warning: variable 'new_head' set but not used [-Wunused-but-set-variable]
   struct rte_stack_lf_head new_head;
                            ^~~~~~~~
/tmp/FreeBSD11.2_K11.2_GCC6.4.0/x86_64-native-bsdapp-gcc/8fbd66d0dc7c470ab7257e8d68ce8b2a/dpdk/lib/librte_stack/rte_stack_generic.h: In function '__rte_stack_lf_pop':
/tmp/FreeBSD11.2_K11.2_GCC6.4.0/x86_64-native-bsdapp-gcc/8fbd66d0dc7c470ab7257e8d68ce8b2a/dpdk/lib/librte_stack/rte_stack_generic.h:140:6: error: 'rte_int128_t' undeclared (first use in this function)
     (rte_int128_t *)&list->head,
      ^~~~~~~~~~~~
/tmp/FreeBSD11.2_K11.2_GCC6.4.0/x86_64-native-bsdapp-gcc/8fbd66d0dc7c470ab7257e8d68ce8b2a/dpdk/lib/librte_stack/rte_stack_generic.h:140:20: error: expected expression before ')' token
     (rte_int128_t *)&list->head,
                    ^
/tmp/FreeBSD11.2_K11.2_GCC6.4.0/x86_64-native-bsdapp-gcc/8fbd66d0dc7c470ab7257e8d68ce8b2a/dpdk/lib/librte_stack/rte_stack_generic.h:107:28: warning: variable 'new_head' set but not used [-Wunused-but-set-variable]
   struct rte_stack_lf_head new_head;
                            ^~~~~~~~
  SYMLINK-FILE include/rte_ring.h
gmake[5]: *** [/tmp/FreeBSD11.2_K11.2_GCC6.4.0/x86_64-native-bsdapp-gcc/8fbd66d0dc7c470ab7257e8d68ce8b2a/dpdk/mk/internal/rte.compile-pre.mk:116: rte_stack.o] Error 1
gmake[5]: *** Waiting for unfinished jobs....

*Failed Build #14:
OS: FreeBSD12.0
Target: x86_64-native-bsdapp-gcc
  AR librte_pci.a
  INSTALL-LIB librte_pci.a
In file included from /tmp/FreeBSD12.0_K19.02_GCC7.3.0/x86_64-native-bsdapp-gcc/8fbd66d0dc7c470ab7257e8d68ce8b2a/dpdk/lib/librte_stack/rte_stack.h:97:0,
                 from /tmp/FreeBSD12.0_K19.02_GCC7.3.0/x86_64-native-bsdapp-gcc/8fbd66d0dc7c470ab7257e8d68ce8b2a/dpdk/lib/librte_stack/rte_stack.c:16:
/tmp/FreeBSD12.0_K19.02_GCC7.3.0/x86_64-native-bsdapp-gcc/8fbd66d0dc7c470ab7257e8d68ce8b2a/dpdk/lib/librte_stack/rte_stack_generic.h: In function '__rte_stack_lf_push':
/tmp/FreeBSD12.0_K19.02_GCC7.3.0/x86_64-native-bsdapp-gcc/8fbd66d0dc7c470ab7257e8d68ce8b2a/dpdk/lib/librte_stack/rte_stack_generic.h:61:13: warning: implicit declaration of function 'rte_atomic128_cmp_exchange'; did you mean 'rte_atomic32_exchange'? [-Wimplicit-function-declaration]
   success = rte_atomic128_cmp_exchange(
             ^~~~~~~~~~~~~~~~~~~~~~~~~~
             rte_atomic32_exchange
/tmp/FreeBSD12.0_K19.02_GCC7.3.0/x86_64-native-bsdapp-gcc/8fbd66d0dc7c470ab7257e8d68ce8b2a/dpdk/lib/librte_stack/rte_stack_generic.h:61:13: warning: nested extern declaration of 'rte_atomic128_cmp_exchange' [-Wnested-externs]
/tmp/FreeBSD12.0_K19.02_GCC7.3.0/x86_64-native-bsdapp-gcc/8fbd66d0dc7c470ab7257e8d68ce8b2a/dpdk/lib/librte_stack/rte_stack_generic.h:62:6: error: 'rte_int128_t' undeclared (first use in this function); did you mean '__int128_t'?
     (rte_int128_t *)&list->head,
      ^~~~~~~~~~~~
      __int128_t
/tmp/FreeBSD12.0_K19.02_GCC7.3.0/x86_64-native-bsdapp-gcc/8fbd66d0dc7c470ab7257e8d68ce8b2a/dpdk/lib/librte_stack/rte_stack_generic.h:62:6: note: each undeclared identifier is reported only once for each function it appears in
/tmp/FreeBSD12.0_K19.02_GCC7.3.0/x86_64-native-bsdapp-gcc/8fbd66d0dc7c470ab7257e8d68ce8b2a/dpdk/lib/librte_stack/rte_stack_generic.h:62:20: error: expected expression before ')' token
     (rte_int128_t *)&list->head,
                    ^
/tmp/FreeBSD12.0_K19.02_GCC7.3.0/x86_64-native-bsdapp-gcc/8fbd66d0dc7c470ab7257e8d68ce8b2a/dpdk/lib/librte_stack/rte_stack_generic.h:50:28: warning: variable 'new_head' set but not used [-Wunused-but-set-variable]
   struct rte_stack_lf_head new_head;
                            ^~~~~~~~
/tmp/FreeBSD12.0_K19.02_GCC7.3.0/x86_64-native-bsdapp-gcc/8fbd66d0dc7c470ab7257e8d68ce8b2a/dpdk/lib/librte_stack/rte_stack_generic.h: In function '__rte_stack_lf_pop':
/tmp/FreeBSD12.0_K19.02_GCC7.3.0/x86_64-native-bsdapp-gcc/8fbd66d0dc7c470ab7257e8d68ce8b2a/dpdk/lib/librte_stack/rte_stack_generic.h:140:6: error: 'rte_int128_t' undeclared (first use in this function); did you mean '__int128_t'?
     (rte_int128_t *)&list->head,
      ^~~~~~~~~~~~
      __int128_t
/tmp/FreeBSD12.0_K19.02_GCC7.3.0/x86_64-native-bsdapp-gcc/8fbd66d0dc7c470ab7257e8d68ce8b2a/dpdk/lib/librte_stack/rte_stack_generic.h:140:20: error: expected expression before ')' token
     (rte_int128_t *)&list->head,
                    ^
/tmp/FreeBSD12.0_K19.02_GCC7.3.0/x86_64-native-bsdapp-gcc/8fbd66d0dc7c470ab7257e8d68ce8b2a/dpdk/lib/librte_stack/rte_stack_generic.h:107:28: warning: variable 'new_head' set but not used [-Wunused-but-set-variable]
   struct rte_stack_lf_head new_head;
                            ^~~~~~~~
  CC acl_bld.o
gmake[5]: *** [/tmp/FreeBSD12.0_K19.02_GCC7.3.0/x86_64-native-bsdapp-gcc/8fbd66d0dc7c470ab7257e8d68ce8b2a/dpdk/mk/internal/rte.compile-pre.mk:116: rte_stack.o] Error 1
  SYMLINK-FILE include/rte_jobstats.h

*Failed Build #15:
OS: RHEL76
Target: x86_64-native-linuxapp-gcc
  CC acl_run_scalar.o
  CC acl_run_sse.o
In file included from /tmp/RHEL76_K3.10.0_GCC4.8.5/x86_64-native-linuxapp-gcc/8fbd66d0dc7c470ab7257e8d68ce8b2a/dpdk/lib/librte_stack/rte_stack.h:97:0,
                 from /tmp/RHEL76_K3.10.0_GCC4.8.5/x86_64-native-linuxapp-gcc/8fbd66d0dc7c470ab7257e8d68ce8b2a/dpdk/lib/librte_stack/rte_stack.c:16:
/tmp/RHEL76_K3.10.0_GCC4.8.5/x86_64-native-linuxapp-gcc/8fbd66d0dc7c470ab7257e8d68ce8b2a/dpdk/lib/librte_stack/rte_stack_generic.h: In function ‘__rte_stack_lf_push’:
/tmp/RHEL76_K3.10.0_GCC4.8.5/x86_64-native-linuxapp-gcc/8fbd66d0dc7c470ab7257e8d68ce8b2a/dpdk/lib/librte_stack/rte_stack_generic.h:61:3: warning: implicit declaration of function ‘rte_atomic128_cmp_exchange’ [-Wimplicit-function-declaration]
   success = rte_atomic128_cmp_exchange(
   ^
/tmp/RHEL76_K3.10.0_GCC4.8.5/x86_64-native-linuxapp-gcc/8fbd66d0dc7c470ab7257e8d68ce8b2a/dpdk/lib/librte_stack/rte_stack_generic.h:61:3: warning: nested extern declaration of ‘rte_atomic128_cmp_exchange’ [-Wnested-externs]
/tmp/RHEL76_K3.10.0_GCC4.8.5/x86_64-native-linuxapp-gcc/8fbd66d0dc7c470ab7257e8d68ce8b2a/dpdk/lib/librte_stack/rte_stack_generic.h:62:6: error: ‘rte_int128_t’ undeclared (first use in this function)
     (rte_int128_t *)&list->head,
      ^
/tmp/RHEL76_K3.10.0_GCC4.8.5/x86_64-native-linuxapp-gcc/8fbd66d0dc7c470ab7257e8d68ce8b2a/dpdk/lib/librte_stack/rte_stack_generic.h:62:6: note: each undeclared identifier is reported only once for each function it appears in
/tmp/RHEL76_K3.10.0_GCC4.8.5/x86_64-native-linuxapp-gcc/8fbd66d0dc7c470ab7257e8d68ce8b2a/dpdk/lib/librte_stack/rte_stack_generic.h:62:20: error: expected expression before ‘)’ token
     (rte_int128_t *)&list->head,
                    ^
/tmp/RHEL76_K3.10.0_GCC4.8.5/x86_64-native-linuxapp-gcc/8fbd66d0dc7c470ab7257e8d68ce8b2a/dpdk/lib/librte_stack/rte_stack_generic.h:50:28: warning: variable ‘new_head’ set but not used [-Wunused-but-set-variable]
   struct rte_stack_lf_head new_head;
                            ^
/tmp/RHEL76_K3.10.0_GCC4.8.5/x86_64-native-linuxapp-gcc/8fbd66d0dc7c470ab7257e8d68ce8b2a/dpdk/lib/librte_stack/rte_stack_generic.h: In function ‘__rte_stack_lf_pop’:
/tmp/RHEL76_K3.10.0_GCC4.8.5/x86_64-native-linuxapp-gcc/8fbd66d0dc7c470ab7257e8d68ce8b2a/dpdk/lib/librte_stack/rte_stack_generic.h:140:6: error: ‘rte_int128_t’ undeclared (first use in this function)
     (rte_int128_t *)&list->head,
      ^
/tmp/RHEL76_K3.10.0_GCC4.8.5/x86_64-native-linuxapp-gcc/8fbd66d0dc7c470ab7257e8d68ce8b2a/dpdk/lib/librte_stack/rte_stack_generic.h:140:20: error: expected expression before ‘)’ token
     (rte_int128_t *)&list->head,
                    ^
/tmp/RHEL76_K3.10.0_GCC4.8.5/x86_64-native-linuxapp-gcc/8fbd66d0dc7c470ab7257e8d68ce8b2a/dpdk/lib/librte_stack/rte_stack_generic.h:107:28: warning: variable ‘new_head’ set but not used [-Wunused-but-set-variable]
   struct rte_stack_lf_head new_head;
                            ^
make[5]: *** [rte_stack.o] Error 1
make[4]: *** [librte_stack] Error 2
make[4]: *** Waiting for unfinished jobs....

*Failed Build #16:
OS: FC29
Target: x86_64-native-linuxapp-clang
  CC rte_acl.o
  SYMLINK-FILE include/cmdline_parse_etheraddr.h
  SYMLINK-FILE include/cmdline_parse_string.h
In file included from /tmp/FC29_K4.20_Clang6.0.1/x86_64-native-linuxapp-clang/8fbd66d0dc7c470ab7257e8d68ce8b2a/dpdk/lib/librte_stack/rte_stack.c:16:
In file included from /tmp/FC29_K4.20_Clang6.0.1/x86_64-native-linuxapp-clang/8fbd66d0dc7c470ab7257e8d68ce8b2a/dpdk/lib/librte_stack/rte_stack.h:97:
/tmp/FC29_K4.20_Clang6.0.1/x86_64-native-linuxapp-clang/8fbd66d0dc7c470ab7257e8d68ce8b2a/dpdk/lib/librte_stack/rte_stack_generic.h:61:13: warning: implicit declaration of function 'rte_atomic128_cmp_exchange' is invalid in C99 [-Wimplicit-function-declaration]
                success = rte_atomic128_cmp_exchange(
                          ^
/tmp/FC29_K4.20_Clang6.0.1/x86_64-native-linuxapp-clang/8fbd66d0dc7c470ab7257e8d68ce8b2a/dpdk/lib/librte_stack/rte_stack_generic.h:61:13: warning: this function declaration is not a prototype [-Wstrict-prototypes]
/tmp/FC29_K4.20_Clang6.0.1/x86_64-native-linuxapp-clang/8fbd66d0dc7c470ab7257e8d68ce8b2a/dpdk/lib/librte_stack/rte_stack_generic.h:62:20: error: expected expression
                                (rte_int128_t *)&list->head,
                                               ^
/tmp/FC29_K4.20_Clang6.0.1/x86_64-native-linuxapp-clang/8fbd66d0dc7c470ab7257e8d68ce8b2a/dpdk/lib/librte_stack/rte_stack_generic.h:62:6: error: use of undeclared identifier 'rte_int128_t'
                                (rte_int128_t *)&list->head,
                                 ^
/tmp/FC29_K4.20_Clang6.0.1/x86_64-native-linuxapp-clang/8fbd66d0dc7c470ab7257e8d68ce8b2a/dpdk/lib/librte_stack/rte_stack_generic.h:63:20: error: expected expression
                                (rte_int128_t *)&old_head,
                                               ^
/tmp/FC29_K4.20_Clang6.0.1/x86_64-native-linuxapp-clang/8fbd66d0dc7c470ab7257e8d68ce8b2a/dpdk/lib/librte_stack/rte_stack_generic.h:63:6: error: use of undeclared identifier 'rte_int128_t'
                                (rte_int128_t *)&old_head,
                                 ^
/tmp/FC29_K4.20_Clang6.0.1/x86_64-native-linuxapp-clang/8fbd66d0dc7c470ab7257e8d68ce8b2a/dpdk/lib/librte_stack/rte_stack_generic.h:64:20: error: expected expression
                                (rte_int128_t *)&new_head,
                                               ^
/tmp/FC29_K4.20_Clang6.0.1/x86_64-native-linuxapp-clang/8fbd66d0dc7c470ab7257e8d68ce8b2a/dpdk/lib/librte_stack/rte_stack_generic.h:64:6: error: use of undeclared identifier 'rte_int128_t'
                                (rte_int128_t *)&new_head,
                                 ^
/tmp/FC29_K4.20_Clang6.0.1/x86_64-native-linuxapp-clang/8fbd66d0dc7c470ab7257e8d68ce8b2a/dpdk/lib/librte_stack/rte_stack_generic.h:139:13: warning: implicit declaration of function 'rte_atomic128_cmp_exchange' is invalid in C99 [-Wimplicit-function-declaration]
                success = rte_atomic128_cmp_exchange(
                          ^
/tmp/FC29_K4.20_Clang6.0.1/x86_64-native-linuxapp-clang/8fbd66d0dc7c470ab7257e8d68ce8b2a/dpdk/lib/librte_stack/rte_stack_generic.h:140:20: error: expected expression
                                (rte_int128_t *)&list->head,
                                               ^
/tmp/FC29_K4.20_Clang6.0.1/x86_64-native-linuxapp-clang/8fbd66d0dc7c470ab7257e8d68ce8b2a/dpdk/lib/librte_stack/rte_stack_generic.h:140:6: error: use of undeclared identifier 'rte_int128_t'
                                (rte_int128_t *)&list->head,
                                 ^
/tmp/FC29_K4.20_Clang6.0.1/x86_64-native-linuxapp-clang/8fbd66d0dc7c470ab7257e8d68ce8b2a/dpdk/lib/librte_stack/rte_stack_generic.h:141:20: error: expected expression
                                (rte_int128_t *)&old_head,
                                               ^
/tmp/FC29_K4.20_Clang6.0.1/x86_64-native-linuxapp-clang/8fbd66d0dc7c470ab7257e8d68ce8b2a/dpdk/lib/librte_stack/rte_stack_generic.h:141:6: error: use of undeclared identifier 'rte_int128_t'
                                (rte_int128_t *)&old_head,
                                 ^
/tmp/FC29_K4.20_Clang6.0.1/x86_64-native-linuxapp-clang/8fbd66d0dc7c470ab7257e8d68ce8b2a/dpdk/lib/librte_stack/rte_stack_generic.h:142:20: error: expected expression
                                (rte_int128_t *)&new_head,
                                               ^
/tmp/FC29_K4.20_Clang6.0.1/x86_64-native-linuxapp-clang/8fbd66d0dc7c470ab7257e8d68ce8b2a/dpdk/lib/librte_stack/rte_stack_generic.h:142:6: error: use of undeclared identifier 'rte_int128_t'
                                (rte_int128_t *)&new_head,
                                 ^
3 warnings and 12 errors generated.
make[5]: *** [/tmp/FC29_K4.20_Clang6.0.1/x86_64-native-linuxapp-clang/8fbd66d0dc7c470ab7257e8d68ce8b2a/dpdk/mk/internal/rte.compile-pre.mk:116: rte_stack.o] Error 1
  AR librte_ring.a
make[4]: *** [/tmp/FC29_K4.20_Clang6.0.1/x86_64-native-linuxapp-clang/8fbd66d0dc7c470ab7257e8d68ce8b2a/dpdk/mk/rte.subdir.mk:35: librte_stack] Error 2
make[4]: *** Waiting for unfinished jobs....
  SYMLINK-FILE include/cmdline_rdline.h

*Failed Build #17:
OS: FC29
Target: x86_64-native-linuxapp-icc
  CC rte_meter.o
  CC acl_bld.o
  CC acl_gen.o
In file included from /tmp/FC29_K4.20_ICC19.0.0/x86_64-native-linuxapp-icc/8fbd66d0dc7c470ab7257e8d68ce8b2a/dpdk/lib/librte_stack/rte_stack.h(97),
                 from /tmp/FC29_K4.20_ICC19.0.0/x86_64-native-linuxapp-icc/8fbd66d0dc7c470ab7257e8d68ce8b2a/dpdk/lib/librte_stack/rte_stack.c(16):
/tmp/FC29_K4.20_ICC19.0.0/x86_64-native-linuxapp-icc/8fbd66d0dc7c470ab7257e8d68ce8b2a/dpdk/lib/librte_stack/rte_stack_generic.h(61): warning #266: function "rte_atomic128_cmp_exchange" declared implicitly
  		success = rte_atomic128_cmp_exchange(
  		          ^

In file included from /tmp/FC29_K4.20_ICC19.0.0/x86_64-native-linuxapp-icc/8fbd66d0dc7c470ab7257e8d68ce8b2a/dpdk/lib/librte_stack/rte_stack.h(97),
                 from /tmp/FC29_K4.20_ICC19.0.0/x86_64-native-linuxapp-icc/8fbd66d0dc7c470ab7257e8d68ce8b2a/dpdk/lib/librte_stack/rte_stack.c(16):
/tmp/FC29_K4.20_ICC19.0.0/x86_64-native-linuxapp-icc/8fbd66d0dc7c470ab7257e8d68ce8b2a/dpdk/lib/librte_stack/rte_stack_generic.h(62): error: identifier "rte_int128_t" is undefined
  				(rte_int128_t *)&list->head,
  				 ^

In file included from /tmp/FC29_K4.20_ICC19.0.0/x86_64-native-linuxapp-icc/8fbd66d0dc7c470ab7257e8d68ce8b2a/dpdk/lib/librte_stack/rte_stack.h(97),
                 from /tmp/FC29_K4.20_ICC19.0.0/x86_64-native-linuxapp-icc/8fbd66d0dc7c470ab7257e8d68ce8b2a/dpdk/lib/librte_stack/rte_stack.c(16):
/tmp/FC29_K4.20_ICC19.0.0/x86_64-native-linuxapp-icc/8fbd66d0dc7c470ab7257e8d68ce8b2a/dpdk/lib/librte_stack/rte_stack_generic.h(62): error: expected an expression
  				(rte_int128_t *)&list->head,
  				               ^

In file included from /tmp/FC29_K4.20_ICC19.0.0/x86_64-native-linuxapp-icc/8fbd66d0dc7c470ab7257e8d68ce8b2a/dpdk/lib/librte_stack/rte_stack.h(97),
                 from /tmp/FC29_K4.20_ICC19.0.0/x86_64-native-linuxapp-icc/8fbd66d0dc7c470ab7257e8d68ce8b2a/dpdk/lib/librte_stack/rte_stack.c(16):
/tmp/FC29_K4.20_ICC19.0.0/x86_64-native-linuxapp-icc/8fbd66d0dc7c470ab7257e8d68ce8b2a/dpdk/lib/librte_stack/rte_stack_generic.h(62): error: expression must have integral type
  				(rte_int128_t *)&list->head,
  				                 ^

In file included from /tmp/FC29_K4.20_ICC19.0.0/x86_64-native-linuxapp-icc/8fbd66d0dc7c470ab7257e8d68ce8b2a/dpdk/lib/librte_stack/rte_stack.h(97),
                 from /tmp/FC29_K4.20_ICC19.0.0/x86_64-native-linuxapp-icc/8fbd66d0dc7c470ab7257e8d68ce8b2a/dpdk/lib/librte_stack/rte_stack.c(16):
/tmp/FC29_K4.20_ICC19.0.0/x86_64-native-linuxapp-icc/8fbd66d0dc7c470ab7257e8d68ce8b2a/dpdk/lib/librte_stack/rte_stack_generic.h(63): error: expected an expression
  				(rte_int128_t *)&old_head,
  				               ^

In file included from /tmp/FC29_K4.20_ICC19.0.0/x86_64-native-linuxapp-icc/8fbd66d0dc7c470ab7257e8d68ce8b2a/dpdk/lib/librte_stack/rte_stack.h(97),
                 from /tmp/FC29_K4.20_ICC19.0.0/x86_64-native-linuxapp-icc/8fbd66d0dc7c470ab7257e8d68ce8b2a/dpdk/lib/librte_stack/rte_stack.c(16):
/tmp/FC29_K4.20_ICC19.0.0/x86_64-native-linuxapp-icc/8fbd66d0dc7c470ab7257e8d68ce8b2a/dpdk/lib/librte_stack/rte_stack_generic.h(63): error: expression must have integral type
  				(rte_int128_t *)&old_head,
  				                 ^

In file included from /tmp/FC29_K4.20_ICC19.0.0/x86_64-native-linuxapp-icc/8fbd66d0dc7c470ab7257e8d68ce8b2a/dpdk/lib/librte_stack/rte_stack.h(97),
                 from /tmp/FC29_K4.20_ICC19.0.0/x86_64-native-linuxapp-icc/8fbd66d0dc7c470ab7257e8d68ce8b2a/dpdk/lib/librte_stack/rte_stack.c(16):
/tmp/FC29_K4.20_ICC19.0.0/x86_64-native-linuxapp-icc/8fbd66d0dc7c470ab7257e8d68ce8b2a/dpdk/lib/librte_stack/rte_stack_generic.h(64): error: expected an expression
  				(rte_int128_t *)&new_head,
  				               ^

In file included from /tmp/FC29_K4.20_ICC19.0.0/x86_64-native-linuxapp-icc/8fbd66d0dc7c470ab7257e8d68ce8b2a/dpdk/lib/librte_stack/rte_stack.h(97),
                 from /tmp/FC29_K4.20_ICC19.0.0/x86_64-native-linuxapp-icc/8fbd66d0dc7c470ab7257e8d68ce8b2a/dpdk/lib/librte_stack/rte_stack.c(16):
/tmp/FC29_K4.20_ICC19.0.0/x86_64-native-linuxapp-icc/8fbd66d0dc7c470ab7257e8d68ce8b2a/dpdk/lib/librte_stack/rte_stack_generic.h(64): error: expression must have integral type
  				(rte_int128_t *)&new_head,
  				                 ^

In file included from /tmp/FC29_K4.20_ICC19.0.0/x86_64-native-linuxapp-icc/8fbd66d0dc7c470ab7257e8d68ce8b2a/dpdk/lib/librte_stack/rte_stack.h(97),
                 from /tmp/FC29_K4.20_ICC19.0.0/x86_64-native-linuxapp-icc/8fbd66d0dc7c470ab7257e8d68ce8b2a/dpdk/lib/librte_stack/rte_stack.c(16):
/tmp/FC29_K4.20_ICC19.0.0/x86_64-native-linuxapp-icc/8fbd66d0dc7c470ab7257e8d68ce8b2a/dpdk/lib/librte_stack/rte_stack_generic.h(139): warning #266: function "rte_atomic128_cmp_exchange" declared implicitly
  		success = rte_atomic128_cmp_exchange(
  		          ^

In file included from /tmp/FC29_K4.20_ICC19.0.0/x86_64-native-linuxapp-icc/8fbd66d0dc7c470ab7257e8d68ce8b2a/dpdk/lib/librte_stack/rte_stack.h(97),
                 from /tmp/FC29_K4.20_ICC19.0.0/x86_64-native-linuxapp-icc/8fbd66d0dc7c470ab7257e8d68ce8b2a/dpdk/lib/librte_stack/rte_stack.c(16):
/tmp/FC29_K4.20_ICC19.0.0/x86_64-native-linuxapp-icc/8fbd66d0dc7c470ab7257e8d68ce8b2a/dpdk/lib/librte_stack/rte_stack_generic.h(140): error: identifier "rte_int128_t" is undefined
  				(rte_int128_t *)&list->head,
  				 ^

In file included from /tmp/FC29_K4.20_ICC19.0.0/x86_64-native-linuxapp-icc/8fbd66d0dc7c470ab7257e8d68ce8b2a/dpdk/lib/librte_stack/rte_stack.h(97),
                 from /tmp/FC29_K4.20_ICC19.0.0/x86_64-native-linuxapp-icc/8fbd66d0dc7c470ab7257e8d68ce8b2a/dpdk/lib/librte_stack/rte_stack.c(16):
/tmp/FC29_K4.20_ICC19.0.0/x86_64-native-linuxapp-icc/8fbd66d0dc7c470ab7257e8d68ce8b2a/dpdk/lib/librte_stack/rte_stack_generic.h(140): error: expected an expression
  				(rte_int128_t *)&list->head,
  				               ^

In file included from /tmp/FC29_K4.20_ICC19.0.0/x86_64-native-linuxapp-icc/8fbd66d0dc7c470ab7257e8d68ce8b2a/dpdk/lib/librte_stack/rte_stack.h(97),
                 from /tmp/FC29_K4.20_ICC19.0.0/x86_64-native-linuxapp-icc/8fbd66d0dc7c470ab7257e8d68ce8b2a/dpdk/lib/librte_stack/rte_stack.c(16):
/tmp/FC29_K4.20_ICC19.0.0/x86_64-native-linuxapp-icc/8fbd66d0dc7c470ab7257e8d68ce8b2a/dpdk/lib/librte_stack/rte_stack_generic.h(140): error: expression must have integral type
  				(rte_int128_t *)&list->head,
  				                 ^

In file included from /tmp/FC29_K4.20_ICC19.0.0/x86_64-native-linuxapp-icc/8fbd66d0dc7c470ab7257e8d68ce8b2a/dpdk/lib/librte_stack/rte_stack.h(97),
                 from /tmp/FC29_K4.20_ICC19.0.0/x86_64-native-linuxapp-icc/8fbd66d0dc7c470ab7257e8d68ce8b2a/dpdk/lib/librte_stack/rte_stack.c(16):
/tmp/FC29_K4.20_ICC19.0.0/x86_64-native-linuxapp-icc/8fbd66d0dc7c470ab7257e8d68ce8b2a/dpdk/lib/librte_stack/rte_stack_generic.h(141): error: expected an expression
  				(rte_int128_t *)&old_head,
  				               ^

In file included from /tmp/FC29_K4.20_ICC19.0.0/x86_64-native-linuxapp-icc/8fbd66d0dc7c470ab7257e8d68ce8b2a/dpdk/lib/librte_stack/rte_stack.h(97),
                 from /tmp/FC29_K4.20_ICC19.0.0/x86_64-native-linuxapp-icc/8fbd66d0dc7c470ab7257e8d68ce8b2a/dpdk/lib/librte_stack/rte_stack.c(16):
/tmp/FC29_K4.20_ICC19.0.0/x86_64-native-linuxapp-icc/8fbd66d0dc7c470ab7257e8d68ce8b2a/dpdk/lib/librte_stack/rte_stack_generic.h(141): error: expression must have integral type
  				(rte_int128_t *)&old_head,
  				                 ^

In file included from /tmp/FC29_K4.20_ICC19.0.0/x86_64-native-linuxapp-icc/8fbd66d0dc7c470ab7257e8d68ce8b2a/dpdk/lib/librte_stack/rte_stack.h(97),
                 from /tmp/FC29_K4.20_ICC19.0.0/x86_64-native-linuxapp-icc/8fbd66d0dc7c470ab7257e8d68ce8b2a/dpdk/lib/librte_stack/rte_stack.c(16):
/tmp/FC29_K4.20_ICC19.0.0/x86_64-native-linuxapp-icc/8fbd66d0dc7c470ab7257e8d68ce8b2a/dpdk/lib/librte_stack/rte_stack_generic.h(142): error: expected an expression
  				(rte_int128_t *)&new_head,
  				               ^

In file included from /tmp/FC29_K4.20_ICC19.0.0/x86_64-native-linuxapp-icc/8fbd66d0dc7c470ab7257e8d68ce8b2a/dpdk/lib/librte_stack/rte_stack.h(97),
                 from /tmp/FC29_K4.20_ICC19.0.0/x86_64-native-linuxapp-icc/8fbd66d0dc7c470ab7257e8d68ce8b2a/dpdk/lib/librte_stack/rte_stack.c(16):
/tmp/FC29_K4.20_ICC19.0.0/x86_64-native-linuxapp-icc/8fbd66d0dc7c470ab7257e8d68ce8b2a/dpdk/lib/librte_stack/rte_stack_generic.h(142): error: expression must have integral type
  				(rte_int128_t *)&new_head,
  				                 ^

compilation aborted for /tmp/FC29_K4.20_ICC19.0.0/x86_64-native-linuxapp-icc/8fbd66d0dc7c470ab7257e8d68ce8b2a/dpdk/lib/librte_stack/rte_stack.c (code 2)
make[5]: *** [/tmp/FC29_K4.20_ICC19.0.0/x86_64-native-linuxapp-icc/8fbd66d0dc7c470ab7257e8d68ce8b2a/dpdk/mk/internal/rte.compile-pre.mk:116: rte_stack.o] Error 2

*Failed Build #18:
OS: RHEL74
Target: x86_64-native-linuxapp-gcc
== Build lib/librte_power
  CC acl_run_scalar.o
In file included from /tmp/RHEL74_K3.10.0_GCC4.8.5/x86_64-native-linuxapp-gcc/8fbd66d0dc7c470ab7257e8d68ce8b2a/dpdk/lib/librte_stack/rte_stack.h:97:0,
                 from /tmp/RHEL74_K3.10.0_GCC4.8.5/x86_64-native-linuxapp-gcc/8fbd66d0dc7c470ab7257e8d68ce8b2a/dpdk/lib/librte_stack/rte_stack.c:16:
/tmp/RHEL74_K3.10.0_GCC4.8.5/x86_64-native-linuxapp-gcc/8fbd66d0dc7c470ab7257e8d68ce8b2a/dpdk/lib/librte_stack/rte_stack_generic.h: In function ‘__rte_stack_lf_push’:
/tmp/RHEL74_K3.10.0_GCC4.8.5/x86_64-native-linuxapp-gcc/8fbd66d0dc7c470ab7257e8d68ce8b2a/dpdk/lib/librte_stack/rte_stack_generic.h:61:3: warning: implicit declaration of function ‘rte_atomic128_cmp_exchange’ [-Wimplicit-function-declaration]
   success = rte_atomic128_cmp_exchange(
   ^
/tmp/RHEL74_K3.10.0_GCC4.8.5/x86_64-native-linuxapp-gcc/8fbd66d0dc7c470ab7257e8d68ce8b2a/dpdk/lib/librte_stack/rte_stack_generic.h:61:3: warning: nested extern declaration of ‘rte_atomic128_cmp_exchange’ [-Wnested-externs]
/tmp/RHEL74_K3.10.0_GCC4.8.5/x86_64-native-linuxapp-gcc/8fbd66d0dc7c470ab7257e8d68ce8b2a/dpdk/lib/librte_stack/rte_stack_generic.h:62:6: error: ‘rte_int128_t’ undeclared (first use in this function)
     (rte_int128_t *)&list->head,
      ^
/tmp/RHEL74_K3.10.0_GCC4.8.5/x86_64-native-linuxapp-gcc/8fbd66d0dc7c470ab7257e8d68ce8b2a/dpdk/lib/librte_stack/rte_stack_generic.h:62:6: note: each undeclared identifier is reported only once for each function it appears in
/tmp/RHEL74_K3.10.0_GCC4.8.5/x86_64-native-linuxapp-gcc/8fbd66d0dc7c470ab7257e8d68ce8b2a/dpdk/lib/librte_stack/rte_stack_generic.h:62:20: error: expected expression before ‘)’ token
     (rte_int128_t *)&list->head,
                    ^
/tmp/RHEL74_K3.10.0_GCC4.8.5/x86_64-native-linuxapp-gcc/8fbd66d0dc7c470ab7257e8d68ce8b2a/dpdk/lib/librte_stack/rte_stack_generic.h:50:28: warning: variable ‘new_head’ set but not used [-Wunused-but-set-variable]
   struct rte_stack_lf_head new_head;
                            ^
/tmp/RHEL74_K3.10.0_GCC4.8.5/x86_64-native-linuxapp-gcc/8fbd66d0dc7c470ab7257e8d68ce8b2a/dpdk/lib/librte_stack/rte_stack_generic.h: In function ‘__rte_stack_lf_pop’:
/tmp/RHEL74_K3.10.0_GCC4.8.5/x86_64-native-linuxapp-gcc/8fbd66d0dc7c470ab7257e8d68ce8b2a/dpdk/lib/librte_stack/rte_stack_generic.h:140:6: error: ‘rte_int128_t’ undeclared (first use in this function)
     (rte_int128_t *)&list->head,
      ^
/tmp/RHEL74_K3.10.0_GCC4.8.5/x86_64-native-linuxapp-gcc/8fbd66d0dc7c470ab7257e8d68ce8b2a/dpdk/lib/librte_stack/rte_stack_generic.h:140:20: error: expected expression before ‘)’ token
     (rte_int128_t *)&list->head,
                    ^
/tmp/RHEL74_K3.10.0_GCC4.8.5/x86_64-native-linuxapp-gcc/8fbd66d0dc7c470ab7257e8d68ce8b2a/dpdk/lib/librte_stack/rte_stack_generic.h:107:28: warning: variable ‘new_head’ set but not used [-Wunused-but-set-variable]
   struct rte_stack_lf_head new_head;
                            ^
make[5]: *** [rte_stack.o] Error 1
make[4]: *** [librte_stack] Error 2
make[4]: *** Waiting for unfinished jobs....

*Failed Build #19:
OS: CENTOS74
Target: x86_64-native-linuxapp-gcc
  SYMLINK-FILE include/rte_ring.h
  SYMLINK-FILE include/rte_ring_generic.h
In file included from /tmp/CENTOS74_K3.10.0_GCC4.8.5/x86_64-native-linuxapp-gcc/8fbd66d0dc7c470ab7257e8d68ce8b2a/dpdk/lib/librte_stack/rte_stack.h:97:0,
                 from /tmp/CENTOS74_K3.10.0_GCC4.8.5/x86_64-native-linuxapp-gcc/8fbd66d0dc7c470ab7257e8d68ce8b2a/dpdk/lib/librte_stack/rte_stack.c:16:
/tmp/CENTOS74_K3.10.0_GCC4.8.5/x86_64-native-linuxapp-gcc/8fbd66d0dc7c470ab7257e8d68ce8b2a/dpdk/lib/librte_stack/rte_stack_generic.h: In function ‘__rte_stack_lf_push’:
/tmp/CENTOS74_K3.10.0_GCC4.8.5/x86_64-native-linuxapp-gcc/8fbd66d0dc7c470ab7257e8d68ce8b2a/dpdk/lib/librte_stack/rte_stack_generic.h:61:3: warning: implicit declaration of function ‘rte_atomic128_cmp_exchange’ [-Wimplicit-function-declaration]
   success = rte_atomic128_cmp_exchange(
   ^
/tmp/CENTOS74_K3.10.0_GCC4.8.5/x86_64-native-linuxapp-gcc/8fbd66d0dc7c470ab7257e8d68ce8b2a/dpdk/lib/librte_stack/rte_stack_generic.h:61:3: warning: nested extern declaration of ‘rte_atomic128_cmp_exchange’ [-Wnested-externs]
/tmp/CENTOS74_K3.10.0_GCC4.8.5/x86_64-native-linuxapp-gcc/8fbd66d0dc7c470ab7257e8d68ce8b2a/dpdk/lib/librte_stack/rte_stack_generic.h:62:6: error: ‘rte_int128_t’ undeclared (first use in this function)
     (rte_int128_t *)&list->head,
      ^
/tmp/CENTOS74_K3.10.0_GCC4.8.5/x86_64-native-linuxapp-gcc/8fbd66d0dc7c470ab7257e8d68ce8b2a/dpdk/lib/librte_stack/rte_stack_generic.h:62:6: note: each undeclared identifier is reported only once for each function it appears in
/tmp/CENTOS74_K3.10.0_GCC4.8.5/x86_64-native-linuxapp-gcc/8fbd66d0dc7c470ab7257e8d68ce8b2a/dpdk/lib/librte_stack/rte_stack_generic.h:62:20: error: expected expression before ‘)’ token
     (rte_int128_t *)&list->head,
                    ^
/tmp/CENTOS74_K3.10.0_GCC4.8.5/x86_64-native-linuxapp-gcc/8fbd66d0dc7c470ab7257e8d68ce8b2a/dpdk/lib/librte_stack/rte_stack_generic.h:50:28: warning: variable ‘new_head’ set but not used [-Wunused-but-set-variable]
   struct rte_stack_lf_head new_head;
                            ^
/tmp/CENTOS74_K3.10.0_GCC4.8.5/x86_64-native-linuxapp-gcc/8fbd66d0dc7c470ab7257e8d68ce8b2a/dpdk/lib/librte_stack/rte_stack_generic.h: In function ‘__rte_stack_lf_pop’:
/tmp/CENTOS74_K3.10.0_GCC4.8.5/x86_64-native-linuxapp-gcc/8fbd66d0dc7c470ab7257e8d68ce8b2a/dpdk/lib/librte_stack/rte_stack_generic.h:140:6: error: ‘rte_int128_t’ undeclared (first use in this function)
     (rte_int128_t *)&list->head,
      ^
/tmp/CENTOS74_K3.10.0_GCC4.8.5/x86_64-native-linuxapp-gcc/8fbd66d0dc7c470ab7257e8d68ce8b2a/dpdk/lib/librte_stack/rte_stack_generic.h:140:20: error: expected expression before ‘)’ token
     (rte_int128_t *)&list->head,
                    ^
/tmp/CENTOS74_K3.10.0_GCC4.8.5/x86_64-native-linuxapp-gcc/8fbd66d0dc7c470ab7257e8d68ce8b2a/dpdk/lib/librte_stack/rte_stack_generic.h:107:28: warning: variable ‘new_head’ set but not used [-Wunused-but-set-variable]
   struct rte_stack_lf_head new_head;
                            ^
  SYMLINK-FILE include/cmdline_parse_num.h
  SYMLINK-FILE include/rte_ring_c11_mem.h
  SYMLINK-FILE include/rte_acl_osdep.h

*Failed Build #20:
OS: CENTOS75
Target: x86_64-native-linuxapp-gcc
  CC rte_acl.o
  CC rte_jobstats.o
In file included from /tmp/CENTOS75_K3.10.0_GCC4.8.5/x86_64-native-linuxapp-gcc/8fbd66d0dc7c470ab7257e8d68ce8b2a/dpdk/lib/librte_stack/rte_stack.h:97:0,
                 from /tmp/CENTOS75_K3.10.0_GCC4.8.5/x86_64-native-linuxapp-gcc/8fbd66d0dc7c470ab7257e8d68ce8b2a/dpdk/lib/librte_stack/rte_stack.c:16:
/tmp/CENTOS75_K3.10.0_GCC4.8.5/x86_64-native-linuxapp-gcc/8fbd66d0dc7c470ab7257e8d68ce8b2a/dpdk/lib/librte_stack/rte_stack_generic.h: In function ‘__rte_stack_lf_push’:
/tmp/CENTOS75_K3.10.0_GCC4.8.5/x86_64-native-linuxapp-gcc/8fbd66d0dc7c470ab7257e8d68ce8b2a/dpdk/lib/librte_stack/rte_stack_generic.h:61:3: warning: implicit declaration of function ‘rte_atomic128_cmp_exchange’ [-Wimplicit-function-declaration]
   success = rte_atomic128_cmp_exchange(
   ^
/tmp/CENTOS75_K3.10.0_GCC4.8.5/x86_64-native-linuxapp-gcc/8fbd66d0dc7c470ab7257e8d68ce8b2a/dpdk/lib/librte_stack/rte_stack_generic.h:61:3: warning: nested extern declaration of ‘rte_atomic128_cmp_exchange’ [-Wnested-externs]
/tmp/CENTOS75_K3.10.0_GCC4.8.5/x86_64-native-linuxapp-gcc/8fbd66d0dc7c470ab7257e8d68ce8b2a/dpdk/lib/librte_stack/rte_stack_generic.h:62:6: error: ‘rte_int128_t’ undeclared (first use in this function)
     (rte_int128_t *)&list->head,
      ^
/tmp/CENTOS75_K3.10.0_GCC4.8.5/x86_64-native-linuxapp-gcc/8fbd66d0dc7c470ab7257e8d68ce8b2a/dpdk/lib/librte_stack/rte_stack_generic.h:62:6: note: each undeclared identifier is reported only once for each function it appears in
/tmp/CENTOS75_K3.10.0_GCC4.8.5/x86_64-native-linuxapp-gcc/8fbd66d0dc7c470ab7257e8d68ce8b2a/dpdk/lib/librte_stack/rte_stack_generic.h:62:20: error: expected expression before ‘)’ token
     (rte_int128_t *)&list->head,
                    ^
/tmp/CENTOS75_K3.10.0_GCC4.8.5/x86_64-native-linuxapp-gcc/8fbd66d0dc7c470ab7257e8d68ce8b2a/dpdk/lib/librte_stack/rte_stack_generic.h:50:28: warning: variable ‘new_head’ set but not used [-Wunused-but-set-variable]
   struct rte_stack_lf_head new_head;
                            ^
/tmp/CENTOS75_K3.10.0_GCC4.8.5/x86_64-native-linuxapp-gcc/8fbd66d0dc7c470ab7257e8d68ce8b2a/dpdk/lib/librte_stack/rte_stack_generic.h: In function ‘__rte_stack_lf_pop’:
/tmp/CENTOS75_K3.10.0_GCC4.8.5/x86_64-native-linuxapp-gcc/8fbd66d0dc7c470ab7257e8d68ce8b2a/dpdk/lib/librte_stack/rte_stack_generic.h:140:6: error: ‘rte_int128_t’ undeclared (first use in this function)
     (rte_int128_t *)&list->head,
      ^
/tmp/CENTOS75_K3.10.0_GCC4.8.5/x86_64-native-linuxapp-gcc/8fbd66d0dc7c470ab7257e8d68ce8b2a/dpdk/lib/librte_stack/rte_stack_generic.h:140:20: error: expected expression before ‘)’ token
     (rte_int128_t *)&list->head,
                    ^
/tmp/CENTOS75_K3.10.0_GCC4.8.5/x86_64-native-linuxapp-gcc/8fbd66d0dc7c470ab7257e8d68ce8b2a/dpdk/lib/librte_stack/rte_stack_generic.h:107:28: warning: variable ‘new_head’ set but not used [-Wunused-but-set-variable]
   struct rte_stack_lf_head new_head;
                            ^
  INSTALL-LIB librte_pci.a
make[5]: *** [rte_stack.o] Error 1
make[4]: *** [librte_stack] Error 2

*Failed Build #21:
OS: FC28
Target: x86_64-native-linuxapp-icc
  INSTALL-LIB librte_pci.a
== Build lib/librte_hash
  CC acl_run_scalar.o
In file included from /tmp/FC28_K4.16.3_ICC19.0.0/x86_64-native-linuxapp-icc/8fbd66d0dc7c470ab7257e8d68ce8b2a/dpdk/lib/librte_stack/rte_stack.h(97),
                 from /tmp/FC28_K4.16.3_ICC19.0.0/x86_64-native-linuxapp-icc/8fbd66d0dc7c470ab7257e8d68ce8b2a/dpdk/lib/librte_stack/rte_stack.c(16):
/tmp/FC28_K4.16.3_ICC19.0.0/x86_64-native-linuxapp-icc/8fbd66d0dc7c470ab7257e8d68ce8b2a/dpdk/lib/librte_stack/rte_stack_generic.h(61): warning #266: function "rte_atomic128_cmp_exchange" declared implicitly
  		success = rte_atomic128_cmp_exchange(
  		          ^

In file included from /tmp/FC28_K4.16.3_ICC19.0.0/x86_64-native-linuxapp-icc/8fbd66d0dc7c470ab7257e8d68ce8b2a/dpdk/lib/librte_stack/rte_stack.h(97),
                 from /tmp/FC28_K4.16.3_ICC19.0.0/x86_64-native-linuxapp-icc/8fbd66d0dc7c470ab7257e8d68ce8b2a/dpdk/lib/librte_stack/rte_stack.c(16):
/tmp/FC28_K4.16.3_ICC19.0.0/x86_64-native-linuxapp-icc/8fbd66d0dc7c470ab7257e8d68ce8b2a/dpdk/lib/librte_stack/rte_stack_generic.h(62): error: identifier "rte_int128_t" is undefined
  				(rte_int128_t *)&list->head,
  				 ^

In file included from /tmp/FC28_K4.16.3_ICC19.0.0/x86_64-native-linuxapp-icc/8fbd66d0dc7c470ab7257e8d68ce8b2a/dpdk/lib/librte_stack/rte_stack.h(97),
                 from /tmp/FC28_K4.16.3_ICC19.0.0/x86_64-native-linuxapp-icc/8fbd66d0dc7c470ab7257e8d68ce8b2a/dpdk/lib/librte_stack/rte_stack.c(16):
/tmp/FC28_K4.16.3_ICC19.0.0/x86_64-native-linuxapp-icc/8fbd66d0dc7c470ab7257e8d68ce8b2a/dpdk/lib/librte_stack/rte_stack_generic.h(62): error: expected an expression
  				(rte_int128_t *)&list->head,
  				               ^

In file included from /tmp/FC28_K4.16.3_ICC19.0.0/x86_64-native-linuxapp-icc/8fbd66d0dc7c470ab7257e8d68ce8b2a/dpdk/lib/librte_stack/rte_stack.h(97),
                 from /tmp/FC28_K4.16.3_ICC19.0.0/x86_64-native-linuxapp-icc/8fbd66d0dc7c470ab7257e8d68ce8b2a/dpdk/lib/librte_stack/rte_stack.c(16):
/tmp/FC28_K4.16.3_ICC19.0.0/x86_64-native-linuxapp-icc/8fbd66d0dc7c470ab7257e8d68ce8b2a/dpdk/lib/librte_stack/rte_stack_generic.h(62): error: expression must have integral type
  				(rte_int128_t *)&list->head,
  				                 ^

In file included from /tmp/FC28_K4.16.3_ICC19.0.0/x86_64-native-linuxapp-icc/8fbd66d0dc7c470ab7257e8d68ce8b2a/dpdk/lib/librte_stack/rte_stack.h(97),
                 from /tmp/FC28_K4.16.3_ICC19.0.0/x86_64-native-linuxapp-icc/8fbd66d0dc7c470ab7257e8d68ce8b2a/dpdk/lib/librte_stack/rte_stack.c(16):
/tmp/FC28_K4.16.3_ICC19.0.0/x86_64-native-linuxapp-icc/8fbd66d0dc7c470ab7257e8d68ce8b2a/dpdk/lib/librte_stack/rte_stack_generic.h(63): error: expected an expression
  				(rte_int128_t *)&old_head,
  				               ^

In file included from /tmp/FC28_K4.16.3_ICC19.0.0/x86_64-native-linuxapp-icc/8fbd66d0dc7c470ab7257e8d68ce8b2a/dpdk/lib/librte_stack/rte_stack.h(97),
                 from /tmp/FC28_K4.16.3_ICC19.0.0/x86_64-native-linuxapp-icc/8fbd66d0dc7c470ab7257e8d68ce8b2a/dpdk/lib/librte_stack/rte_stack.c(16):
/tmp/FC28_K4.16.3_ICC19.0.0/x86_64-native-linuxapp-icc/8fbd66d0dc7c470ab7257e8d68ce8b2a/dpdk/lib/librte_stack/rte_stack_generic.h(63): error: expression must have integral type
  				(rte_int128_t *)&old_head,
  				                 ^

In file included from /tmp/FC28_K4.16.3_ICC19.0.0/x86_64-native-linuxapp-icc/8fbd66d0dc7c470ab7257e8d68ce8b2a/dpdk/lib/librte_stack/rte_stack.h(97),
                 from /tmp/FC28_K4.16.3_ICC19.0.0/x86_64-native-linuxapp-icc/8fbd66d0dc7c470ab7257e8d68ce8b2a/dpdk/lib/librte_stack/rte_stack.c(16):
/tmp/FC28_K4.16.3_ICC19.0.0/x86_64-native-linuxapp-icc/8fbd66d0dc7c470ab7257e8d68ce8b2a/dpdk/lib/librte_stack/rte_stack_generic.h(64): error: expected an expression
  				(rte_int128_t *)&new_head,
  				               ^

In file included from /tmp/FC28_K4.16.3_ICC19.0.0/x86_64-native-linuxapp-icc/8fbd66d0dc7c470ab7257e8d68ce8b2a/dpdk/lib/librte_stack/rte_stack.h(97),
                 from /tmp/FC28_K4.16.3_ICC19.0.0/x86_64-native-linuxapp-icc/8fbd66d0dc7c470ab7257e8d68ce8b2a/dpdk/lib/librte_stack/rte_stack.c(16):
/tmp/FC28_K4.16.3_ICC19.0.0/x86_64-native-linuxapp-icc/8fbd66d0dc7c470ab7257e8d68ce8b2a/dpdk/lib/librte_stack/rte_stack_generic.h(64): error: expression must have integral type
  				(rte_int128_t *)&new_head,
  				                 ^

In file included from /tmp/FC28_K4.16.3_ICC19.0.0/x86_64-native-linuxapp-icc/8fbd66d0dc7c470ab7257e8d68ce8b2a/dpdk/lib/librte_stack/rte_stack.h(97),
                 from /tmp/FC28_K4.16.3_ICC19.0.0/x86_64-native-linuxapp-icc/8fbd66d0dc7c470ab7257e8d68ce8b2a/dpdk/lib/librte_stack/rte_stack.c(16):
/tmp/FC28_K4.16.3_ICC19.0.0/x86_64-native-linuxapp-icc/8fbd66d0dc7c470ab7257e8d68ce8b2a/dpdk/lib/librte_stack/rte_stack_generic.h(139): warning #266: function "rte_atomic128_cmp_exchange" declared implicitly
  		success = rte_atomic128_cmp_exchange(
  		          ^

In file included from /tmp/FC28_K4.16.3_ICC19.0.0/x86_64-native-linuxapp-icc/8fbd66d0dc7c470ab7257e8d68ce8b2a/dpdk/lib/librte_stack/rte_stack.h(97),
                 from /tmp/FC28_K4.16.3_ICC19.0.0/x86_64-native-linuxapp-icc/8fbd66d0dc7c470ab7257e8d68ce8b2a/dpdk/lib/librte_stack/rte_stack.c(16):
/tmp/FC28_K4.16.3_ICC19.0.0/x86_64-native-linuxapp-icc/8fbd66d0dc7c470ab7257e8d68ce8b2a/dpdk/lib/librte_stack/rte_stack_generic.h(140): error: identifier "rte_int128_t" is undefined
  				(rte_int128_t *)&list->head,
  				 ^

In file included from /tmp/FC28_K4.16.3_ICC19.0.0/x86_64-native-linuxapp-icc/8fbd66d0dc7c470ab7257e8d68ce8b2a/dpdk/lib/librte_stack/rte_stack.h(97),
                 from /tmp/FC28_K4.16.3_ICC19.0.0/x86_64-native-linuxapp-icc/8fbd66d0dc7c470ab7257e8d68ce8b2a/dpdk/lib/librte_stack/rte_stack.c(16):
/tmp/FC28_K4.16.3_ICC19.0.0/x86_64-native-linuxapp-icc/8fbd66d0dc7c470ab7257e8d68ce8b2a/dpdk/lib/librte_stack/rte_stack_generic.h(140): error: expected an expression
  				(rte_int128_t *)&list->head,
  				               ^

In file included from /tmp/FC28_K4.16.3_ICC19.0.0/x86_64-native-linuxapp-icc/8fbd66d0dc7c470ab7257e8d68ce8b2a/dpdk/lib/librte_stack/rte_stack.h(97),
                 from /tmp/FC28_K4.16.3_ICC19.0.0/x86_64-native-linuxapp-icc/8fbd66d0dc7c470ab7257e8d68ce8b2a/dpdk/lib/librte_stack/rte_stack.c(16):
/tmp/FC28_K4.16.3_ICC19.0.0/x86_64-native-linuxapp-icc/8fbd66d0dc7c470ab7257e8d68ce8b2a/dpdk/lib/librte_stack/rte_stack_generic.h(140): error: expression must have integral type
  				(rte_int128_t *)&list->head,
  				                 ^

In file included from /tmp/FC28_K4.16.3_ICC19.0.0/x86_64-native-linuxapp-icc/8fbd66d0dc7c470ab7257e8d68ce8b2a/dpdk/lib/librte_stack/rte_stack.h(97),
                 from /tmp/FC28_K4.16.3_ICC19.0.0/x86_64-native-linuxapp-icc/8fbd66d0dc7c470ab7257e8d68ce8b2a/dpdk/lib/librte_stack/rte_stack.c(16):
/tmp/FC28_K4.16.3_ICC19.0.0/x86_64-native-linuxapp-icc/8fbd66d0dc7c470ab7257e8d68ce8b2a/dpdk/lib/librte_stack/rte_stack_generic.h(141): error: expected an expression
  				(rte_int128_t *)&old_head,
  				               ^

In file included from /tmp/FC28_K4.16.3_ICC19.0.0/x86_64-native-linuxapp-icc/8fbd66d0dc7c470ab7257e8d68ce8b2a/dpdk/lib/librte_stack/rte_stack.h(97),
                 from /tmp/FC28_K4.16.3_ICC19.0.0/x86_64-native-linuxapp-icc/8fbd66d0dc7c470ab7257e8d68ce8b2a/dpdk/lib/librte_stack/rte_stack.c(16):
/tmp/FC28_K4.16.3_ICC19.0.0/x86_64-native-linuxapp-icc/8fbd66d0dc7c470ab7257e8d68ce8b2a/dpdk/lib/librte_stack/rte_stack_generic.h(141): error: expression must have integral type
  				(rte_int128_t *)&old_head,
  				                 ^

In file included from /tmp/FC28_K4.16.3_ICC19.0.0/x86_64-native-linuxapp-icc/8fbd66d0dc7c470ab7257e8d68ce8b2a/dpdk/lib/librte_stack/rte_stack.h(97),
                 from /tmp/FC28_K4.16.3_ICC19.0.0/x86_64-native-linuxapp-icc/8fbd66d0dc7c470ab7257e8d68ce8b2a/dpdk/lib/librte_stack/rte_stack.c(16):
/tmp/FC28_K4.16.3_ICC19.0.0/x86_64-native-linuxapp-icc/8fbd66d0dc7c470ab7257e8d68ce8b2a/dpdk/lib/librte_stack/rte_stack_generic.h(142): error: expected an expression
  				(rte_int128_t *)&new_head,
  				               ^

In file included from /tmp/FC28_K4.16.3_ICC19.0.0/x86_64-native-linuxapp-icc/8fbd66d0dc7c470ab7257e8d68ce8b2a/dpdk/lib/librte_stack/rte_stack.h(97),
                 from /tmp/FC28_K4.16.3_ICC19.0.0/x86_64-native-linuxapp-icc/8fbd66d0dc7c470ab7257e8d68ce8b2a/dpdk/lib/librte_stack/rte_stack.c(16):
/tmp/FC28_K4.16.3_ICC19.0.0/x86_64-native-linuxapp-icc/8fbd66d0dc7c470ab7257e8d68ce8b2a/dpdk/lib/librte_stack/rte_stack_generic.h(142): error: expression must have integral type
  				(rte_int128_t *)&new_head,
  				                 ^

compilation aborted for /tmp/FC28_K4.16.3_ICC19.0.0/x86_64-native-linuxapp-icc/8fbd66d0dc7c470ab7257e8d68ce8b2a/dpdk/lib/librte_stack/rte_stack.c (code 2)
make[5]: *** [/tmp/FC28_K4.16.3_ICC19.0.0/x86_64-native-linuxapp-icc/8fbd66d0dc7c470ab7257e8d68ce8b2a/dpdk/mk/internal/rte.compile-pre.mk:116: rte_stack.o] Error 2

*Failed Build #22:
OS: SUSE12
Target: x86_64-native-linuxapp-gcc
  SYMLINK-FILE include/cmdline_parse_ipaddr.h
  SYMLINK-FILE include/cmdline_parse_etheraddr.h
In file included from /tmp/SUSE12_K3.7.10_GCC4.7.2/x86_64-native-linuxapp-gcc/8fbd66d0dc7c470ab7257e8d68ce8b2a/dpdk/lib/librte_stack/rte_stack.h:97:0,
                 from /tmp/SUSE12_K3.7.10_GCC4.7.2/x86_64-native-linuxapp-gcc/8fbd66d0dc7c470ab7257e8d68ce8b2a/dpdk/lib/librte_stack/rte_stack.c:16:
/tmp/SUSE12_K3.7.10_GCC4.7.2/x86_64-native-linuxapp-gcc/8fbd66d0dc7c470ab7257e8d68ce8b2a/dpdk/lib/librte_stack/rte_stack_generic.h: In function ‘__rte_stack_lf_push’:
/tmp/SUSE12_K3.7.10_GCC4.7.2/x86_64-native-linuxapp-gcc/8fbd66d0dc7c470ab7257e8d68ce8b2a/dpdk/lib/librte_stack/rte_stack_generic.h:61:13: warning: implicit declaration of function ‘rte_atomic128_cmp_exchange’; did you mean ‘rte_atomic32_exchange’? [-Wimplicit-function-declaration]
   success = rte_atomic128_cmp_exchange(
             ^~~~~~~~~~~~~~~~~~~~~~~~~~
             rte_atomic32_exchange
/tmp/SUSE12_K3.7.10_GCC4.7.2/x86_64-native-linuxapp-gcc/8fbd66d0dc7c470ab7257e8d68ce8b2a/dpdk/lib/librte_stack/rte_stack_generic.h:61:13: warning: nested extern declaration of ‘rte_atomic128_cmp_exchange’ [-Wnested-externs]
/tmp/SUSE12_K3.7.10_GCC4.7.2/x86_64-native-linuxapp-gcc/8fbd66d0dc7c470ab7257e8d68ce8b2a/dpdk/lib/librte_stack/rte_stack_generic.h:62:6: error: ‘rte_int128_t’ undeclared (first use in this function); did you mean ‘__int128_t’?
     (rte_int128_t *)&list->head,
      ^~~~~~~~~~~~
      __int128_t
/tmp/SUSE12_K3.7.10_GCC4.7.2/x86_64-native-linuxapp-gcc/8fbd66d0dc7c470ab7257e8d68ce8b2a/dpdk/lib/librte_stack/rte_stack_generic.h:62:6: note: each undeclared identifier is reported only once for each function it appears in
/tmp/SUSE12_K3.7.10_GCC4.7.2/x86_64-native-linuxapp-gcc/8fbd66d0dc7c470ab7257e8d68ce8b2a/dpdk/lib/librte_stack/rte_stack_generic.h:62:20: error: expected expression before ‘)’ token
     (rte_int128_t *)&list->head,
                    ^
/tmp/SUSE12_K3.7.10_GCC4.7.2/x86_64-native-linuxapp-gcc/8fbd66d0dc7c470ab7257e8d68ce8b2a/dpdk/lib/librte_stack/rte_stack_generic.h:50:28: warning: variable ‘new_head’ set but not used [-Wunused-but-set-variable]
   struct rte_stack_lf_head new_head;
                            ^~~~~~~~
/tmp/SUSE12_K3.7.10_GCC4.7.2/x86_64-native-linuxapp-gcc/8fbd66d0dc7c470ab7257e8d68ce8b2a/dpdk/lib/librte_stack/rte_stack_generic.h: In function ‘__rte_stack_lf_pop’:
/tmp/SUSE12_K3.7.10_GCC4.7.2/x86_64-native-linuxapp-gcc/8fbd66d0dc7c470ab7257e8d68ce8b2a/dpdk/lib/librte_stack/rte_stack_generic.h:140:6: error: ‘rte_int128_t’ undeclared (first use in this function); did you mean ‘__int128_t’?
     (rte_int128_t *)&list->head,
      ^~~~~~~~~~~~
      __int128_t
/tmp/SUSE12_K3.7.10_GCC4.7.2/x86_64-native-linuxapp-gcc/8fbd66d0dc7c470ab7257e8d68ce8b2a/dpdk/lib/librte_stack/rte_stack_generic.h:140:20: error: expected expression before ‘)’ token
     (rte_int128_t *)&list->head,
                    ^
/tmp/SUSE12_K3.7.10_GCC4.7.2/x86_64-native-linuxapp-gcc/8fbd66d0dc7c470ab7257e8d68ce8b2a/dpdk/lib/librte_stack/rte_stack_generic.h:107:28: warning: variable ‘new_head’ set but not used [-Wunused-but-set-variable]
   struct rte_stack_lf_head new_head;
                            ^~~~~~~~
  SYMLINK-FILE include/cmdline_parse_string.h
/tmp/SUSE12_K3.7.10_GCC4.7.2/x86_64-native-linuxapp-gcc/8fbd66d0dc7c470ab7257e8d68ce8b2a/dpdk/mk/internal/rte.compile-pre.mk:114: recipe for target 'rte_stack.o' failed
make[5]: *** [rte_stack.o] Error 1
/tmp/SUSE12_K3.7.10_GCC4.7.2/x86_64-native-linuxapp-gcc/8fbd66d0dc7c470ab7257e8d68ce8b2a/dpdk/mk/rte.subdir.mk:35: recipe for target 'librte_stack' failed
make[4]: *** [librte_stack] Error 2
make[4]: *** Waiting for unfinished jobs....
  SYMLINK-FILE include/cmdline_rdline.h
  SYMLINK-FILE include/cmdline_vt100.h
  AR librte_metrics.a
--
  CC acl_run_sse.o
  AR librte_cmdline.a
  INSTALL-LIB librte_cmdline.a
  AR librte_acl.a
  INSTALL-LIB librte_acl.a
/tmp/SUSE12_K3.7.10_GCC4.7.2/x86_64-native-linuxapp-gcc/8fbd66d0dc7c470ab7257e8d68ce8b2a/dpdk/mk/rte.sdkbuild.mk:49: recipe for target 'lib' failed
make[3]: *** [lib] Error 2
/tmp/SUSE12_K3.7.10_GCC4.7.2/x86_64-native-linuxapp-gcc/8fbd66d0dc7c470ab7257e8d68ce8b2a/dpdk/mk/rte.sdkroot.mk:100: recipe for target 'all' failed
make[2]: *** [all] Error 2
/tmp/SUSE12_K3.7.10_GCC4.7.2/x86_64-native-linuxapp-gcc/8fbd66d0dc7c470ab7257e8d68ce8b2a/dpdk/mk/rte.sdkinstall.mk:57: recipe for target 'pre_install' failed
make[1]: *** [pre_install] Error 2
/tmp/SUSE12_K3.7.10_GCC4.7.2/x86_64-native-linuxapp-gcc/8fbd66d0dc7c470ab7257e8d68ce8b2a/dpdk/mk/rte.sdkroot.mk:79: recipe for target 'install' failed
make: *** [install] Error 2

*Failed Build #23:
OS: CENTOS76
Target: x86_64-native-linuxapp-gcc
  CC rte_pci.o
  SYMLINK-FILE include/rte_acl.h
In file included from /tmp/CENTOS76_K3.10.0_GCC4.8.5/x86_64-native-linuxapp-gcc/8fbd66d0dc7c470ab7257e8d68ce8b2a/dpdk/lib/librte_stack/rte_stack.h:97:0,
                 from /tmp/CENTOS76_K3.10.0_GCC4.8.5/x86_64-native-linuxapp-gcc/8fbd66d0dc7c470ab7257e8d68ce8b2a/dpdk/lib/librte_stack/rte_stack.c:16:
/tmp/CENTOS76_K3.10.0_GCC4.8.5/x86_64-native-linuxapp-gcc/8fbd66d0dc7c470ab7257e8d68ce8b2a/dpdk/lib/librte_stack/rte_stack_generic.h: In function ‘__rte_stack_lf_push’:
/tmp/CENTOS76_K3.10.0_GCC4.8.5/x86_64-native-linuxapp-gcc/8fbd66d0dc7c470ab7257e8d68ce8b2a/dpdk/lib/librte_stack/rte_stack_generic.h:61:3: warning: implicit declaration of function ‘rte_atomic128_cmp_exchange’ [-Wimplicit-function-declaration]
   success = rte_atomic128_cmp_exchange(
   ^
/tmp/CENTOS76_K3.10.0_GCC4.8.5/x86_64-native-linuxapp-gcc/8fbd66d0dc7c470ab7257e8d68ce8b2a/dpdk/lib/librte_stack/rte_stack_generic.h:61:3: warning: nested extern declaration of ‘rte_atomic128_cmp_exchange’ [-Wnested-externs]
/tmp/CENTOS76_K3.10.0_GCC4.8.5/x86_64-native-linuxapp-gcc/8fbd66d0dc7c470ab7257e8d68ce8b2a/dpdk/lib/librte_stack/rte_stack_generic.h:62:6: error: ‘rte_int128_t’ undeclared (first use in this function)
     (rte_int128_t *)&list->head,
      ^
/tmp/CENTOS76_K3.10.0_GCC4.8.5/x86_64-native-linuxapp-gcc/8fbd66d0dc7c470ab7257e8d68ce8b2a/dpdk/lib/librte_stack/rte_stack_generic.h:62:6: note: each undeclared identifier is reported only once for each function it appears in
/tmp/CENTOS76_K3.10.0_GCC4.8.5/x86_64-native-linuxapp-gcc/8fbd66d0dc7c470ab7257e8d68ce8b2a/dpdk/lib/librte_stack/rte_stack_generic.h:62:20: error: expected expression before ‘)’ token
     (rte_int128_t *)&list->head,
                    ^
/tmp/CENTOS76_K3.10.0_GCC4.8.5/x86_64-native-linuxapp-gcc/8fbd66d0dc7c470ab7257e8d68ce8b2a/dpdk/lib/librte_stack/rte_stack_generic.h:50:28: warning: variable ‘new_head’ set but not used [-Wunused-but-set-variable]
   struct rte_stack_lf_head new_head;
                            ^
/tmp/CENTOS76_K3.10.0_GCC4.8.5/x86_64-native-linuxapp-gcc/8fbd66d0dc7c470ab7257e8d68ce8b2a/dpdk/lib/librte_stack/rte_stack_generic.h: In function ‘__rte_stack_lf_pop’:
/tmp/CENTOS76_K3.10.0_GCC4.8.5/x86_64-native-linuxapp-gcc/8fbd66d0dc7c470ab7257e8d68ce8b2a/dpdk/lib/librte_stack/rte_stack_generic.h:140:6: error: ‘rte_int128_t’ undeclared (first use in this function)
     (rte_int128_t *)&list->head,
      ^
/tmp/CENTOS76_K3.10.0_GCC4.8.5/x86_64-native-linuxapp-gcc/8fbd66d0dc7c470ab7257e8d68ce8b2a/dpdk/lib/librte_stack/rte_stack_generic.h:140:20: error: expected expression before ‘)’ token
     (rte_int128_t *)&list->head,
                    ^
/tmp/CENTOS76_K3.10.0_GCC4.8.5/x86_64-native-linuxapp-gcc/8fbd66d0dc7c470ab7257e8d68ce8b2a/dpdk/lib/librte_stack/rte_stack_generic.h:107:28: warning: variable ‘new_head’ set but not used [-Wunused-but-set-variable]
   struct rte_stack_lf_head new_head;
                            ^
  CC rte_metrics.o
make[5]: *** [rte_stack.o] Error 1
make[4]: *** [librte_stack] Error 2

DPDK STV team


More information about the test-report mailing list