[dpdk-test-report] |FAILURE| pw50960[v4] net/nfb: new netcope driver

sys_stv at intel.com sys_stv at intel.com
Fri Mar 8 05:50:05 CET 2019


Test-Label: Intel-compilation
Test-Status: FAILURE
http://dpdk.org/patch/50960

_Compilation issues_

Submitter: Rastislav Cernay <cernay at netcope.com>
Date: 2019-03-07 13:24:53
Reply_mail: 1551965093-273264-1-git-send-email-cernay at netcope.com
DPDK git baseline: Repo:dpdk-master, CommitID: 1598c729595d8d59ebb9dce190401846da16c09c

Build Summary: 25 Builds Done, 24 Successful, 1 Failures

Test environment and configuration as below:

OS: SUSE15
	Kernel Version: 4.12.14-lp150.12.22-default
	CPU info: Intel(R) Xeon(R) CPU E5-2699 v3 @ 2.30GHz
	GCC Version: gcc (SUSE Linux) 7.3.1 20180323 [gcc-7-branch revision 258812]
	Clang Version: 5.0.1 (tags/RELEASE_501/final 312548)
	x86_64-native-linuxapp-gcc

OS: CENTOS76
	Kernel Version: 3.10.0-957.5.1.el7.x86_64
	CPU info: Intel(R) Xeon(R) CPU E5-2699 v4 @ 2.20GHz
	GCC Version: gcc (GCC) 4.8.5 20150623 (Red Hat 4.8.5-36)
	Clang Version: NA
	x86_64-native-linuxapp-gcc

OS: UBT144-32
	Kernel Version: 3.13.0-161-generic
	CPU info: Intel(R) Xeon(R) CPU E5-2699 v3 @ 2.30GHz
	GCC Version: gcc (Ubuntu 4.8.4-2ubuntu1~14.04.4) 4.8.4
	Clang Version: NA
	i686-native-linuxapp-gcc

OS: SUSE12
	Kernel Version: 4.4.73-5-default
	CPU info: Intel(R) Xeon(R) CPU E5-2699 v4 @ 2.20GHz
	GCC Version: gcc (SUSE Linux) 7.1.1 20170607 [gcc-7-branch revision 248970]
	Clang Version: NA
	x86_64-native-linuxapp-gcc

OS: FreeBSD12.0
	Kernel Version: 12.0-RC3
	CPU info: Intel(R) Xeon(R) CPU E5-2699 v3 @ 2.30GHz (2294.76-MHz K8-class CPU)
	GCC Version: gcc (FreeBSD Ports Collection) 7.3.0
	Clang Version: 6.0.1 (tags/RELEASE_601/final 335540) (based on LLVM 6.0.1)
	x86_64-native-bsdapp-clang
	x86_64-native-bsdapp-gcc

OS: UBT144-64
	Kernel Version: 4.2.0-27-generic
	CPU info: Intel(R) Xeon(R) CPU E5-2699 v3 @ 2.30GHz
	GCC Version: gcc (Ubuntu 4.8.4-2ubuntu1~14.04.4) 4.8.4
	Clang Version: NA
	x86_64-native-linuxapp-gcc

OS: CENTOS75
	Kernel Version: 3.10.0-957.5.1.el7.x86_64
	CPU info: Intel(R) Xeon(R) CPU E5-2699 v4 @ 2.20GHz
	GCC Version: gcc (GCC) 4.8.5 20150623 (Red Hat 4.8.5-36)
	Clang Version: 3.4.2 (tags/RELEASE_34/dot2-final)
	x86_64-native-linuxapp-gcc

OS: UBT1804
	Kernel Version: 4.15.0-20-generic
	CPU info: Intel(R) Xeon(R) CPU E5-2699 v3 @ 2.30GHz
	GCC Version: gcc (Ubuntu 7.3.0-27ubuntu1~18.04) 7.3.0
	Clang Version: NA
	x86_64-native-linuxapp-clang
	x86_64-native-linuxapp-gcc
	x86_64-native-linuxapp-icc

OS: UBT1810
	Kernel Version: 4.18.0-10-generic
	CPU info: Intel(R) Xeon(R) CPU E5-2699 v3 @ 2.30GHz
	GCC Version: gcc (Ubuntu 8.2.0-7ubuntu1) 8.2.0
	Clang Version: NA
	x86_64-native-linuxapp-gcc

OS: RHEL74
	Kernel Version: 3.10.0-693.el7.x86_64
	CPU info: Intel(R) Xeon(R) CPU E5-2699 v4 @ 2.20GHz
	GCC Version: gcc (GCC) 4.8.5 20150623 (Red Hat 4.8.5-16)
	Clang Version: NA
	x86_64-native-linuxapp-gcc

OS: CENTOS74
	Kernel Version: 3.10.0-862.14.4.el7.x86_64
	CPU info: Intel(R) Xeon(R) CPU E5-2699 v4 @ 2.20GHz
	GCC Version: gcc (GCC) 4.8.5 20150623 (Red Hat 4.8.5-28)
	Clang Version: 3.4.2 (tags/RELEASE_34/dot2-final)
	x86_64-native-linuxapp-gcc

OS: FreeBSD11.2
	Kernel Version: 11.2-RELEASE
	CPU info: Intel(R) Xeon(R) CPU E5-2699 v3 @ 2.30GHz (2294.74-MHz K8-class CPU)
	GCC Version: gcc (FreeBSD Ports Collection) 6.4.0
	Clang Version: 6.0.0 (tags/RELEASE_600/final 326565) (based on LLVM 6.0.0)
	x86_64-native-bsdapp-gcc
	x86_64-native-bsdapp-clang

OS: UBT164-64
	Kernel Version: 4.4.0-47-generic
	CPU info: Intel(R) Xeon(R) CPU E5-2699 v3 @ 2.30GHz
	GCC Version: gcc (Ubuntu 5.4.0-6ubuntu1~16.04.10) 5.4.0 20160609
	Clang Version: 3.8.0-2ubuntu4 (tags/RELEASE_380/final)
	x86_64-native-linuxapp-gcc

OS: FC28
	Kernel Version: 4.16.3-301.fc28.x86_64
	CPU info: Intel(R) Xeon(R) CPU E5-2699 v4 @ 2.20GHz
	GCC Version: gcc (GCC) 8.1.1 20180712 (Red Hat 8.1.1-5)
	Clang Version: NA
	x86_64-native-linuxapp-gcc
	x86_64-native-linuxapp-clang
	x86_64-native-linuxapp-icc

OS: RHEL76
	Kernel Version: 3.10.0-957.el7.x86_64
	CPU info: Intel(R) Xeon(R) CPU E5-2699 v4 @ 2.20GHz
	GCC Version: gcc (GCC) 4.8.5 20150623 (Red Hat 4.8.5-36)
	Clang Version: NA
	x86_64-native-linuxapp-gcc

OS: FC29
	Kernel Version: 4.18.16-300.fc29.x86_64
	CPU info: Intel(R) Xeon(R) CPU E5-2699 v4 @ 2.20GHz
	GCC Version: gcc (GCC) 8.2.1 20181215 (Red Hat 8.2.1-6)
	Clang Version: NA
	x86_64-native-linuxapp-gcc
	x86_64-native-linuxapp-clang
	x86_64-native-linuxapp-icc

OS: RHEL75
	Kernel Version: 3.10.0-862.el7.x86_64
	CPU info: Intel(R) Xeon(R) CPU E5-2699 v4 @ 2.20GHz
	GCC Version: gcc (GCC) 4.8.5 20150623 (Red Hat 4.8.5-28)
	Clang Version: NA
	x86_64-native-linuxapp-gcc

*Failed Build #1:
OS: FreeBSD11.2
Target: x86_64-native-bsdapp-gcc



gmake[3]: Warning: File '/tmp/FreeBSD11.2_K11.2_GCC6.4.0/x86_64-native-bsdapp-gcc/6823d36361904fa98c20e89113cabec7/dpdk/mk/rte.sdkconfig.mk' has modification time 16441 s in the future
Configuration done using x86_64-native-bsdapp-gcc
gmake[3]: warning:  Clock skew detected.  Your build may be incomplete.
gmake[3]: Warning: File '/tmp/FreeBSD11.2_K11.2_GCC6.4.0/x86_64-native-bsdapp-gcc/6823d36361904fa98c20e89113cabec7/dpdk/mk/rte.sdkconfig.mk' has modification time 16440 s in the future
gmake[4]: Warning: File '/tmp/FreeBSD11.2_K11.2_GCC6.4.0/x86_64-native-bsdapp-gcc/6823d36361904fa98c20e89113cabec7/dpdk/mk/rte.sdkconfig.mk' has modification time 16440 s in the future
gmake[4]: warning:  Clock skew detected.  Your build may be incomplete.
gmake[3]: warning:  Clock skew detected.  Your build may be incomplete.
== Build lib
== Build lib/librte_cfgfile
== Build lib/librte_kvargs
  SYMLINK-FILE include/rte_cfgfile.h
  CC rte_cfgfile.o
--
  SYMLINK-FILE include/generic/rte_cpuflags.h
  SYMLINK-FILE include/generic/rte_rwlock.h
  SYMLINK-FILE include/generic/rte_vect.h
  SYMLINK-FILE include/generic/rte_pause.h
  SYMLINK-FILE include/generic/rte_io.h
gmake[6]: warning:  Clock skew detected.  Your build may be incomplete.
== Build lib/librte_eal/bsdapp
== Build lib/librte_eal/bsdapp/eal
  CC eal.o
  CC eal_memory.o
  CC eal_cpuflags.o
--
  CC rte_flow.o
  CC rte_tm.o
  CC ethdev_profile.o
  CC rte_mtr.o
In file included from /tmp/FreeBSD11.2_K11.2_GCC6.4.0/x86_64-native-bsdapp-gcc/6823d36361904fa98c20e89113cabec7/dpdk/lib/librte_ethdev/rte_flow.c:15:0:
/tmp/FreeBSD11.2_K11.2_GCC6.4.0/x86_64-native-bsdapp-gcc/6823d36361904fa98c20e89113cabec7/dpdk/lib/librte_ethdev/rte_ethdev.h:3779:29: fatal error: rte_ethdev_core.h: No such file or directory
 #include <rte_ethdev_core.h>
                             ^
compilation terminated.
gmake[5]: *** [/tmp/FreeBSD11.2_K11.2_GCC6.4.0/x86_64-native-bsdapp-gcc/6823d36361904fa98c20e89113cabec7/dpdk/mk/internal/rte.compile-pre.mk:116: rte_flow.o] Error 1
gmake[5]: *** Waiting for unfinished jobs....

DPDK STV team


More information about the test-report mailing list