[dpdk-test-report] |FAILURE| pw51097[13/15] crypto/dpaa2_sec: simplify pr_{debug, err, warn} macros

sys_stv at intel.com sys_stv at intel.com
Mon Mar 11 19:10:36 CET 2019


Test-Label: Intel-compilation
Test-Status: FAILURE
http://dpdk.org/patch/51097

_Compilation issues_

Submitter: Natanael Copa <ncopa at alpinelinux.org>
Date: 2019-03-11 17:37:00
Reply_mail: 20190311173702.24471-14-ncopa at alpinelinux.org
DPDK git baseline: Repo:dpdk-master, CommitID: 610e235a11e49a1e5d55c2804a5bc628e87417f1

Build Summary: 25 Builds Done, 4 Successful, 21 Failures

Test environment and configuration as below:

OS: SUSE15
	Kernel Version: 4.12.14-lp150.12.22-default
	CPU info: Intel(R) Xeon(R) CPU E5-2699 v3 @ 2.30GHz
	GCC Version: gcc (SUSE Linux) 7.3.1 20180323 [gcc-7-branch revision 258812]
	Clang Version: 5.0.1 (tags/RELEASE_501/final 312548)
	x86_64-native-linuxapp-gcc

OS: CENTOS76
	Kernel Version: 3.10.0-957.5.1.el7.x86_64
	CPU info: Intel(R) Xeon(R) CPU E5-2699 v4 @ 2.20GHz
	GCC Version: gcc (GCC) 4.8.5 20150623 (Red Hat 4.8.5-36)
	Clang Version: NA
	x86_64-native-linuxapp-gcc

OS: UBT144-32
	Kernel Version: 3.13.0-161-generic
	CPU info: Intel(R) Xeon(R) CPU E5-2699 v3 @ 2.30GHz
	GCC Version: gcc (Ubuntu 4.8.4-2ubuntu1~14.04.4) 4.8.4
	Clang Version: NA
	i686-native-linuxapp-gcc

OS: SUSE12
	Kernel Version: 4.4.73-5-default
	CPU info: Intel(R) Xeon(R) CPU E5-2699 v4 @ 2.20GHz
	GCC Version: gcc (SUSE Linux) 7.1.1 20170607 [gcc-7-branch revision 248970]
	Clang Version: NA
	x86_64-native-linuxapp-gcc

OS: FreeBSD12.0
	Kernel Version: 12.0-RC3
	CPU info: Intel(R) Xeon(R) CPU E5-2699 v3 @ 2.30GHz (2294.76-MHz K8-class CPU)
	GCC Version: gcc (FreeBSD Ports Collection) 7.3.0
	Clang Version: 6.0.1 (tags/RELEASE_601/final 335540) (based on LLVM 6.0.1)
	x86_64-native-bsdapp-clang
	x86_64-native-bsdapp-gcc

OS: UBT144-64
	Kernel Version: 4.2.0-27-generic
	CPU info: Intel(R) Xeon(R) CPU E5-2699 v3 @ 2.30GHz
	GCC Version: gcc (Ubuntu 4.8.4-2ubuntu1~14.04.4) 4.8.4
	Clang Version: NA
	x86_64-native-linuxapp-gcc

OS: CENTOS75
	Kernel Version: 3.10.0-957.5.1.el7.x86_64
	CPU info: Intel(R) Xeon(R) CPU E5-2699 v4 @ 2.20GHz
	GCC Version: gcc (GCC) 4.8.5 20150623 (Red Hat 4.8.5-36)
	Clang Version: 3.4.2 (tags/RELEASE_34/dot2-final)
	x86_64-native-linuxapp-gcc

OS: UBT1804
	Kernel Version: 4.15.0-20-generic
	CPU info: Intel(R) Xeon(R) CPU E5-2699 v3 @ 2.30GHz
	GCC Version: gcc (Ubuntu 7.3.0-27ubuntu1~18.04) 7.3.0
	Clang Version: NA
	x86_64-native-linuxapp-clang
	x86_64-native-linuxapp-gcc
	x86_64-native-linuxapp-icc

OS: UBT1810
	Kernel Version: 4.18.0-10-generic
	CPU info: Intel(R) Xeon(R) CPU E5-2699 v3 @ 2.30GHz
	GCC Version: gcc (Ubuntu 8.2.0-7ubuntu1) 8.2.0
	Clang Version: NA
	x86_64-native-linuxapp-gcc

OS: RHEL74
	Kernel Version: 3.10.0-693.el7.x86_64
	CPU info: Intel(R) Xeon(R) CPU E5-2699 v4 @ 2.20GHz
	GCC Version: gcc (GCC) 4.8.5 20150623 (Red Hat 4.8.5-16)
	Clang Version: NA
	x86_64-native-linuxapp-gcc

OS: CENTOS74
	Kernel Version: 3.10.0-862.14.4.el7.x86_64
	CPU info: Intel(R) Xeon(R) CPU E5-2699 v4 @ 2.20GHz
	GCC Version: gcc (GCC) 4.8.5 20150623 (Red Hat 4.8.5-28)
	Clang Version: 3.4.2 (tags/RELEASE_34/dot2-final)
	x86_64-native-linuxapp-gcc

OS: FreeBSD11.2
	Kernel Version: 11.2-RELEASE
	CPU info: Intel(R) Xeon(R) CPU E5-2699 v3 @ 2.30GHz (2294.73-MHz K8-class CPU)
	GCC Version: gcc (FreeBSD Ports Collection) 6.4.0
	Clang Version: 6.0.0 (tags/RELEASE_600/final 326565) (based on LLVM 6.0.0)
	x86_64-native-bsdapp-clang
	x86_64-native-bsdapp-gcc

OS: UBT164-64
	Kernel Version: 4.4.0-47-generic
	CPU info: Intel(R) Xeon(R) CPU E5-2699 v3 @ 2.30GHz
	GCC Version: gcc (Ubuntu 5.4.0-6ubuntu1~16.04.10) 5.4.0 20160609
	Clang Version: 3.8.0-2ubuntu4 (tags/RELEASE_380/final)
	x86_64-native-linuxapp-gcc

OS: FC28
	Kernel Version: 4.16.3-301.fc28.x86_64
	CPU info: Intel(R) Xeon(R) CPU E5-2699 v4 @ 2.20GHz
	GCC Version: gcc (GCC) 8.1.1 20180712 (Red Hat 8.1.1-5)
	Clang Version: NA
	x86_64-native-linuxapp-gcc
	x86_64-native-linuxapp-clang
	x86_64-native-linuxapp-icc

OS: RHEL76
	Kernel Version: 3.10.0-957.el7.x86_64
	CPU info: Intel(R) Xeon(R) CPU E5-2699 v4 @ 2.20GHz
	GCC Version: gcc (GCC) 4.8.5 20150623 (Red Hat 4.8.5-36)
	Clang Version: NA
	x86_64-native-linuxapp-gcc

OS: FC29
	Kernel Version: 4.18.16-300.fc29.x86_64
	CPU info: Intel(R) Xeon(R) CPU E5-2699 v4 @ 2.20GHz
	GCC Version: gcc (GCC) 8.2.1 20181215 (Red Hat 8.2.1-6)
	Clang Version: NA
	x86_64-native-linuxapp-gcc
	x86_64-native-linuxapp-clang
	x86_64-native-linuxapp-icc

OS: RHEL75
	Kernel Version: 3.10.0-862.el7.x86_64
	CPU info: Intel(R) Xeon(R) CPU E5-2699 v4 @ 2.20GHz
	GCC Version: gcc (GCC) 4.8.5 20150623 (Red Hat 4.8.5-28)
	Clang Version: NA
	x86_64-native-linuxapp-gcc

*Failed Build #1:
OS: UBT144-64
Target: x86_64-native-linuxapp-gcc
make[7]: Warning: File `eal_dev.c' has modification time 2.1e+04 s in the future
  CC eal_alarm.o
  CC eal_dev.o
  CC eal_common_lcore.o
/tmp/UBT144-64_K4.2.0_GCC4.8.4/x86_64-native-linuxapp-gcc/b4fb65c55ea3485f8509e6101dc7e6a0/dpdk/lib/librte_eal/linuxapp/eal/eal_dev.c: In function ‘sigbus_handler’:
/tmp/UBT144-64_K4.2.0_GCC4.8.4/x86_64-native-linuxapp-gcc/b4fb65c55ea3485f8509e6101dc7e6a0/dpdk/lib/librte_eal/linuxapp/eal/eal_dev.c:75:2: warning: implicit declaration of function ‘gettid’ [-Wimplicit-function-declaration]
  RTE_LOG(DEBUG, EAL, "Thread[%d] catch SIGBUS, fault address:%p\n",
  ^
/tmp/UBT144-64_K4.2.0_GCC4.8.4/x86_64-native-linuxapp-gcc/b4fb65c55ea3485f8509e6101dc7e6a0/dpdk/lib/librte_eal/linuxapp/eal/eal_dev.c:75:2: warning: nested extern declaration of ‘gettid’ [-Wnested-externs]
  CC eal_common_timer.o
  CC eal_common_memzone.o
  CC eal_common_log.o
  CC eal_common_launch.o
  CC eal_common_memalloc.o
--
  CC rte_hypervisor.o
  CC rte_spinlock.o
  CC rte_cycles.o
  AR librte_eal.a
  INSTALL-LIB librte_eal.a
make[7]: warning:  Clock skew detected.  Your build may be incomplete.
== Build lib/librte_pci
== Build lib/librte_ring
== Build lib/librte_timer
== Build lib/librte_cmdline
== Build lib/librte_meter
--
  CC portal/dpaa2_hw_dpio.o.pmd.o
  CC base/qbman/dpaa_sys.o
  CC vmbus_common_uio.o
  AR librte_bus_pci.a
  INSTALL-LIB librte_bus_pci.a
make[6]: warning:  Clock skew detected.  Your build may be incomplete.
  LD portal/dpaa2_hw_dpio.o
  AR librte_bus_vmbus.a
  INSTALL-LIB librte_bus_vmbus.a
  AR librte_bus_fslmc.a
  INSTALL-LIB librte_bus_fslmc.a
  AR librte_bus_dpaa.a
  INSTALL-LIB librte_bus_dpaa.a
make[6]: warning:  Clock skew detected.  Your build may be incomplete.
== Build drivers/mempool
== Build drivers/mempool/bucket
== Build drivers/mempool/ring
== Build drivers/mempool/dpaa
== Build drivers/mempool/dpaa2
--
  LD dpaa2_sec_dpseci.o
  AR librte_pmd_netvsc.a
  PMDINFO octeontx_pkovf.o.pmd.c
  CC octeontx_pkovf.o.pmd.o
  INSTALL-LIB librte_pmd_netvsc.a
make[6]: warning:  Clock skew detected.  Your build may be incomplete.
== Build drivers/net/pcap
  CC mc/dpseci.o
  LD octeontx_pkovf.o
  CC bnxt_hwrm.o
  PMDINFO i40e_ethdev.o.pmd.c
--
  CC nfp_net.o.pmd.o
  LD nfp_net.o
  AR librte_pmd_nfp.a
  CC sfc_ethdev.o
  INSTALL-LIB librte_pmd_nfp.a
make[6]: warning:  Clock skew detected.  Your build may be incomplete.
== Build drivers/net/tap
  PMDINFO rte_eth_pcap.o.pmd.c
  CC rte_eth_pcap.o.pmd.o
  LD rte_eth_pcap.o
  CC ixgbe_rxtx.o
--
  CC ifpga_fme.o
  CC ifpga_fme_iperf.o
  CC skeleton_rawdev.o
  CC ifpga_fme_dperf.o
  CC skeleton_rawdev_test.o
  CC ifpga_fme_error.o
  CC ifpga_port.o
  PMDINFO dpaa2_cmdif.o.pmd.c
  CC dpaa2_cmdif.o.pmd.o
  CC ifpga_port_error.o
  LD dpaa2_cmdif.o
  CC opae_hw_api.o
  CC opae_ifpga_hw_api.o
  CC opae_debug.o
  CC ifpga_fme_pr.o
--
  CC test.o
  LD cmdline_test
/tmp/UBT144-64_K4.2.0_GCC4.8.4/x86_64-native-linuxapp-gcc/b4fb65c55ea3485f8509e6101dc7e6a0/dpdk/x86_64-native-linuxapp-gcc/lib/librte_eal.a(eal_dev.o): In function `sigbus_handler':
eal_dev.c:(.text+0x59): undefined reference to `gettid'
  CC init.o
collect2: error: ld returned 1 exit status
make[5]: *** [dpdk-procinfo] Error 1
make[4]: *** [proc-info] Error 2
make[4]: *** Waiting for unfinished jobs....
  CC resource.o
  CC test_resource.o
--
  CC cperf_options_parsing.o
  CC test_byteorder.o
/tmp/UBT144-64_K4.2.0_GCC4.8.4/x86_64-native-linuxapp-gcc/b4fb65c55ea3485f8509e6101dc7e6a0/dpdk/x86_64-native-linuxapp-gcc/lib/librte_eal.a(eal_dev.o): In function `sigbus_handler':
eal_dev.c:(.text+0x59): undefined reference to `gettid'
  CC comp_perf_options_parse.o
collect2: error: ld returned 1 exit status
make[5]: *** [testacl] Error 1
make[4]: *** [test-acl] Error 2
  CC comp_perf_test_verify.o
/tmp/UBT144-64_K4.2.0_GCC4.8.4/x86_64-native-linuxapp-gcc/b4fb65c55ea3485f8509e6101dc7e6a0/dpdk/x86_64-native-linuxapp-gcc/lib/librte_eal.a(eal_dev.o): In function `sigbus_handler':
eal_dev.c:(.text+0x59): undefined reference to `gettid'
collect2: error: ld returned 1 exit status
make[5]: *** [dpdk-pdump] Error 1
make[4]: *** [pdump] Error 2
  CC runtime.o
  CC comp_perf_test_benchmark.o
  CC test_per_lcore.o
--
  CC test_bbdev_vector.o
  CC test_barrier.o
  CC test_malloc.o
/tmp/UBT144-64_K4.2.0_GCC4.8.4/x86_64-native-linuxapp-gcc/b4fb65c55ea3485f8509e6101dc7e6a0/dpdk/x86_64-native-linuxapp-gcc/lib/librte_eal.a(eal_dev.o): In function `sigbus_handler':
eal_dev.c:(.text+0x59): undefined reference to `gettid'
collect2: error: ld returned 1 exit status
make[5]: *** [cmdline_test] Error 1
make[4]: *** [test-cmdline] Error 2
  CC test_cycles.o
  CC test_spinlock.o
  CC test_memory.o
--
  CC test_ring_perf.o
  CC test_pmd_perf.o
  CC pipeline_lpm.o
/tmp/UBT144-64_K4.2.0_GCC4.8.4/x86_64-native-linuxapp-gcc/b4fb65c55ea3485f8509e6101dc7e6a0/dpdk/x86_64-native-linuxapp-gcc/lib/librte_eal.a(eal_dev.o): In function `sigbus_handler':
eal_dev.c:(.text+0x59): undefined reference to `gettid'
collect2: error: ld returned 1 exit status
make[5]: *** [dpdk-test-compress-perf] Error 1
make[4]: *** [test-compress-perf] Error 2
  CC pipeline_lpm_ipv6.o
  CC test_table.o
  CC cperf_test_latency.o
--
  CC cperf_test_pmd_cyclecount.o
  CC test_table_combined.o
  CC test_table_acl.o
/tmp/UBT144-64_K4.2.0_GCC4.8.4/x86_64-native-linuxapp-gcc/b4fb65c55ea3485f8509e6101dc7e6a0/dpdk/x86_64-native-linuxapp-gcc/lib/librte_eal.a(eal_dev.o): In function `sigbus_handler':
eal_dev.c:(.text+0x59): undefined reference to `gettid'
collect2: error: ld returned 1 exit status
make[5]: *** [testpipeline] Error 1
make[4]: *** [test-pipeline] Error 2
  CC test_flow_classify.o
  LD testbbdev
  CC test_rwlock.o
  CC cperf_test_verify.o
  CC test_timer.o
/tmp/UBT144-64_K4.2.0_GCC4.8.4/x86_64-native-linuxapp-gcc/b4fb65c55ea3485f8509e6101dc7e6a0/dpdk/x86_64-native-linuxapp-gcc/lib/librte_eal.a(eal_dev.o): In function `sigbus_handler':
eal_dev.c:(.text+0x59): undefined reference to `gettid'
  CC test_timer_perf.o
collect2: error: ld returned 1 exit status
  CC cperf_test_vector_parsing.o
make[5]: *** [testbbdev] Error 1
make[4]: *** [test-bbdev] Error 2
  CC cperf_test_common.o
  CC cmdline_flow.o
--
  CC cmdline_mtr.o
  CC test_member_perf.o
  CC test_efd.o
/tmp/UBT144-64_K4.2.0_GCC4.8.4/x86_64-native-linuxapp-gcc/b4fb65c55ea3485f8509e6101dc7e6a0/dpdk/x86_64-native-linuxapp-gcc/lib/librte_eal.a(eal_dev.o): In function `sigbus_handler':
eal_dev.c:(.text+0x59): undefined reference to `gettid'
collect2: error: ld returned 1 exit status
make[5]: *** [dpdk-test-crypto-perf] Error 1
make[4]: *** [test-crypto-perf] Error 2
  CC test_efd_perf.o
  CC cmdline_tm.o
  CC test_hash.o
--
  CC test_metrics.o
  CC test_eventdev.o
  CC test_event_ring.o
/tmp/UBT144-64_K4.2.0_GCC4.8.4/x86_64-native-linuxapp-gcc/b4fb65c55ea3485f8509e6101dc7e6a0/dpdk/x86_64-native-linuxapp-gcc/lib/librte_eal.a(eal_dev.o): In function `sigbus_handler':
eal_dev.c:(.text+0x59): undefined reference to `gettid'
collect2: error: ld returned 1 exit status
make[5]: *** [testpmd] Error 1
make[4]: *** [test-pmd] Error 2
  CC test_event_eth_rx_adapter.o
  CC test_event_eth_tx_adapter.o
  CC test_event_timer_adapter.o
--
  CC test_ipsec.o
  MKRES test_resource_c.res.o
  LD test
/tmp/UBT144-64_K4.2.0_GCC4.8.4/x86_64-native-linuxapp-gcc/b4fb65c55ea3485f8509e6101dc7e6a0/dpdk/x86_64-native-linuxapp-gcc/lib/librte_eal.a(eal_dev.o): In function `sigbus_handler':
eal_dev.c:(.text+0x59): undefined reference to `gettid'
collect2: error: ld returned 1 exit status
make[5]: *** [test] Error 1
make[4]: *** [test] Error 2
make[3]: *** [app] Error 2
make[2]: *** [all] Error 2
make[1]: *** [pre_install] Error 2

*Failed Build #2:
OS: UBT164-64
Target: x86_64-native-linuxapp-gcc
  CC eal_alarm.o
  CC eal_dev.o
  CC eal_common_lcore.o
In file included from /tmp/UBT164-64_K4.4.0_GCC5.4.0/x86_64-native-linuxapp-gcc/b4fb65c55ea3485f8509e6101dc7e6a0/dpdk/lib/librte_eal/linuxapp/eal/eal_dev.c:14:0:
/tmp/UBT164-64_K4.4.0_GCC5.4.0/x86_64-native-linuxapp-gcc/b4fb65c55ea3485f8509e6101dc7e6a0/dpdk/lib/librte_eal/linuxapp/eal/eal_dev.c: In function ‘sigbus_handler’:
/tmp/UBT164-64_K4.4.0_GCC5.4.0/x86_64-native-linuxapp-gcc/b4fb65c55ea3485f8509e6101dc7e6a0/dpdk/lib/librte_eal/linuxapp/eal/eal_dev.c:76:8: warning: implicit declaration of function ‘gettid’ [-Wimplicit-function-declaration]
   (int)gettid(), info->si_addr);
        ^
/tmp/UBT164-64_K4.4.0_GCC5.4.0/x86_64-native-linuxapp-gcc/b4fb65c55ea3485f8509e6101dc7e6a0/dpdk/x86_64-native-linuxapp-gcc/include/rte_log.h:324:32: note: in definition of macro ‘RTE_LOG’
    RTE_LOGTYPE_ ## t, # t ": " __VA_ARGS__)
                                ^
/tmp/UBT164-64_K4.4.0_GCC5.4.0/x86_64-native-linuxapp-gcc/b4fb65c55ea3485f8509e6101dc7e6a0/dpdk/lib/librte_eal/linuxapp/eal/eal_dev.c:75:2: warning: nested extern declaration of ‘gettid’ [-Wnested-externs]
  RTE_LOG(DEBUG, EAL, "Thread[%d] catch SIGBUS, fault address:%p\n",
  ^
  CC eal_common_timer.o
  CC eal_common_memzone.o
  CC eal_common_log.o
--
  CC rte_hypervisor.o
  CC rte_spinlock.o
  CC rte_cycles.o
  AR librte_eal.a
  INSTALL-LIB librte_eal.a
make[7]: warning:  Clock skew detected.  Your build may be incomplete.
== Build lib/librte_pci
== Build lib/librte_meter
== Build lib/librte_jobstats
== Build lib/librte_metrics
== Build lib/librte_timer
--
  CC portal/dpaa2_hw_dpci.o
  CC pci_common_uio.o
  CC fslmc_bus.o
  AR librte_bus_pci.a
  INSTALL-LIB librte_bus_pci.a
make[6]: warning:  Clock skew detected.  Your build may be incomplete.
  PMDINFO portal/dpaa2_hw_dpbp.o.pmd.c
  CC portal/dpaa2_hw_dpbp.o.pmd.o
  PMDINFO portal/dpaa2_hw_dpio.o.pmd.c
  CC portal/dpaa2_hw_dpio.o.pmd.o
  LD portal/dpaa2_hw_dpbp.o
--
  LD portal/dpaa2_hw_dpci.o
  AR librte_bus_fslmc.a
  INSTALL-LIB librte_bus_fslmc.a
  AR librte_bus_dpaa.a
  INSTALL-LIB librte_bus_dpaa.a
make[6]: warning:  Clock skew detected.  Your build may be incomplete.
== Build drivers/mempool
== Build drivers/mempool/bucket
== Build drivers/mempool/ring
== Build drivers/mempool/dpaa
== Build drivers/mempool/dpaa2
--
  CC ice_ethdev.o
  SYMLINK-FILE include/rte_pmd_bnxt.h
  CC bnxt_cpr.o
  AR librte_pmd_netvsc.a
  INSTALL-LIB librte_pmd_netvsc.a
make[6]: warning:  Clock skew detected.  Your build may be incomplete.
== Build drivers/net/null
  CC virtio_pci.o
  CC bnxt_ethdev.o
  CC nfp_resource.o
  CC ice_rxtx.o
--
  CC nfp_net.o.pmd.o
  LD nfp_net.o
  CC ecore_sp_commands.o
  AR librte_pmd_nfp.a
  INSTALL-LIB librte_pmd_nfp.a
make[6]: warning:  Clock skew detected.  Your build may be incomplete.
== Build drivers/net/thunderx
  CC rte_eth_tap.o
  CC nicvf_rxtx.o
  CC ecore_init_fw_funcs.o
  CC ecore_spq.o
--
  PMDINFO dpaa2_cmdif.o.pmd.c
  CC dpaa2_cmdif.o.pmd.o
  LD dpaa2_cmdif.o
  AR librte_pmd_dpaa2_cmdif.a
  INSTALL-LIB librte_pmd_dpaa2_cmdif.a
  CC ifpga_fme_error.o
  CC ifpga_port.o
  PMDINFO skeleton_rawdev.o.pmd.c
  CC skeleton_rawdev.o.pmd.o
  CC ifpga_port_error.o
  CC opae_hw_api.o
  LD skeleton_rawdev.o
  CC opae_ifpga_hw_api.o
  CC opae_debug.o
  CC ifpga_fme_pr.o
--
  LD dpdk-procinfo
  LD dpdk-pdump
  CC cperf_ops.o
/tmp/UBT164-64_K4.4.0_GCC5.4.0/x86_64-native-linuxapp-gcc/b4fb65c55ea3485f8509e6101dc7e6a0/dpdk/x86_64-native-linuxapp-gcc/lib/librte_eal.a(eal_dev.o): In function `sigbus_handler':
eal_dev.c:(.text+0x59): undefined reference to `gettid'
collect2: error: ld returned 1 exit status
/tmp/UBT164-64_K4.4.0_GCC5.4.0/x86_64-native-linuxapp-gcc/b4fb65c55ea3485f8509e6101dc7e6a0/dpdk/mk/rte.app.mk:397: recipe for target 'cmdline_test' failed
make[5]: *** [cmdline_test] Error 1
/tmp/UBT164-64_K4.4.0_GCC5.4.0/x86_64-native-linuxapp-gcc/b4fb65c55ea3485f8509e6101dc7e6a0/dpdk/mk/rte.subdir.mk:35: recipe for target 'test-cmdline' failed
make[4]: *** [test-cmdline] Error 2
make[4]: *** Waiting for unfinished jobs....
  CC cperf_options_parsing.o
  CC test.o
  CC init.o
/tmp/UBT164-64_K4.4.0_GCC5.4.0/x86_64-native-linuxapp-gcc/b4fb65c55ea3485f8509e6101dc7e6a0/dpdk/x86_64-native-linuxapp-gcc/lib/librte_eal.a(eal_dev.o): In function `sigbus_handler':
eal_dev.c:(.text+0x59): undefined reference to `gettid'
collect2: error: ld returned 1 exit status
/tmp/UBT164-64_K4.4.0_GCC5.4.0/x86_64-native-linuxapp-gcc/b4fb65c55ea3485f8509e6101dc7e6a0/dpdk/mk/rte.app.mk:397: recipe for target 'testacl' failed
make[5]: *** [testacl] Error 1
/tmp/UBT164-64_K4.4.0_GCC5.4.0/x86_64-native-linuxapp-gcc/b4fb65c55ea3485f8509e6101dc7e6a0/dpdk/mk/rte.subdir.mk:35: recipe for target 'test-acl' failed
make[4]: *** [test-acl] Error 2
  CC runtime.o
  CC test_bbdev_perf.o
  CC resource.o
  CC comp_perf_options_parse.o
/tmp/UBT164-64_K4.4.0_GCC5.4.0/x86_64-native-linuxapp-gcc/b4fb65c55ea3485f8509e6101dc7e6a0/dpdk/x86_64-native-linuxapp-gcc/lib/librte_eal.a(eal_dev.o): In function `sigbus_handler':
eal_dev.c:(.text+0x59): undefined reference to `gettid'
collect2: error: ld returned 1 exit status
/tmp/UBT164-64_K4.4.0_GCC5.4.0/x86_64-native-linuxapp-gcc/b4fb65c55ea3485f8509e6101dc7e6a0/dpdk/mk/rte.app.mk:397: recipe for target 'dpdk-procinfo' failed
make[5]: *** [dpdk-procinfo] Error 1
/tmp/UBT164-64_K4.4.0_GCC5.4.0/x86_64-native-linuxapp-gcc/b4fb65c55ea3485f8509e6101dc7e6a0/dpdk/mk/rte.subdir.mk:35: recipe for target 'proc-info' failed
make[4]: *** [proc-info] Error 2
  CC comp_perf_test_verify.o
/tmp/UBT164-64_K4.4.0_GCC5.4.0/x86_64-native-linuxapp-gcc/b4fb65c55ea3485f8509e6101dc7e6a0/dpdk/x86_64-native-linuxapp-gcc/lib/librte_eal.a(eal_dev.o): In function `sigbus_handler':
eal_dev.c:(.text+0x59): undefined reference to `gettid'
collect2: error: ld returned 1 exit status
/tmp/UBT164-64_K4.4.0_GCC5.4.0/x86_64-native-linuxapp-gcc/b4fb65c55ea3485f8509e6101dc7e6a0/dpdk/mk/rte.app.mk:397: recipe for target 'dpdk-pdump' failed
make[5]: *** [dpdk-pdump] Error 1
/tmp/UBT164-64_K4.4.0_GCC5.4.0/x86_64-native-linuxapp-gcc/b4fb65c55ea3485f8509e6101dc7e6a0/dpdk/mk/rte.subdir.mk:35: recipe for target 'pdump' failed
make[4]: *** [pdump] Error 2
  CC comp_perf_test_benchmark.o
  CC test_resource.o
  CC cperf_test_vectors.o
  CC test_prefetch.o
--
  CC cperf_test_pmd_cyclecount.o
  CC pipeline_acl.o
  CC test_reciprocal_division.o
/tmp/UBT164-64_K4.4.0_GCC5.4.0/x86_64-native-linuxapp-gcc/b4fb65c55ea3485f8509e6101dc7e6a0/dpdk/x86_64-native-linuxapp-gcc/lib/librte_eal.a(eal_dev.o): In function `sigbus_handler':
eal_dev.c:(.text+0x59): undefined reference to `gettid'
collect2: error: ld returned 1 exit status
/tmp/UBT164-64_K4.4.0_GCC5.4.0/x86_64-native-linuxapp-gcc/b4fb65c55ea3485f8509e6101dc7e6a0/dpdk/mk/rte.app.mk:397: recipe for target 'dpdk-test-compress-perf' failed
make[5]: *** [dpdk-test-compress-perf] Error 1
/tmp/UBT164-64_K4.4.0_GCC5.4.0/x86_64-native-linuxapp-gcc/b4fb65c55ea3485f8509e6101dc7e6a0/dpdk/mk/rte.subdir.mk:35: recipe for target 'test-compress-perf' failed
make[4]: *** [test-compress-perf] Error 2
  CC test_reciprocal_division_perf.o
  CC cmdline.o
  CC test_fbarray.o
  CC test_external_mem.o
--
  CC cmdline_flow.o
  CC test_table.o
  CC cperf_test_vector_parsing.o
/tmp/UBT164-64_K4.4.0_GCC5.4.0/x86_64-native-linuxapp-gcc/b4fb65c55ea3485f8509e6101dc7e6a0/dpdk/x86_64-native-linuxapp-gcc/lib/librte_eal.a(eal_dev.o): In function `sigbus_handler':
eal_dev.c:(.text+0x59): undefined reference to `gettid'
collect2: error: ld returned 1 exit status
/tmp/UBT164-64_K4.4.0_GCC5.4.0/x86_64-native-linuxapp-gcc/b4fb65c55ea3485f8509e6101dc7e6a0/dpdk/mk/rte.app.mk:397: recipe for target 'testpipeline' failed
make[5]: *** [testpipeline] Error 1
/tmp/UBT164-64_K4.4.0_GCC5.4.0/x86_64-native-linuxapp-gcc/b4fb65c55ea3485f8509e6101dc7e6a0/dpdk/mk/rte.subdir.mk:35: recipe for target 'test-pipeline' failed
make[4]: *** [test-pipeline] Error 2
  CC cperf_test_common.o
  CC test_table_pipeline.o
  CC test_table_tables.o
  CC test_table_ports.o
--
  LD dpdk-test-crypto-perf
  CC test_table_acl.o
  CC test_flow_classify.o
/tmp/UBT164-64_K4.4.0_GCC5.4.0/x86_64-native-linuxapp-gcc/b4fb65c55ea3485f8509e6101dc7e6a0/dpdk/x86_64-native-linuxapp-gcc/lib/librte_eal.a(eal_dev.o): In function `sigbus_handler':
eal_dev.c:(.text+0x59): undefined reference to `gettid'
collect2: error: ld returned 1 exit status
/tmp/UBT164-64_K4.4.0_GCC5.4.0/x86_64-native-linuxapp-gcc/b4fb65c55ea3485f8509e6101dc7e6a0/dpdk/mk/rte.app.mk:397: recipe for target 'dpdk-test-crypto-perf' failed
make[5]: *** [dpdk-test-crypto-perf] Error 1
/tmp/UBT164-64_K4.4.0_GCC5.4.0/x86_64-native-linuxapp-gcc/b4fb65c55ea3485f8509e6101dc7e6a0/dpdk/mk/rte.subdir.mk:35: recipe for target 'test-crypto-perf' failed
make[4]: *** [test-crypto-perf] Error 2
  CC test_rwlock.o
  CC cmdline_mtr.o
  LD testbbdev
  CC test_timer.o
--
  CC test_mbuf.o
  CC test_logs.o
  CC test_memcpy.o
/tmp/UBT164-64_K4.4.0_GCC5.4.0/x86_64-native-linuxapp-gcc/b4fb65c55ea3485f8509e6101dc7e6a0/dpdk/x86_64-native-linuxapp-gcc/lib/librte_eal.a(eal_dev.o): In function `sigbus_handler':
eal_dev.c:(.text+0x59): undefined reference to `gettid'
collect2: error: ld returned 1 exit status
/tmp/UBT164-64_K4.4.0_GCC5.4.0/x86_64-native-linuxapp-gcc/b4fb65c55ea3485f8509e6101dc7e6a0/dpdk/mk/rte.app.mk:397: recipe for target 'testbbdev' failed
make[5]: *** [testbbdev] Error 1
/tmp/UBT164-64_K4.4.0_GCC5.4.0/x86_64-native-linuxapp-gcc/b4fb65c55ea3485f8509e6101dc7e6a0/dpdk/mk/rte.subdir.mk:35: recipe for target 'test-bbdev' failed
make[4]: *** [test-bbdev] Error 2
  CC test_memcpy_perf.o
  CC test_member.o
  CC cmdline_tm.o
  CC test_member_perf.o
--
  MKRES test_resource_c.res.o
  CC softnicfwd.o
  LD testpmd
/tmp/UBT164-64_K4.4.0_GCC5.4.0/x86_64-native-linuxapp-gcc/b4fb65c55ea3485f8509e6101dc7e6a0/dpdk/x86_64-native-linuxapp-gcc/lib/librte_eal.a(eal_dev.o): In function `sigbus_handler':
eal_dev.c:(.text+0x59): undefined reference to `gettid'
collect2: error: ld returned 1 exit status
/tmp/UBT164-64_K4.4.0_GCC5.4.0/x86_64-native-linuxapp-gcc/b4fb65c55ea3485f8509e6101dc7e6a0/dpdk/mk/rte.app.mk:397: recipe for target 'testpmd' failed
make[5]: *** [testpmd] Error 1
/tmp/UBT164-64_K4.4.0_GCC5.4.0/x86_64-native-linuxapp-gcc/b4fb65c55ea3485f8509e6101dc7e6a0/dpdk/mk/rte.subdir.mk:35: recipe for target 'test-pmd' failed
make[4]: *** [test-pmd] Error 2
  LD test
/tmp/UBT164-64_K4.4.0_GCC5.4.0/x86_64-native-linuxapp-gcc/b4fb65c55ea3485f8509e6101dc7e6a0/dpdk/x86_64-native-linuxapp-gcc/lib/librte_eal.a(eal_dev.o): In function `sigbus_handler':
eal_dev.c:(.text+0x59): undefined reference to `gettid'
collect2: error: ld returned 1 exit status
/tmp/UBT164-64_K4.4.0_GCC5.4.0/x86_64-native-linuxapp-gcc/b4fb65c55ea3485f8509e6101dc7e6a0/dpdk/mk/rte.app.mk:397: recipe for target 'test' failed
make[5]: *** [test] Error 1
/tmp/UBT164-64_K4.4.0_GCC5.4.0/x86_64-native-linuxapp-gcc/b4fb65c55ea3485f8509e6101dc7e6a0/dpdk/mk/rte.subdir.mk:35: recipe for target 'test' failed
make[4]: *** [test] Error 2
/tmp/UBT164-64_K4.4.0_GCC5.4.0/x86_64-native-linuxapp-gcc/b4fb65c55ea3485f8509e6101dc7e6a0/dpdk/mk/rte.sdkbuild.mk:46: recipe for target 'app' failed
make[3]: *** [app] Error 2
/tmp/UBT164-64_K4.4.0_GCC5.4.0/x86_64-native-linuxapp-gcc/b4fb65c55ea3485f8509e6101dc7e6a0/dpdk/mk/rte.sdkroot.mk:98: recipe for target 'all' failed
make[2]: *** [all] Error 2
/tmp/UBT164-64_K4.4.0_GCC5.4.0/x86_64-native-linuxapp-gcc/b4fb65c55ea3485f8509e6101dc7e6a0/dpdk/mk/rte.sdkinstall.mk:57: recipe for target 'pre_install' failed
make[1]: *** [pre_install] Error 2
/tmp/UBT164-64_K4.4.0_GCC5.4.0/x86_64-native-linuxapp-gcc/b4fb65c55ea3485f8509e6101dc7e6a0/dpdk/mk/rte.sdkroot.mk:77: recipe for target 'install' failed
make: *** [install] Error 2

*Failed Build #3:
OS: UBT144-32
Target: i686-native-linuxapp-gcc
make[7]: Warning: File `eal_dev.c' has modification time 2.1e+04 s in the future
  CC eal_alarm.o
  CC eal_dev.o
  CC eal_common_lcore.o
/tmp/UBT144-32_K3.13.0_GCC4.8.4/i686-native-linuxapp-gcc/b4fb65c55ea3485f8509e6101dc7e6a0/dpdk/lib/librte_eal/linuxapp/eal/eal_dev.c: In function ‘sigbus_handler’:
/tmp/UBT144-32_K3.13.0_GCC4.8.4/i686-native-linuxapp-gcc/b4fb65c55ea3485f8509e6101dc7e6a0/dpdk/lib/librte_eal/linuxapp/eal/eal_dev.c:75:2: warning: implicit declaration of function ‘gettid’ [-Wimplicit-function-declaration]
  RTE_LOG(DEBUG, EAL, "Thread[%d] catch SIGBUS, fault address:%p\n",
  ^
/tmp/UBT144-32_K3.13.0_GCC4.8.4/i686-native-linuxapp-gcc/b4fb65c55ea3485f8509e6101dc7e6a0/dpdk/lib/librte_eal/linuxapp/eal/eal_dev.c:75:2: warning: nested extern declaration of ‘gettid’ [-Wnested-externs]
  CC eal_common_timer.o
  CC eal_common_memzone.o
  CC eal_common_log.o
  CC eal_common_launch.o
  CC eal_common_memalloc.o
--
  CC rte_hypervisor.o
  CC rte_spinlock.o
  CC rte_cycles.o
  AR librte_eal.a
  INSTALL-LIB librte_eal.a
make[7]: warning:  Clock skew detected.  Your build may be incomplete.
== Build lib/librte_pci
== Build lib/librte_ring
== Build lib/librte_timer
== Build lib/librte_meter
== Build lib/librte_acl
--
  AR librte_bus_pci.a
  INSTALL-LIB librte_bus_pci.a
  LD [M]  /tmp/UBT144-32_K3.13.0_GCC4.8.4/i686-native-linuxapp-gcc/b4fb65c55ea3485f8509e6101dc7e6a0/dpdk/i686-native-linuxapp-gcc/build/kernel/linux/kni/rte_kni.ko
  CC portal/dpaa2_hw_dpci.o
INSTALL-MODULE rte_kni.ko
make[6]: warning:  Clock skew detected.  Your build may be incomplete.
  CC fslmc_vfio.o
  CC vmbus_common_uio.o
  CC base/qbman/bman.o
  CC fslmc_bus.o
  CC base/qbman/bman_driver.o
--
  CC base/qbman/dpaa_sys.o
  AR librte_bus_fslmc.a
  INSTALL-LIB librte_bus_fslmc.a
  AR librte_bus_dpaa.a
  INSTALL-LIB librte_bus_dpaa.a
make[6]: warning:  Clock skew detected.  Your build may be incomplete.
== Build drivers/mempool
== Build drivers/mempool/bucket
== Build drivers/mempool/dpaa
== Build drivers/mempool/dpaa2
== Build drivers/mempool/ring
--
  AR librte_pmd_netvsc.a
  PMDINFO i40e_ethdev.o.pmd.c
  AR librte_pmd_e1000.a
  CC i40e_ethdev.o.pmd.o
  INSTALL-LIB librte_pmd_netvsc.a
make[6]: warning:  Clock skew detected.  Your build may be incomplete.
  LD i40e_ethdev.o
  INSTALL-LIB librte_pmd_e1000.a
  CC ixgbe_pf.o
  CC ixgbe_flow.o
  CC bnxt_ethdev.o
--
  CC ifpga_fme.o
  CC ifpga_fme_dperf.o
  PMDINFO dpaa2_cmdif.o.pmd.c
  CC dpaa2_cmdif.o.pmd.o
  PMDINFO skeleton_rawdev.o.pmd.c
  CC ifpga_fme_error.o
  CC skeleton_rawdev.o.pmd.o
  LD dpaa2_cmdif.o
  CC ifpga_port.o
  LD skeleton_rawdev.o
  CC ifpga_port_error.o
  AR librte_pmd_dpaa2_cmdif.a
  AR librte_pmd_skeleton_rawdev.a
  INSTALL-LIB librte_pmd_dpaa2_cmdif.a
  INSTALL-LIB librte_pmd_skeleton_rawdev.a
  CC opae_hw_api.o
--
  CC cperf_ops.o
  CC test.o
  CC init.o
/tmp/UBT144-32_K3.13.0_GCC4.8.4/i686-native-linuxapp-gcc/b4fb65c55ea3485f8509e6101dc7e6a0/dpdk/i686-native-linuxapp-gcc/lib/librte_eal.a(eal_dev.o): In function `sigbus_handler':
eal_dev.c:(.text+0x67): undefined reference to `gettid'
collect2: error: ld returned 1 exit status
make[5]: *** [cmdline_test] Error 1
  CC comp_perf_options_parse.o
make[4]: *** [test-cmdline] Error 2
make[4]: *** Waiting for unfinished jobs....
  CC comp_perf_test_verify.o
  CC resource.o
/tmp/UBT144-32_K3.13.0_GCC4.8.4/i686-native-linuxapp-gcc/b4fb65c55ea3485f8509e6101dc7e6a0/dpdk/i686-native-linuxapp-gcc/lib/librte_eal.a(eal_dev.o): In function `sigbus_handler':
eal_dev.c:(.text+0x67): undefined reference to `gettid'
collect2: error: ld returned 1 exit status
make[5]: *** [dpdk-procinfo] Error 1
/tmp/UBT144-32_K3.13.0_GCC4.8.4/i686-native-linuxapp-gcc/b4fb65c55ea3485f8509e6101dc7e6a0/dpdk/i686-native-linuxapp-gcc/lib/librte_eal.a(eal_dev.o): In function `sigbus_handler':
eal_dev.c:(.text+0x67): undefined reference to `gettid'
collect2: error: ld returned 1 exit status
make[5]: *** [dpdk-pdump] Error 1
make[4]: *** [proc-info] Error 2
make[4]: *** [pdump] Error 2
  CC runtime.o
  CC test_resource.o
  CC cperf_options_parsing.o
  CC cperf_test_vectors.o
  CC test_prefetch.o
/tmp/UBT144-32_K3.13.0_GCC4.8.4/i686-native-linuxapp-gcc/b4fb65c55ea3485f8509e6101dc7e6a0/dpdk/i686-native-linuxapp-gcc/lib/librte_eal.a(eal_dev.o): In function `sigbus_handler':
eal_dev.c:(.text+0x67): undefined reference to `gettid'
collect2: error: ld returned 1 exit status
make[5]: *** [testacl] Error 1
make[4]: *** [test-acl] Error 2
  CC pipeline_stub.o
  CC test_byteorder.o
  CC pipeline_hash.o
--
  LD dpdk-test-crypto-perf
  CC test_memory.o
  CC test_memzone.o
/tmp/UBT144-32_K3.13.0_GCC4.8.4/i686-native-linuxapp-gcc/b4fb65c55ea3485f8509e6101dc7e6a0/dpdk/i686-native-linuxapp-gcc/lib/librte_eal.a(eal_dev.o): In function `sigbus_handler':
eal_dev.c:(.text+0x67): undefined reference to `gettid'
collect2: error: ld returned 1 exit status
make[5]: *** [dpdk-test-compress-perf] Error 1
make[4]: *** [test-compress-perf] Error 2
  CC cmdline_flow.o
  CC test_bitmap.o
/tmp/UBT144-32_K3.13.0_GCC4.8.4/i686-native-linuxapp-gcc/b4fb65c55ea3485f8509e6101dc7e6a0/dpdk/i686-native-linuxapp-gcc/lib/librte_eal.a(eal_dev.o): In function `sigbus_handler':
eal_dev.c:(.text+0x67): undefined reference to `gettid'
collect2: error: ld returned 1 exit status
make[5]: *** [testpipeline] Error 1
make[4]: *** [test-pipeline] Error 2
  CC cmdline_mtr.o
  CC cmdline_tm.o
  CC test_reciprocal_division.o
  CC config.o
  CC test_reciprocal_division_perf.o
/tmp/UBT144-32_K3.13.0_GCC4.8.4/i686-native-linuxapp-gcc/b4fb65c55ea3485f8509e6101dc7e6a0/dpdk/i686-native-linuxapp-gcc/lib/librte_eal.a(eal_dev.o): In function `sigbus_handler':
eal_dev.c:(.text+0x67): undefined reference to `gettid'
collect2: error: ld returned 1 exit status
make[5]: *** [dpdk-test-crypto-perf] Error 1
make[4]: *** [test-crypto-perf] Error 2
  CC iofwd.o
  CC test_fbarray.o
  CC test_external_mem.o
--
  CC test_table_tables.o
  CC test_table_ports.o
  CC rxonly.o
/tmp/UBT144-32_K3.13.0_GCC4.8.4/i686-native-linuxapp-gcc/b4fb65c55ea3485f8509e6101dc7e6a0/dpdk/i686-native-linuxapp-gcc/lib/librte_eal.a(eal_dev.o): In function `sigbus_handler':
eal_dev.c:(.text+0x67): undefined reference to `gettid'
collect2: error: ld returned 1 exit status
make[5]: *** [testbbdev] Error 1
make[4]: *** [test-bbdev] Error 2
  CC test_table_acl.o
  CC test_table_combined.o
  CC txonly.o
--
  CC test_debug.o
  CC test_errno.o
  CC test_tailq.o
/tmp/UBT144-32_K3.13.0_GCC4.8.4/i686-native-linuxapp-gcc/b4fb65c55ea3485f8509e6101dc7e6a0/dpdk/i686-native-linuxapp-gcc/lib/librte_eal.a(eal_dev.o): In function `sigbus_handler':
eal_dev.c:(.text+0x67): undefined reference to `gettid'
collect2: error: ld returned 1 exit status
make[5]: *** [testpmd] Error 1
make[4]: *** [test-pmd] Error 2
  CC test_string_fns.o
  CC test_cpuflags.o
make[5]: Warning: File `test_eal_flags.c' has modification time 2.1e+04 s in the future
--
  CC test_ipsec.o
  MKRES test_resource_c.res.o
  LD test
/tmp/UBT144-32_K3.13.0_GCC4.8.4/i686-native-linuxapp-gcc/b4fb65c55ea3485f8509e6101dc7e6a0/dpdk/i686-native-linuxapp-gcc/lib/librte_eal.a(eal_dev.o): In function `sigbus_handler':
eal_dev.c:(.text+0x67): undefined reference to `gettid'
collect2: error: ld returned 1 exit status
make[5]: *** [test] Error 1
make[4]: *** [test] Error 2
make[3]: *** [app] Error 2
make[2]: *** [all] Error 2
make[1]: *** [pre_install] Error 2

*Failed Build #4:
OS: UBT1804
Target: x86_64-native-linuxapp-clang
make[7]: Warning: File 'eal_dev.c' has modification time 21233 s in the future
  CC eal_alarm.o
  CC eal_dev.o
  CC eal_common_lcore.o
  CC eal_common_timer.o
/tmp/UBT1804_K4.15.0_Clang6.0.0/x86_64-native-linuxapp-clang/b4fb65c55ea3485f8509e6101dc7e6a0/dpdk/lib/librte_eal/linuxapp/eal/eal_dev.c:76:8: warning: implicit declaration of function 'gettid' is invalid in C99 [-Wimplicit-function-declaration]
                (int)gettid(), info->si_addr);
                     ^
/tmp/UBT1804_K4.15.0_Clang6.0.0/x86_64-native-linuxapp-clang/b4fb65c55ea3485f8509e6101dc7e6a0/dpdk/lib/librte_eal/linuxapp/eal/eal_dev.c:76:8: warning: this function declaration is not a prototype [-Wstrict-prototypes]
2 warnings generated.
  CC eal_common_log.o
  CC eal_common_memzone.o
  CC eal_common_launch.o
  CC eal_common_memalloc.o
  CC eal_common_memory.o
--
  CC rte_hypervisor.o
  CC rte_spinlock.o
  CC rte_cycles.o
  AR librte_eal.a
  INSTALL-LIB librte_eal.a
make[7]: warning:  Clock skew detected.  Your build may be incomplete.
== Build lib/librte_pci
== Build lib/librte_cmdline
== Build lib/librte_acl
== Build lib/librte_ring
== Build lib/librte_meter
--
  CC [M]  /tmp/UBT1804_K4.15.0_Clang6.0.0/x86_64-native-linuxapp-clang/b4fb65c55ea3485f8509e6101dc7e6a0/dpdk/x86_64-native-linuxapp-clang/build/kernel/linux/kni/kni_misc.o
  PMDINFO portal/dpaa2_hw_dpio.o.pmd.c
  CC portal/dpaa2_hw_dpio.o.pmd.o
  AR librte_bus_pci.a
  INSTALL-LIB librte_bus_pci.a
make[6]: warning:  Clock skew detected.  Your build may be incomplete.
  CC [M]  /tmp/UBT1804_K4.15.0_Clang6.0.0/x86_64-native-linuxapp-clang/b4fb65c55ea3485f8509e6101dc7e6a0/dpdk/x86_64-native-linuxapp-clang/build/kernel/linux/kni/kni_net.o
  LD portal/dpaa2_hw_dpio.o
  CC base/qbman/qman.o
  CC base/qbman/qman_driver.o
  PMDINFO portal/dpaa2_hw_dpci.o.pmd.c
--
  CC      /tmp/UBT1804_K4.15.0_Clang6.0.0/x86_64-native-linuxapp-clang/b4fb65c55ea3485f8509e6101dc7e6a0/dpdk/x86_64-native-linuxapp-clang/build/kernel/linux/kni/rte_kni.mod.o
  LD [M]  /tmp/UBT1804_K4.15.0_Clang6.0.0/x86_64-native-linuxapp-clang/b4fb65c55ea3485f8509e6101dc7e6a0/dpdk/x86_64-native-linuxapp-clang/build/kernel/linux/kni/rte_kni.ko
INSTALL-MODULE rte_kni.ko
  AR librte_bus_dpaa.a
  INSTALL-LIB librte_bus_dpaa.a
make[6]: warning:  Clock skew detected.  Your build may be incomplete.
== Build drivers/mempool
== Build drivers/mempool/dpaa
== Build drivers/mempool/bucket
== Build drivers/mempool/octeontx
== Build drivers/mempool/stack
--
  AR librte_pmd_ice.a
  INSTALL-LIB librte_pmd_ice.a
== Build drivers/net/octeontx
  AR librte_pmd_netvsc.a
  INSTALL-LIB librte_pmd_netvsc.a
make[6]: warning:  Clock skew detected.  Your build may be incomplete.
== Build drivers/net/pcap
  CC ixgbe_pf.o
  PMDINFO bnxt_ethdev.o.pmd.c
  CC bnxt_ethdev.o.pmd.o
  CC nfp_nffw.o
--
  CC nfp_net.o.pmd.o
  LD nfp_net.o
  CC bnxt_vnic.o
  AR librte_pmd_nfp.a
  INSTALL-LIB librte_pmd_nfp.a
make[6]: warning:  Clock skew detected.  Your build may be incomplete.
== Build drivers/net/thunderx
  CC bnxt_irq.o
  CC bnxt_util.o
  AR librte_pmd_ixgbe.a
  CC nicvf_rxtx.o
--
  CC ifpga_fme.o
  CC ifpga_api.o
  CC ifpga_enumerate.o
  CC ifpga_fme_iperf.o
  CC ifpga_fme_dperf.o
  CC ifpga_fme_error.o
  CC ifpga_port.o
  PMDINFO dpaa2_cmdif.o.pmd.c
  CC dpaa2_cmdif.o.pmd.o
  CC ifpga_port_error.o
  LD dpaa2_cmdif.o
  CC opae_hw_api.o
  AR librte_pmd_dpaa2_cmdif.a
  INSTALL-LIB librte_pmd_dpaa2_cmdif.a
  CC opae_ifpga_hw_api.o
--
/tmp/UBT1804_K4.15.0_Clang6.0.0/x86_64-native-linuxapp-clang/b4fb65c55ea3485f8509e6101dc7e6a0/dpdk/x86_64-native-linuxapp-clang/lib/librte_eal.a(eal_dev.o): In function `sigbus_handler':
eal_dev.c:(.text+0x4d5): undefined reference to `gettid'
  CC comp_perf_options_parse.o
  CC test.o
  LD dpdk-pdump
clang: error: linker command failed with exit code 1 (use -v to see invocation)
/tmp/UBT1804_K4.15.0_Clang6.0.0/x86_64-native-linuxapp-clang/b4fb65c55ea3485f8509e6101dc7e6a0/dpdk/mk/rte.app.mk:397: recipe for target 'cmdline_test' failed
make[5]: *** [cmdline_test] Error 1
/tmp/UBT1804_K4.15.0_Clang6.0.0/x86_64-native-linuxapp-clang/b4fb65c55ea3485f8509e6101dc7e6a0/dpdk/mk/rte.subdir.mk:35: recipe for target 'test-cmdline' failed
make[4]: *** [test-cmdline] Error 2
make[4]: *** Waiting for unfinished jobs....
  CC resource.o
  LD dpdk-procinfo
  CC cperf_ops.o
--
eal_dev.c:(.text+0x4d5): undefined reference to `gettid'
  CC test_resource.o
/tmp/UBT1804_K4.15.0_Clang6.0.0/x86_64-native-linuxapp-clang/b4fb65c55ea3485f8509e6101dc7e6a0/dpdk/x86_64-native-linuxapp-clang/lib/librte_eal.a(eal_dev.o): In function `sigbus_handler':
eal_dev.c:(.text+0x4d5): undefined reference to `gettid'
  CC test_prefetch.o
clang: error: linker command failed with exit code 1 (use -v to see invocation)
/tmp/UBT1804_K4.15.0_Clang6.0.0/x86_64-native-linuxapp-clang/b4fb65c55ea3485f8509e6101dc7e6a0/dpdk/mk/rte.app.mk:397: recipe for target 'dpdk-procinfo' failed
make[5]: *** [dpdk-procinfo] Error 1
/tmp/UBT1804_K4.15.0_Clang6.0.0/x86_64-native-linuxapp-clang/b4fb65c55ea3485f8509e6101dc7e6a0/dpdk/mk/rte.subdir.mk:35: recipe for target 'proc-info' failed
make[4]: *** [proc-info] Error 2
  CC test_bbdev_vector.o
  CC test_bbdev_perf.o
  CC test_byteorder.o
clang: error: linker command failed with exit code 1 (use -v to see invocation)
/tmp/UBT1804_K4.15.0_Clang6.0.0/x86_64-native-linuxapp-clang/b4fb65c55ea3485f8509e6101dc7e6a0/dpdk/mk/rte.app.mk:397: recipe for target 'testacl' failed
make[5]: *** [testacl] Error 1
/tmp/UBT1804_K4.15.0_Clang6.0.0/x86_64-native-linuxapp-clang/b4fb65c55ea3485f8509e6101dc7e6a0/dpdk/mk/rte.subdir.mk:35: recipe for target 'test-acl' failed
make[4]: *** [test-acl] Error 2
  CC test_per_lcore.o
  CC init.o
  CC test_atomic.o
/tmp/UBT1804_K4.15.0_Clang6.0.0/x86_64-native-linuxapp-clang/b4fb65c55ea3485f8509e6101dc7e6a0/dpdk/x86_64-native-linuxapp-clang/lib/librte_eal.a(eal_dev.o): In function `sigbus_handler':
eal_dev.c:(.text+0x4d5): undefined reference to `gettid'
  CC test_barrier.o
  CC cperf_options_parsing.o
  CC test_malloc.o
  CC comp_perf_test_verify.o
clang: error: linker command failed with exit code 1 (use -v to see invocation)
/tmp/UBT1804_K4.15.0_Clang6.0.0/x86_64-native-linuxapp-clang/b4fb65c55ea3485f8509e6101dc7e6a0/dpdk/mk/rte.app.mk:397: recipe for target 'dpdk-pdump' failed
make[5]: *** [dpdk-pdump] Error 1
/tmp/UBT1804_K4.15.0_Clang6.0.0/x86_64-native-linuxapp-clang/b4fb65c55ea3485f8509e6101dc7e6a0/dpdk/mk/rte.subdir.mk:35: recipe for target 'pdump' failed
make[4]: *** [pdump] Error 2
  CC comp_perf_test_benchmark.o
  CC test_cycles.o
  CC test_spinlock.o
  CC test_memory.o
--
/tmp/UBT1804_K4.15.0_Clang6.0.0/x86_64-native-linuxapp-clang/b4fb65c55ea3485f8509e6101dc7e6a0/dpdk/x86_64-native-linuxapp-clang/lib/librte_eal.a(eal_dev.o): In function `sigbus_handler':
eal_dev.c:(.text+0x4d5): undefined reference to `gettid'
  CC pipeline_stub.o
  CC test_table_pipeline.o
  CC test_table_tables.o
clang: error: linker command failed with exit code 1 (use -v to see invocation)
/tmp/UBT1804_K4.15.0_Clang6.0.0/x86_64-native-linuxapp-clang/b4fb65c55ea3485f8509e6101dc7e6a0/dpdk/mk/rte.app.mk:397: recipe for target 'dpdk-test-compress-perf' failed
make[5]: *** [dpdk-test-compress-perf] Error 1
/tmp/UBT1804_K4.15.0_Clang6.0.0/x86_64-native-linuxapp-clang/b4fb65c55ea3485f8509e6101dc7e6a0/dpdk/mk/rte.subdir.mk:35: recipe for target 'test-compress-perf' failed
make[4]: *** [test-compress-perf] Error 2
  CC test_table_ports.o
  CC cperf_test_verify.o
  LD testbbdev
  CC test_table_combined.o
--
  CC test_table_acl.o
  CC cperf_test_vector_parsing.o
  CC test_flow_classify.o
/tmp/UBT1804_K4.15.0_Clang6.0.0/x86_64-native-linuxapp-clang/b4fb65c55ea3485f8509e6101dc7e6a0/dpdk/x86_64-native-linuxapp-clang/lib/librte_eal.a(eal_dev.o): In function `sigbus_handler':
eal_dev.c:(.text+0x4d5): undefined reference to `gettid'
clang: error: linker command failed with exit code 1 (use -v to see invocation)
/tmp/UBT1804_K4.15.0_Clang6.0.0/x86_64-native-linuxapp-clang/b4fb65c55ea3485f8509e6101dc7e6a0/dpdk/mk/rte.app.mk:397: recipe for target 'testbbdev' failed
make[5]: *** [testbbdev] Error 1
/tmp/UBT1804_K4.15.0_Clang6.0.0/x86_64-native-linuxapp-clang/b4fb65c55ea3485f8509e6101dc7e6a0/dpdk/mk/rte.subdir.mk:35: recipe for target 'test-bbdev' failed
make[4]: *** [test-bbdev] Error 2
  CC pipeline_lpm.o
  CC test_rwlock.o
  CC cmdline_flow.o
  CC cperf_test_common.o
--
  CC test_memcpy_perf.o
  CC test_member.o
  CC test_member_perf.o
/tmp/UBT1804_K4.15.0_Clang6.0.0/x86_64-native-linuxapp-clang/b4fb65c55ea3485f8509e6101dc7e6a0/dpdk/x86_64-native-linuxapp-clang/lib/librte_eal.a(eal_dev.o): In function `sigbus_handler':
eal_dev.c:(.text+0x4d5): undefined reference to `gettid'
clang: error: linker command failed with exit code 1 (use -v to see invocation)
/tmp/UBT1804_K4.15.0_Clang6.0.0/x86_64-native-linuxapp-clang/b4fb65c55ea3485f8509e6101dc7e6a0/dpdk/mk/rte.app.mk:397: recipe for target 'dpdk-test-crypto-perf' failed
make[5]: *** [dpdk-test-crypto-perf] Error 1
/tmp/UBT1804_K4.15.0_Clang6.0.0/x86_64-native-linuxapp-clang/b4fb65c55ea3485f8509e6101dc7e6a0/dpdk/mk/rte.subdir.mk:35: recipe for target 'test-crypto-perf' failed
make[4]: *** [test-crypto-perf] Error 2
  CC test_efd.o
  CC test_efd_perf.o
  LD testpipeline
  CC cmdline_mtr.o
--
  CC test_thash.o
/tmp/UBT1804_K4.15.0_Clang6.0.0/x86_64-native-linuxapp-clang/b4fb65c55ea3485f8509e6101dc7e6a0/dpdk/x86_64-native-linuxapp-clang/lib/librte_eal.a(eal_dev.o): In function `sigbus_handler':
eal_dev.c:(.text+0x4d5): undefined reference to `gettid'
  CC test_hash_perf.o
  CC test_hash_functions.o
clang: error: linker command failed with exit code 1 (use -v to see invocation)
/tmp/UBT1804_K4.15.0_Clang6.0.0/x86_64-native-linuxapp-clang/b4fb65c55ea3485f8509e6101dc7e6a0/dpdk/mk/rte.app.mk:397: recipe for target 'testpipeline' failed
make[5]: *** [testpipeline] Error 1
/tmp/UBT1804_K4.15.0_Clang6.0.0/x86_64-native-linuxapp-clang/b4fb65c55ea3485f8509e6101dc7e6a0/dpdk/mk/rte.subdir.mk:35: recipe for target 'test-pipeline' failed
make[4]: *** [test-pipeline] Error 2
  CC test_hash_multiwriter.o
  CC test_hash_readwrite.o
  CC cmdline_tm.o
  CC test_hash_readwrite_lf.o
--
  CC util.o
  CC softnicfwd.o
  LD testpmd
/tmp/UBT1804_K4.15.0_Clang6.0.0/x86_64-native-linuxapp-clang/b4fb65c55ea3485f8509e6101dc7e6a0/dpdk/x86_64-native-linuxapp-clang/lib/librte_eal.a(eal_dev.o): In function `sigbus_handler':
eal_dev.c:(.text+0x4d5): undefined reference to `gettid'
clang: error: linker command failed with exit code 1 (use -v to see invocation)
/tmp/UBT1804_K4.15.0_Clang6.0.0/x86_64-native-linuxapp-clang/b4fb65c55ea3485f8509e6101dc7e6a0/dpdk/mk/rte.app.mk:397: recipe for target 'testpmd' failed
make[5]: *** [testpmd] Error 1
/tmp/UBT1804_K4.15.0_Clang6.0.0/x86_64-native-linuxapp-clang/b4fb65c55ea3485f8509e6101dc7e6a0/dpdk/mk/rte.subdir.mk:35: recipe for target 'test-pmd' failed
make[4]: *** [test-pmd] Error 2
  LD test
/tmp/UBT1804_K4.15.0_Clang6.0.0/x86_64-native-linuxapp-clang/b4fb65c55ea3485f8509e6101dc7e6a0/dpdk/x86_64-native-linuxapp-clang/lib/librte_eal.a(eal_dev.o): In function `sigbus_handler':
eal_dev.c:(.text+0x4d5): undefined reference to `gettid'
clang: error: linker command failed with exit code 1 (use -v to see invocation)
/tmp/UBT1804_K4.15.0_Clang6.0.0/x86_64-native-linuxapp-clang/b4fb65c55ea3485f8509e6101dc7e6a0/dpdk/mk/rte.app.mk:397: recipe for target 'test' failed
make[5]: *** [test] Error 1
/tmp/UBT1804_K4.15.0_Clang6.0.0/x86_64-native-linuxapp-clang/b4fb65c55ea3485f8509e6101dc7e6a0/dpdk/mk/rte.subdir.mk:35: recipe for target 'test' failed
make[4]: *** [test] Error 2
/tmp/UBT1804_K4.15.0_Clang6.0.0/x86_64-native-linuxapp-clang/b4fb65c55ea3485f8509e6101dc7e6a0/dpdk/mk/rte.sdkbuild.mk:46: recipe for target 'app' failed
make[3]: *** [app] Error 2
/tmp/UBT1804_K4.15.0_Clang6.0.0/x86_64-native-linuxapp-clang/b4fb65c55ea3485f8509e6101dc7e6a0/dpdk/mk/rte.sdkroot.mk:98: recipe for target 'all' failed
make[2]: *** [all] Error 2
/tmp/UBT1804_K4.15.0_Clang6.0.0/x86_64-native-linuxapp-clang/b4fb65c55ea3485f8509e6101dc7e6a0/dpdk/mk/rte.sdkinstall.mk:57: recipe for target 'pre_install' failed
make[1]: *** [pre_install] Error 2
/tmp/UBT1804_K4.15.0_Clang6.0.0/x86_64-native-linuxapp-clang/b4fb65c55ea3485f8509e6101dc7e6a0/dpdk/mk/rte.sdkroot.mk:77: recipe for target 'install' failed
make: *** [install] Error 2

*Failed Build #5:
OS: UBT1804
Target: x86_64-native-linuxapp-gcc
make[7]: Warning: File 'eal_dev.c' has modification time 21223 s in the future
  CC eal_alarm.o
  CC eal_dev.o
In file included from /tmp/UBT1804_K4.15.0_GCC7.3.0/x86_64-native-linuxapp-gcc/b4fb65c55ea3485f8509e6101dc7e6a0/dpdk/lib/librte_eal/linuxapp/eal/eal_dev.c:14:0:
/tmp/UBT1804_K4.15.0_GCC7.3.0/x86_64-native-linuxapp-gcc/b4fb65c55ea3485f8509e6101dc7e6a0/dpdk/lib/librte_eal/linuxapp/eal/eal_dev.c: In function ‘sigbus_handler’:
/tmp/UBT1804_K4.15.0_GCC7.3.0/x86_64-native-linuxapp-gcc/b4fb65c55ea3485f8509e6101dc7e6a0/dpdk/lib/librte_eal/linuxapp/eal/eal_dev.c:76:8: warning: implicit declaration of function ‘gettid’; did you mean ‘getgid’? [-Wimplicit-function-declaration]
   (int)gettid(), info->si_addr);
        ^
/tmp/UBT1804_K4.15.0_GCC7.3.0/x86_64-native-linuxapp-gcc/b4fb65c55ea3485f8509e6101dc7e6a0/dpdk/x86_64-native-linuxapp-gcc/include/rte_log.h:324:32: note: in definition of macro ‘RTE_LOG’
    RTE_LOGTYPE_ ## t, # t ": " __VA_ARGS__)
                                ^~~~~~~~~~~
/tmp/UBT1804_K4.15.0_GCC7.3.0/x86_64-native-linuxapp-gcc/b4fb65c55ea3485f8509e6101dc7e6a0/dpdk/lib/librte_eal/linuxapp/eal/eal_dev.c:76:8: warning: nested extern declaration of ‘gettid’ [-Wnested-externs]
   (int)gettid(), info->si_addr);
        ^
/tmp/UBT1804_K4.15.0_GCC7.3.0/x86_64-native-linuxapp-gcc/b4fb65c55ea3485f8509e6101dc7e6a0/dpdk/x86_64-native-linuxapp-gcc/include/rte_log.h:324:32: note: in definition of macro ‘RTE_LOG’
    RTE_LOGTYPE_ ## t, # t ": " __VA_ARGS__)
                                ^~~~~~~~~~~
--
  CC rte_hypervisor.o
  CC rte_spinlock.o
  CC rte_cycles.o
  AR librte_eal.a
  INSTALL-LIB librte_eal.a
make[7]: warning:  Clock skew detected.  Your build may be incomplete.
== Build lib/librte_acl
== Build lib/librte_pci
== Build lib/librte_metrics
== Build lib/librte_ring
== Build lib/librte_meter
--
  CC base/qbman/qman_driver.o
  CC base/qbman/dpaa_alloc.o
  CC base/qbman/dpaa_sys.o
  AR librte_bus_pci.a
  INSTALL-LIB librte_bus_pci.a
make[6]: warning:  Clock skew detected.  Your build may be incomplete.
  CC      /tmp/UBT1804_K4.15.0_GCC7.3.0/x86_64-native-linuxapp-gcc/b4fb65c55ea3485f8509e6101dc7e6a0/dpdk/x86_64-native-linuxapp-gcc/build/kernel/linux/kni/rte_kni.mod.o
  LD [M]  /tmp/UBT1804_K4.15.0_GCC7.3.0/x86_64-native-linuxapp-gcc/b4fb65c55ea3485f8509e6101dc7e6a0/dpdk/x86_64-native-linuxapp-gcc/build/kernel/linux/kni/rte_kni.ko
INSTALL-MODULE rte_kni.ko
  AR librte_bus_fslmc.a
  INSTALL-LIB librte_bus_fslmc.a
  AR librte_bus_dpaa.a
  INSTALL-LIB librte_bus_dpaa.a
make[6]: warning:  Clock skew detected.  Your build may be incomplete.
== Build drivers/mempool
== Build drivers/mempool/dpaa
== Build drivers/mempool/bucket
== Build drivers/mempool/ring
== Build drivers/mempool/stack
--
  CC ice_switch.o
  LD octeontx_pkivf.o
  AR librte_pmd_netvsc.a
  INSTALL-LIB librte_pmd_netvsc.a
  CC octeontx_bgx.o
make[6]: warning:  Clock skew detected.  Your build may be incomplete.
== Build drivers/net/ring
  PMDINFO i40e_ethdev.o.pmd.c
  CC i40e_ethdev.o.pmd.o
  AR librte_pmd_iavf.a
  LD i40e_ethdev.o
--
  PMDINFO nfp_net.o.pmd.c
  CC nfp_net.o.pmd.o
  LD nfp_net.o
  AR librte_pmd_nfp.a
  INSTALL-LIB librte_pmd_nfp.a
make[6]: warning:  Clock skew detected.  Your build may be incomplete.
  CC tap_netlink.o
== Build drivers/net/kni
  PMDINFO i40e_ethdev_vf.o.pmd.c
  CC i40e_ethdev_vf.o.pmd.o
  CC vmxnet3_rxtx.o
--
  SYMLINK-FILE include/rte_pmd_dpaa2_qdma.h
  CC dpaa2_qdma.o
  CC ifpga_feature_dev.o
  CC ifpga_api.o
  CC ifpga_fme_iperf.o
  CC ifpga_fme_error.o
  CC ifpga_enumerate.o
  CC ifpga_fme_dperf.o
  CC ifpga_fme.o
  SYMLINK-FILE include/rte_pmd_dpaa2_cmdif.h
  CC skeleton_rawdev.o
  CC dpaa2_cmdif.o
  CC ifpga_port.o
  CC ifpga_port_error.o
  CC opae_hw_api.o
  CC opae_ifpga_hw_api.o
  CC opae_debug.o
  CC ifpga_fme_pr.o
  PMDINFO dpaa2_cmdif.o.pmd.c
--
  CC config.o
  LD testacl
  CC test.o
/tmp/UBT1804_K4.15.0_GCC7.3.0/x86_64-native-linuxapp-gcc/b4fb65c55ea3485f8509e6101dc7e6a0/dpdk/x86_64-native-linuxapp-gcc/lib/librte_eal.a(eal_dev.o): In function `sigbus_handler':
eal_dev.c:(.text+0x69): undefined reference to `gettid'
collect2: error: ld returned 1 exit status
/tmp/UBT1804_K4.15.0_GCC7.3.0/x86_64-native-linuxapp-gcc/b4fb65c55ea3485f8509e6101dc7e6a0/dpdk/mk/rte.app.mk:397: recipe for target 'dpdk-procinfo' failed
make[5]: *** [dpdk-procinfo] Error 1
/tmp/UBT1804_K4.15.0_GCC7.3.0/x86_64-native-linuxapp-gcc/b4fb65c55ea3485f8509e6101dc7e6a0/dpdk/mk/rte.subdir.mk:35: recipe for target 'proc-info' failed
make[4]: *** [proc-info] Error 2
make[4]: *** Waiting for unfinished jobs....
  CC resource.o
/tmp/UBT1804_K4.15.0_GCC7.3.0/x86_64-native-linuxapp-gcc/b4fb65c55ea3485f8509e6101dc7e6a0/dpdk/x86_64-native-linuxapp-gcc/lib/librte_eal.a(eal_dev.o): In function `sigbus_handler':
eal_dev.c:(.text+0x69): undefined reference to `gettid'
collect2: error: ld returned 1 exit status
/tmp/UBT1804_K4.15.0_GCC7.3.0/x86_64-native-linuxapp-gcc/b4fb65c55ea3485f8509e6101dc7e6a0/dpdk/mk/rte.app.mk:397: recipe for target 'dpdk-pdump' failed
make[5]: *** [dpdk-pdump] Error 1
/tmp/UBT1804_K4.15.0_GCC7.3.0/x86_64-native-linuxapp-gcc/b4fb65c55ea3485f8509e6101dc7e6a0/dpdk/mk/rte.subdir.mk:35: recipe for target 'pdump' failed
make[4]: *** [pdump] Error 2
  CC init.o
/tmp/UBT1804_K4.15.0_GCC7.3.0/x86_64-native-linuxapp-gcc/b4fb65c55ea3485f8509e6101dc7e6a0/dpdk/x86_64-native-linuxapp-gcc/lib/librte_eal.a(eal_dev.o): In function `sigbus_handler':
eal_dev.c:(.text+0x69): undefined reference to `gettid'
collect2: error: ld returned 1 exit status
/tmp/UBT1804_K4.15.0_GCC7.3.0/x86_64-native-linuxapp-gcc/b4fb65c55ea3485f8509e6101dc7e6a0/dpdk/mk/rte.app.mk:397: recipe for target 'cmdline_test' failed
make[5]: *** [cmdline_test] Error 1
/tmp/UBT1804_K4.15.0_GCC7.3.0/x86_64-native-linuxapp-gcc/b4fb65c55ea3485f8509e6101dc7e6a0/dpdk/mk/rte.subdir.mk:35: recipe for target 'test-cmdline' failed
make[4]: *** [test-cmdline] Error 2
  CC runtime.o
  CC test_bbdev_perf.o
  CC test_resource.o
  CC comp_perf_options_parse.o
--
  CC test_byteorder.o
  CC test_per_lcore.o
/tmp/UBT1804_K4.15.0_GCC7.3.0/x86_64-native-linuxapp-gcc/b4fb65c55ea3485f8509e6101dc7e6a0/dpdk/x86_64-native-linuxapp-gcc/lib/librte_eal.a(eal_dev.o): In function `sigbus_handler':
eal_dev.c:(.text+0x69): undefined reference to `gettid'
  CC test_atomic.o
collect2: error: ld returned 1 exit status
/tmp/UBT1804_K4.15.0_GCC7.3.0/x86_64-native-linuxapp-gcc/b4fb65c55ea3485f8509e6101dc7e6a0/dpdk/mk/rte.app.mk:397: recipe for target 'testacl' failed
make[5]: *** [testacl] Error 1
/tmp/UBT1804_K4.15.0_GCC7.3.0/x86_64-native-linuxapp-gcc/b4fb65c55ea3485f8509e6101dc7e6a0/dpdk/mk/rte.subdir.mk:35: recipe for target 'test-acl' failed
make[4]: *** [test-acl] Error 2
  CC test_bbdev_vector.o
  CC test_barrier.o
  CC test_malloc.o
  CC pipeline_hash.o
--
  CC test_table_tables.o
  CC cmdline.o
  CC test_table_ports.o
/tmp/UBT1804_K4.15.0_GCC7.3.0/x86_64-native-linuxapp-gcc/b4fb65c55ea3485f8509e6101dc7e6a0/dpdk/x86_64-native-linuxapp-gcc/lib/librte_eal.a(eal_dev.o): In function `sigbus_handler':
eal_dev.c:(.text+0x69): undefined reference to `gettid'
collect2: error: ld returned 1 exit status
/tmp/UBT1804_K4.15.0_GCC7.3.0/x86_64-native-linuxapp-gcc/b4fb65c55ea3485f8509e6101dc7e6a0/dpdk/mk/rte.app.mk:397: recipe for target 'testpipeline' failed
make[5]: *** [testpipeline] Error 1
/tmp/UBT1804_K4.15.0_GCC7.3.0/x86_64-native-linuxapp-gcc/b4fb65c55ea3485f8509e6101dc7e6a0/dpdk/mk/rte.subdir.mk:35: recipe for target 'test-pipeline' failed
make[4]: *** [test-pipeline] Error 2
  CC test_table_combined.o
  CC cperf_test_latency.o
  LD dpdk-test-compress-perf
  CC test_table_acl.o
  CC test_flow_classify.o
/tmp/UBT1804_K4.15.0_GCC7.3.0/x86_64-native-linuxapp-gcc/b4fb65c55ea3485f8509e6101dc7e6a0/dpdk/x86_64-native-linuxapp-gcc/lib/librte_eal.a(eal_dev.o): In function `sigbus_handler':
eal_dev.c:(.text+0x69): undefined reference to `gettid'
collect2: error: ld returned 1 exit status
/tmp/UBT1804_K4.15.0_GCC7.3.0/x86_64-native-linuxapp-gcc/b4fb65c55ea3485f8509e6101dc7e6a0/dpdk/mk/rte.app.mk:397: recipe for target 'testbbdev' failed
make[5]: *** [testbbdev] Error 1
/tmp/UBT1804_K4.15.0_GCC7.3.0/x86_64-native-linuxapp-gcc/b4fb65c55ea3485f8509e6101dc7e6a0/dpdk/mk/rte.subdir.mk:35: recipe for target 'test-bbdev' failed
make[4]: *** [test-bbdev] Error 2
  CC cmdline_flow.o
/tmp/UBT1804_K4.15.0_GCC7.3.0/x86_64-native-linuxapp-gcc/b4fb65c55ea3485f8509e6101dc7e6a0/dpdk/x86_64-native-linuxapp-gcc/lib/librte_eal.a(eal_dev.o): In function `sigbus_handler':
eal_dev.c:(.text+0x69): undefined reference to `gettid'
collect2: error: ld returned 1 exit status
/tmp/UBT1804_K4.15.0_GCC7.3.0/x86_64-native-linuxapp-gcc/b4fb65c55ea3485f8509e6101dc7e6a0/dpdk/mk/rte.app.mk:397: recipe for target 'dpdk-test-compress-perf' failed
make[5]: *** [dpdk-test-compress-perf] Error 1
/tmp/UBT1804_K4.15.0_GCC7.3.0/x86_64-native-linuxapp-gcc/b4fb65c55ea3485f8509e6101dc7e6a0/dpdk/mk/rte.subdir.mk:35: recipe for target 'test-compress-perf' failed
make[4]: *** [test-compress-perf] Error 2
  CC cmdline_mtr.o
  CC cperf_test_pmd_cyclecount.o
  CC test_rwlock.o
  CC test_timer.o
--
  CC rxonly.o
  CC test_tailq.o
  CC test_string_fns.o
/tmp/UBT1804_K4.15.0_GCC7.3.0/x86_64-native-linuxapp-gcc/b4fb65c55ea3485f8509e6101dc7e6a0/dpdk/x86_64-native-linuxapp-gcc/lib/librte_eal.a(eal_dev.o): In function `sigbus_handler':
eal_dev.c:(.text+0x69): undefined reference to `gettid'
collect2: error: ld returned 1 exit status
/tmp/UBT1804_K4.15.0_GCC7.3.0/x86_64-native-linuxapp-gcc/b4fb65c55ea3485f8509e6101dc7e6a0/dpdk/mk/rte.app.mk:397: recipe for target 'dpdk-test-crypto-perf' failed
make[5]: *** [dpdk-test-crypto-perf] Error 1
/tmp/UBT1804_K4.15.0_GCC7.3.0/x86_64-native-linuxapp-gcc/b4fb65c55ea3485f8509e6101dc7e6a0/dpdk/mk/rte.subdir.mk:35: recipe for target 'test-crypto-perf' failed
make[4]: *** [test-crypto-perf] Error 2
make[5]: Warning: File 'test_eal_flags.c' has modification time 20763 s in the future
  CC test_cpuflags.o
  CC test_mp_secondary.o
  CC test_eal_flags.o
--
  CC test_eventdev.o
  CC test_event_ring.o
  CC test_event_eth_rx_adapter.o
/tmp/UBT1804_K4.15.0_GCC7.3.0/x86_64-native-linuxapp-gcc/b4fb65c55ea3485f8509e6101dc7e6a0/dpdk/x86_64-native-linuxapp-gcc/lib/librte_eal.a(eal_dev.o): In function `sigbus_handler':
eal_dev.c:(.text+0x69): undefined reference to `gettid'
collect2: error: ld returned 1 exit status
/tmp/UBT1804_K4.15.0_GCC7.3.0/x86_64-native-linuxapp-gcc/b4fb65c55ea3485f8509e6101dc7e6a0/dpdk/mk/rte.app.mk:397: recipe for target 'testpmd' failed
make[5]: *** [testpmd] Error 1
/tmp/UBT1804_K4.15.0_GCC7.3.0/x86_64-native-linuxapp-gcc/b4fb65c55ea3485f8509e6101dc7e6a0/dpdk/mk/rte.subdir.mk:35: recipe for target 'test-pmd' failed
make[4]: *** [test-pmd] Error 2
  CC test_event_eth_tx_adapter.o
  CC test_event_timer_adapter.o
  CC test_event_crypto_adapter.o
  CC test_rawdev.o
--
  CC test_ipsec.o
  MKRES test_resource_c.res.o
  LD test
/tmp/UBT1804_K4.15.0_GCC7.3.0/x86_64-native-linuxapp-gcc/b4fb65c55ea3485f8509e6101dc7e6a0/dpdk/x86_64-native-linuxapp-gcc/lib/librte_eal.a(eal_dev.o): In function `sigbus_handler':
eal_dev.c:(.text+0x69): undefined reference to `gettid'
collect2: error: ld returned 1 exit status
/tmp/UBT1804_K4.15.0_GCC7.3.0/x86_64-native-linuxapp-gcc/b4fb65c55ea3485f8509e6101dc7e6a0/dpdk/mk/rte.app.mk:397: recipe for target 'test' failed
make[5]: *** [test] Error 1
/tmp/UBT1804_K4.15.0_GCC7.3.0/x86_64-native-linuxapp-gcc/b4fb65c55ea3485f8509e6101dc7e6a0/dpdk/mk/rte.subdir.mk:35: recipe for target 'test' failed
make[4]: *** [test] Error 2
/tmp/UBT1804_K4.15.0_GCC7.3.0/x86_64-native-linuxapp-gcc/b4fb65c55ea3485f8509e6101dc7e6a0/dpdk/mk/rte.sdkbuild.mk:46: recipe for target 'app' failed
make[3]: *** [app] Error 2
/tmp/UBT1804_K4.15.0_GCC7.3.0/x86_64-native-linuxapp-gcc/b4fb65c55ea3485f8509e6101dc7e6a0/dpdk/mk/rte.sdkroot.mk:98: recipe for target 'all' failed
make[2]: *** [all] Error 2
/tmp/UBT1804_K4.15.0_GCC7.3.0/x86_64-native-linuxapp-gcc/b4fb65c55ea3485f8509e6101dc7e6a0/dpdk/mk/rte.sdkinstall.mk:57: recipe for target 'pre_install' failed
make[1]: *** [pre_install] Error 2
/tmp/UBT1804_K4.15.0_GCC7.3.0/x86_64-native-linuxapp-gcc/b4fb65c55ea3485f8509e6101dc7e6a0/dpdk/mk/rte.sdkroot.mk:77: recipe for target 'install' failed
make: *** [install] Error 2

*Failed Build #6:
OS: UBT1804
Target: x86_64-native-linuxapp-icc
make[7]: Warning: File 'eal_dev.c' has modification time 21217 s in the future
  CC eal_alarm.o
  CC eal_dev.o
  CC eal_common_lcore.o
  CC eal_common_timer.o
/tmp/UBT1804_K4.15.0_ICC19.0.0/x86_64-native-linuxapp-icc/b4fb65c55ea3485f8509e6101dc7e6a0/dpdk/lib/librte_eal/linuxapp/eal/eal_dev.c(75): warning #266: function "gettid" declared implicitly
  	RTE_LOG(DEBUG, EAL, "Thread[%d] catch SIGBUS, fault address:%p\n",
  	^

  CC eal_common_memzone.o
  CC eal_common_log.o
--
  CC rte_hypervisor.o
  CC rte_spinlock.o
  CC rte_cycles.o
  AR librte_eal.a
  INSTALL-LIB librte_eal.a
make[7]: warning:  Clock skew detected.  Your build may be incomplete.
== Build lib/librte_ring
== Build lib/librte_cmdline
== Build lib/librte_timer
== Build lib/librte_pci
== Build lib/librte_jobstats
--
  CC vmbus_common_uio.o
  AR librte_bus_vmbus.a
  AR librte_bus_pci.a
  INSTALL-LIB librte_bus_pci.a
  INSTALL-LIB librte_bus_vmbus.a
make[6]: warning:  Clock skew detected.  Your build may be incomplete.
  AR librte_bus_dpaa.a
  INSTALL-LIB librte_bus_dpaa.a
make[6]: warning:  Clock skew detected.  Your build may be incomplete.
== Build drivers/mempool
== Build drivers/mempool/bucket
== Build drivers/mempool/dpaa2
== Build drivers/mempool/stack
== Build drivers/mempool/dpaa
--
  CC enic_rxtx_vec_avx2.o
  CC ixgbe_phy.o
  CC nfp_mutex.o
  AR librte_pmd_netvsc.a
  INSTALL-LIB librte_pmd_netvsc.a
make[6]: warning:  Clock skew detected.  Your build may be incomplete.
== Build drivers/net/octeontx
  AR librte_pmd_iavf.a
  INSTALL-LIB librte_pmd_iavf.a
== Build drivers/net/pcap
  AR librte_pmd_enic.a
--
  CC nicvf_rxtx.o
  LD nfp_net.o
  CC ecore_l2.o
  AR librte_pmd_nfp.a
  INSTALL-LIB librte_pmd_nfp.a
make[6]: warning:  Clock skew detected.  Your build may be incomplete.
== Build drivers/net/vmxnet3
  CC bnxt_rxr.o
  PMDINFO em_ethdev.o.pmd.c
  CC em_ethdev.o.pmd.o
  CC vdev_netvsc.o
--
  CC ifpga_fme.o
  CC ifpga_enumerate.o
  CC ifpga_api.o
  CC ifpga_fme_dperf.o
  CC ifpga_fme_iperf.o
  CC ifpga_fme_error.o
  CC skeleton_rawdev.o
  PMDINFO dpaa2_cmdif.o.pmd.c
  CC dpaa2_cmdif.o.pmd.o
  CC ifpga_port_error.o
  CC ifpga_port.o
  PMDINFO skeleton_rawdev.o.pmd.c
  CC skeleton_rawdev.o.pmd.o
  LD dpaa2_cmdif.o
  AR librte_pmd_dpaa2_cmdif.a
--
eal_dev.c:(.text+0xf): undefined reference to `gettid'
  CC runtime.o
/tmp/UBT1804_K4.15.0_ICC19.0.0/x86_64-native-linuxapp-icc/b4fb65c55ea3485f8509e6101dc7e6a0/dpdk/x86_64-native-linuxapp-icc/lib/librte_eal.a(eal_dev.o): In function `sigbus_handler':
eal_dev.c:(.text+0xf): undefined reference to `gettid'
  CC test_resource.o
/tmp/UBT1804_K4.15.0_ICC19.0.0/x86_64-native-linuxapp-icc/b4fb65c55ea3485f8509e6101dc7e6a0/dpdk/mk/rte.app.mk:397: recipe for target 'cmdline_test' failed
make[5]: *** [cmdline_test] Error 1
/tmp/UBT1804_K4.15.0_ICC19.0.0/x86_64-native-linuxapp-icc/b4fb65c55ea3485f8509e6101dc7e6a0/dpdk/mk/rte.subdir.mk:35: recipe for target 'test-cmdline' failed
make[4]: *** [test-cmdline] Error 2
make[4]: *** Waiting for unfinished jobs....
/tmp/UBT1804_K4.15.0_ICC19.0.0/x86_64-native-linuxapp-icc/b4fb65c55ea3485f8509e6101dc7e6a0/dpdk/mk/rte.app.mk:397: recipe for target 'dpdk-procinfo' failed
make[5]: *** [dpdk-procinfo] Error 1
/tmp/UBT1804_K4.15.0_ICC19.0.0/x86_64-native-linuxapp-icc/b4fb65c55ea3485f8509e6101dc7e6a0/dpdk/mk/rte.subdir.mk:35: recipe for target 'proc-info' failed
make[4]: *** [proc-info] Error 2
  CC parameters.o
  CC pipeline_stub.o
/tmp/UBT1804_K4.15.0_ICC19.0.0/x86_64-native-linuxapp-icc/b4fb65c55ea3485f8509e6101dc7e6a0/dpdk/mk/rte.app.mk:397: recipe for target 'testacl' failed
make[5]: *** [testacl] Error 1
/tmp/UBT1804_K4.15.0_ICC19.0.0/x86_64-native-linuxapp-icc/b4fb65c55ea3485f8509e6101dc7e6a0/dpdk/mk/rte.subdir.mk:35: recipe for target 'test-acl' failed
make[4]: *** [test-acl] Error 2
  CC pipeline_hash.o
/tmp/UBT1804_K4.15.0_ICC19.0.0/x86_64-native-linuxapp-icc/b4fb65c55ea3485f8509e6101dc7e6a0/dpdk/x86_64-native-linuxapp-icc/lib/librte_eal.a(eal_dev.o): In function `sigbus_handler':
eal_dev.c:(.text+0xf): undefined reference to `gettid'
  CC cperf_test_throughput.o
  CC test_prefetch.o
/tmp/UBT1804_K4.15.0_ICC19.0.0/x86_64-native-linuxapp-icc/b4fb65c55ea3485f8509e6101dc7e6a0/dpdk/mk/rte.app.mk:397: recipe for target 'dpdk-pdump' failed
make[5]: *** [dpdk-pdump] Error 1
/tmp/UBT1804_K4.15.0_ICC19.0.0/x86_64-native-linuxapp-icc/b4fb65c55ea3485f8509e6101dc7e6a0/dpdk/mk/rte.subdir.mk:35: recipe for target 'pdump' failed
make[4]: *** [pdump] Error 2
  CC test_byteorder.o
  CC pipeline_lpm.o
  CC pipeline_lpm_ipv6.o
  CC pipeline_acl.o
--
/tmp/UBT1804_K4.15.0_ICC19.0.0/x86_64-native-linuxapp-icc/b4fb65c55ea3485f8509e6101dc7e6a0/dpdk/x86_64-native-linuxapp-icc/lib/librte_eal.a(eal_dev.o): In function `sigbus_handler':
eal_dev.c:(.text+0xf): undefined reference to `gettid'
  CC config.o
  CC test_memory.o
  CC cperf_test_pmd_cyclecount.o
/tmp/UBT1804_K4.15.0_ICC19.0.0/x86_64-native-linuxapp-icc/b4fb65c55ea3485f8509e6101dc7e6a0/dpdk/mk/rte.app.mk:397: recipe for target 'testpipeline' failed
make[5]: *** [testpipeline] Error 1
/tmp/UBT1804_K4.15.0_ICC19.0.0/x86_64-native-linuxapp-icc/b4fb65c55ea3485f8509e6101dc7e6a0/dpdk/mk/rte.subdir.mk:35: recipe for target 'test-pipeline' failed
make[4]: *** [test-pipeline] Error 2
  CC cperf_test_verify.o
  CC iofwd.o
  CC macfwd.o
  CC test_memzone.o
  CC test_bitmap.o
  CC cperf_test_vector_parsing.o
/tmp/UBT1804_K4.15.0_ICC19.0.0/x86_64-native-linuxapp-icc/b4fb65c55ea3485f8509e6101dc7e6a0/dpdk/x86_64-native-linuxapp-icc/lib/librte_eal.a(eal_dev.o): In function `sigbus_handler':
eal_dev.c:(.text+0xf): undefined reference to `gettid'
/tmp/UBT1804_K4.15.0_ICC19.0.0/x86_64-native-linuxapp-icc/b4fb65c55ea3485f8509e6101dc7e6a0/dpdk/mk/rte.app.mk:397: recipe for target 'dpdk-test-compress-perf' failed
make[5]: *** [dpdk-test-compress-perf] Error 1
/tmp/UBT1804_K4.15.0_ICC19.0.0/x86_64-native-linuxapp-icc/b4fb65c55ea3485f8509e6101dc7e6a0/dpdk/mk/rte.subdir.mk:35: recipe for target 'test-compress-perf' failed
make[4]: *** [test-compress-perf] Error 2
  CC cperf_test_common.o
  CC macswap.o
  CC test_reciprocal_division.o
  CC test_reciprocal_division_perf.o
--
  CC test_fbarray.o
  CC test_external_mem.o
/tmp/UBT1804_K4.15.0_ICC19.0.0/x86_64-native-linuxapp-icc/b4fb65c55ea3485f8509e6101dc7e6a0/dpdk/x86_64-native-linuxapp-icc/lib/librte_eal.a(eal_dev.o): In function `sigbus_handler':
eal_dev.c:(.text+0xf): undefined reference to `gettid'
  CC csumonly.o
/tmp/UBT1804_K4.15.0_ICC19.0.0/x86_64-native-linuxapp-icc/b4fb65c55ea3485f8509e6101dc7e6a0/dpdk/mk/rte.app.mk:397: recipe for target 'testbbdev' failed
make[5]: *** [testbbdev] Error 1
/tmp/UBT1804_K4.15.0_ICC19.0.0/x86_64-native-linuxapp-icc/b4fb65c55ea3485f8509e6101dc7e6a0/dpdk/mk/rte.subdir.mk:35: recipe for target 'test-bbdev' failed
make[4]: *** [test-bbdev] Error 2
  CC icmpecho.o
  CC noisy_vnf.o
  CC test_ring.o
  CC bpf_cmd.o
--
  CC softnicfwd.o
  CC test_ring_perf.o
/tmp/UBT1804_K4.15.0_ICC19.0.0/x86_64-native-linuxapp-icc/b4fb65c55ea3485f8509e6101dc7e6a0/dpdk/x86_64-native-linuxapp-icc/lib/librte_eal.a(eal_dev.o): In function `sigbus_handler':
eal_dev.c:(.text+0xf): undefined reference to `gettid'
  CC test_pmd_perf.o
/tmp/UBT1804_K4.15.0_ICC19.0.0/x86_64-native-linuxapp-icc/b4fb65c55ea3485f8509e6101dc7e6a0/dpdk/mk/rte.app.mk:397: recipe for target 'dpdk-test-crypto-perf' failed
make[5]: *** [dpdk-test-crypto-perf] Error 1
/tmp/UBT1804_K4.15.0_ICC19.0.0/x86_64-native-linuxapp-icc/b4fb65c55ea3485f8509e6101dc7e6a0/dpdk/mk/rte.subdir.mk:35: recipe for target 'test-crypto-perf' failed
make[4]: *** [test-crypto-perf] Error 2
  CC test_table.o
  CC test_table_pipeline.o
  CC test_table_tables.o
  CC test_table_ports.o
--
  CC test_mempool_perf.o
  CC test_mbuf.o
/tmp/UBT1804_K4.15.0_ICC19.0.0/x86_64-native-linuxapp-icc/b4fb65c55ea3485f8509e6101dc7e6a0/dpdk/x86_64-native-linuxapp-icc/lib/librte_eal.a(eal_dev.o): In function `sigbus_handler':
eal_dev.c:(.text+0xf): undefined reference to `gettid'
  CC test_logs.o
/tmp/UBT1804_K4.15.0_ICC19.0.0/x86_64-native-linuxapp-icc/b4fb65c55ea3485f8509e6101dc7e6a0/dpdk/mk/rte.app.mk:397: recipe for target 'testpmd' failed
make[5]: *** [testpmd] Error 1
/tmp/UBT1804_K4.15.0_ICC19.0.0/x86_64-native-linuxapp-icc/b4fb65c55ea3485f8509e6101dc7e6a0/dpdk/mk/rte.subdir.mk:35: recipe for target 'test-pmd' failed
make[4]: *** [test-pmd] Error 2
  CC test_memcpy.o
  CC test_memcpy_perf.o
  CC test_member.o
  CC test_member_perf.o
--
  CC test_bpf.o
  MKRES test_resource_c.res.o
  LD test
/tmp/UBT1804_K4.15.0_ICC19.0.0/x86_64-native-linuxapp-icc/b4fb65c55ea3485f8509e6101dc7e6a0/dpdk/x86_64-native-linuxapp-icc/lib/librte_eal.a(eal_dev.o): In function `sigbus_handler':
eal_dev.c:(.text+0xf): undefined reference to `gettid'
/tmp/UBT1804_K4.15.0_ICC19.0.0/x86_64-native-linuxapp-icc/b4fb65c55ea3485f8509e6101dc7e6a0/dpdk/mk/rte.app.mk:397: recipe for target 'test' failed
make[5]: *** [test] Error 1
/tmp/UBT1804_K4.15.0_ICC19.0.0/x86_64-native-linuxapp-icc/b4fb65c55ea3485f8509e6101dc7e6a0/dpdk/mk/rte.subdir.mk:35: recipe for target 'test' failed
make[4]: *** [test] Error 2
/tmp/UBT1804_K4.15.0_ICC19.0.0/x86_64-native-linuxapp-icc/b4fb65c55ea3485f8509e6101dc7e6a0/dpdk/mk/rte.sdkbuild.mk:46: recipe for target 'app' failed
make[3]: *** [app] Error 2
/tmp/UBT1804_K4.15.0_ICC19.0.0/x86_64-native-linuxapp-icc/b4fb65c55ea3485f8509e6101dc7e6a0/dpdk/mk/rte.sdkroot.mk:98: recipe for target 'all' failed
make[2]: *** [all] Error 2
/tmp/UBT1804_K4.15.0_ICC19.0.0/x86_64-native-linuxapp-icc/b4fb65c55ea3485f8509e6101dc7e6a0/dpdk/mk/rte.sdkinstall.mk:57: recipe for target 'pre_install' failed
make[1]: *** [pre_install] Error 2
/tmp/UBT1804_K4.15.0_ICC19.0.0/x86_64-native-linuxapp-icc/b4fb65c55ea3485f8509e6101dc7e6a0/dpdk/mk/rte.sdkroot.mk:77: recipe for target 'install' failed
make: *** [install] Error 2

*Failed Build #7:
OS: UBT1810
Target: x86_64-native-linuxapp-gcc
  CC eal_alarm.o
  CC eal_dev.o
  CC eal_common_lcore.o
In file included from /tmp/UBT1810_K4.18.0_GCC8.2.0/x86_64-native-linuxapp-gcc/b4fb65c55ea3485f8509e6101dc7e6a0/dpdk/lib/librte_eal/linuxapp/eal/eal_dev.c:14:
/tmp/UBT1810_K4.18.0_GCC8.2.0/x86_64-native-linuxapp-gcc/b4fb65c55ea3485f8509e6101dc7e6a0/dpdk/lib/librte_eal/linuxapp/eal/eal_dev.c: In function ‘sigbus_handler’:
/tmp/UBT1810_K4.18.0_GCC8.2.0/x86_64-native-linuxapp-gcc/b4fb65c55ea3485f8509e6101dc7e6a0/dpdk/lib/librte_eal/linuxapp/eal/eal_dev.c:76:8: warning: implicit declaration of function ‘gettid’; did you mean ‘getgid’? [-Wimplicit-function-declaration]
   (int)gettid(), info->si_addr);
        ^~~~~~
/tmp/UBT1810_K4.18.0_GCC8.2.0/x86_64-native-linuxapp-gcc/b4fb65c55ea3485f8509e6101dc7e6a0/dpdk/x86_64-native-linuxapp-gcc/include/rte_log.h:324:32: note: in definition of macro ‘RTE_LOG’
    RTE_LOGTYPE_ ## t, # t ": " __VA_ARGS__)
                                ^~~~~~~~~~~
/tmp/UBT1810_K4.18.0_GCC8.2.0/x86_64-native-linuxapp-gcc/b4fb65c55ea3485f8509e6101dc7e6a0/dpdk/lib/librte_eal/linuxapp/eal/eal_dev.c:76:8: warning: nested extern declaration of ‘gettid’ [-Wnested-externs]
   (int)gettid(), info->si_addr);
        ^~~~~~
/tmp/UBT1810_K4.18.0_GCC8.2.0/x86_64-native-linuxapp-gcc/b4fb65c55ea3485f8509e6101dc7e6a0/dpdk/x86_64-native-linuxapp-gcc/include/rte_log.h:324:32: note: in definition of macro ‘RTE_LOG’
    RTE_LOGTYPE_ ## t, # t ": " __VA_ARGS__)
                                ^~~~~~~~~~~
--
  CC rte_hypervisor.o
  CC rte_spinlock.o
  CC rte_cycles.o
  AR librte_eal.a
  INSTALL-LIB librte_eal.a
make[7]: warning:  Clock skew detected.  Your build may be incomplete.
== Build lib/librte_ring
== Build lib/librte_timer
== Build lib/librte_cmdline
== Build lib/librte_meter
== Build lib/librte_pci
--
  CC vdev_params.o
  CC [M]  /tmp/UBT1810_K4.18.0_GCC8.2.0/x86_64-native-linuxapp-gcc/b4fb65c55ea3485f8509e6101dc7e6a0/dpdk/x86_64-native-linuxapp-gcc/build/kernel/linux/kni/kni_net.o
  AR librte_bus_pci.a
  AR librte_bus_ifpga.a
  INSTALL-LIB librte_bus_pci.a
make[6]: warning:  Clock skew detected.  Your build may be incomplete.
  CC base/fman/fman.o
  CC vmbus_channel.o
  INSTALL-LIB librte_bus_ifpga.a
  AR librte_bus_vdev.a
  INSTALL-LIB librte_bus_vdev.a
--
INSTALL-MODULE igb_uio.ko
  LD [M]  /tmp/UBT1810_K4.18.0_GCC8.2.0/x86_64-native-linuxapp-gcc/b4fb65c55ea3485f8509e6101dc7e6a0/dpdk/x86_64-native-linuxapp-gcc/build/kernel/linux/kni/rte_kni.ko
INSTALL-MODULE rte_kni.ko
  AR librte_bus_dpaa.a
  INSTALL-LIB librte_bus_dpaa.a
make[6]: warning:  Clock skew detected.  Your build may be incomplete.
== Build drivers/mempool
== Build drivers/mempool/bucket
== Build drivers/mempool/dpaa
== Build drivers/mempool/dpaa2
== Build drivers/mempool/ring
--
  CC bnxt_cpr.o
  CC nfp_mutex.o
  CC rte_eth_null.o
  AR librte_pmd_netvsc.a
  INSTALL-LIB librte_pmd_netvsc.a
make[6]: warning:  Clock skew detected.  Your build may be incomplete.
== Build drivers/net/octeontx
  CC nfp_resource.o
  CC i40e_tm.o
  CC bnxt_ethdev.o
  CC ice_nvm.o
--
  PMDINFO vdev_netvsc.o.pmd.c
  INSTALL-LIB librte_pmd_nfp.a
  CC vdev_netvsc.o.pmd.o
  CC sfc_filter.o
  LD vdev_netvsc.o
make[6]: warning:  Clock skew detected.  Your build may be incomplete.
== Build drivers/net/vmxnet3
  AR librte_pmd_vdev_netvsc.a
  INSTALL-LIB librte_pmd_vdev_netvsc.a
== Build drivers/net/kni
  CC nicvf_ethdev.o
--
  PMDINFO dpaa2_cmdif.o.pmd.c
  CC dpaa2_cmdif.o.pmd.o
  LD dpaa2_cmdif.o
  AR librte_pmd_dpaa2_cmdif.a
  INSTALL-LIB librte_pmd_dpaa2_cmdif.a
  CC ifpga_fme_error.o
  CC ifpga_port.o
  CC ifpga_port_error.o
  CC opae_hw_api.o
  CC opae_ifpga_hw_api.o
  CC opae_debug.o
  CC ifpga_fme_pr.o
  CC ifpga_rawdev.o
--
  CC cperf_ops.o
  LD testacl
  CC test.o
/usr/bin/ld: /tmp/UBT1810_K4.18.0_GCC8.2.0/x86_64-native-linuxapp-gcc/b4fb65c55ea3485f8509e6101dc7e6a0/dpdk/x86_64-native-linuxapp-gcc/lib/librte_eal.a(eal_dev.o): in function `sigbus_handler':
eal_dev.c:(.text+0x69): undefined reference to `gettid'
collect2: error: ld returned 1 exit status
make[5]: *** [/tmp/UBT1810_K4.18.0_GCC8.2.0/x86_64-native-linuxapp-gcc/b4fb65c55ea3485f8509e6101dc7e6a0/dpdk/mk/rte.app.mk:399: dpdk-procinfo] Error 1
  CC resource.o
make[4]: *** [/tmp/UBT1810_K4.18.0_GCC8.2.0/x86_64-native-linuxapp-gcc/b4fb65c55ea3485f8509e6101dc7e6a0/dpdk/mk/rte.subdir.mk:37: proc-info] Error 2
make[4]: *** Waiting for unfinished jobs....
  CC init.o
  CC cperf_options_parsing.o
  CC test_resource.o
/usr/bin/ld: /tmp/UBT1810_K4.18.0_GCC8.2.0/x86_64-native-linuxapp-gcc/b4fb65c55ea3485f8509e6101dc7e6a0/dpdk/x86_64-native-linuxapp-gcc/lib/librte_eal.a(eal_dev.o): in function `sigbus_handler':
eal_dev.c:(.text+0x69): undefined reference to `gettid'
collect2: error: ld returned 1 exit status
make[5]: *** [/tmp/UBT1810_K4.18.0_GCC8.2.0/x86_64-native-linuxapp-gcc/b4fb65c55ea3485f8509e6101dc7e6a0/dpdk/mk/rte.app.mk:399: cmdline_test] Error 1
make[4]: *** [/tmp/UBT1810_K4.18.0_GCC8.2.0/x86_64-native-linuxapp-gcc/b4fb65c55ea3485f8509e6101dc7e6a0/dpdk/mk/rte.subdir.mk:37: test-cmdline] Error 2
/usr/bin/ld: /tmp/UBT1810_K4.18.0_GCC8.2.0/x86_64-native-linuxapp-gcc/b4fb65c55ea3485f8509e6101dc7e6a0/dpdk/x86_64-native-linuxapp-gcc/lib/librte_eal.a(eal_dev.o): in function `sigbus_handler':
eal_dev.c:(.text+0x69): undefined reference to `gettid'
collect2: error: ld returned 1 exit status
make[5]: *** [/tmp/UBT1810_K4.18.0_GCC8.2.0/x86_64-native-linuxapp-gcc/b4fb65c55ea3485f8509e6101dc7e6a0/dpdk/mk/rte.app.mk:399: dpdk-pdump] Error 1
make[4]: *** [/tmp/UBT1810_K4.18.0_GCC8.2.0/x86_64-native-linuxapp-gcc/b4fb65c55ea3485f8509e6101dc7e6a0/dpdk/mk/rte.subdir.mk:37: pdump] Error 2
  CC test_prefetch.o
  CC cperf_test_vectors.o
  CC comp_perf_options_parse.o
--
  CC test_per_lcore.o
  CC test_atomic.o
  CC runtime.o
/usr/bin/ld: /tmp/UBT1810_K4.18.0_GCC8.2.0/x86_64-native-linuxapp-gcc/b4fb65c55ea3485f8509e6101dc7e6a0/dpdk/x86_64-native-linuxapp-gcc/lib/librte_eal.a(eal_dev.o): in function `sigbus_handler':
eal_dev.c:(.text+0x69): undefined reference to `gettid'
collect2: error: ld returned 1 exit status
make[5]: *** [/tmp/UBT1810_K4.18.0_GCC8.2.0/x86_64-native-linuxapp-gcc/b4fb65c55ea3485f8509e6101dc7e6a0/dpdk/mk/rte.app.mk:399: testacl] Error 1
make[4]: *** [/tmp/UBT1810_K4.18.0_GCC8.2.0/x86_64-native-linuxapp-gcc/b4fb65c55ea3485f8509e6101dc7e6a0/dpdk/mk/rte.subdir.mk:37: test-acl] Error 2
  CC test_bbdev_perf.o
  CC test_bbdev_vector.o
  CC cperf_test_throughput.o
--
  CC test_ring_perf.o
  CC test_pmd_perf.o
  LD dpdk-test-compress-perf
/usr/bin/ld: /tmp/UBT1810_K4.18.0_GCC8.2.0/x86_64-native-linuxapp-gcc/b4fb65c55ea3485f8509e6101dc7e6a0/dpdk/x86_64-native-linuxapp-gcc/lib/librte_eal.a(eal_dev.o): in function `sigbus_handler':
eal_dev.c:(.text+0x69): undefined reference to `gettid'
collect2: error: ld returned 1 exit status
make[5]: *** [/tmp/UBT1810_K4.18.0_GCC8.2.0/x86_64-native-linuxapp-gcc/b4fb65c55ea3485f8509e6101dc7e6a0/dpdk/mk/rte.app.mk:399: testpipeline] Error 1
make[4]: *** [/tmp/UBT1810_K4.18.0_GCC8.2.0/x86_64-native-linuxapp-gcc/b4fb65c55ea3485f8509e6101dc7e6a0/dpdk/mk/rte.subdir.mk:37: test-pipeline] Error 2
  CC test_table.o
/usr/bin/ld: /tmp/UBT1810_K4.18.0_GCC8.2.0/x86_64-native-linuxapp-gcc/b4fb65c55ea3485f8509e6101dc7e6a0/dpdk/x86_64-native-linuxapp-gcc/lib/librte_eal.a(eal_dev.o): in function `sigbus_handler':
eal_dev.c:(.text+0x69): undefined reference to `gettid'
collect2: error: ld returned 1 exit status
make[5]: *** [/tmp/UBT1810_K4.18.0_GCC8.2.0/x86_64-native-linuxapp-gcc/b4fb65c55ea3485f8509e6101dc7e6a0/dpdk/mk/rte.app.mk:399: dpdk-test-crypto-perf] Error 1
make[4]: *** [/tmp/UBT1810_K4.18.0_GCC8.2.0/x86_64-native-linuxapp-gcc/b4fb65c55ea3485f8509e6101dc7e6a0/dpdk/mk/rte.subdir.mk:37: test-crypto-perf] Error 2
  CC test_table_pipeline.o
  CC cmdline_tm.o
/usr/bin/ld: /tmp/UBT1810_K4.18.0_GCC8.2.0/x86_64-native-linuxapp-gcc/b4fb65c55ea3485f8509e6101dc7e6a0/dpdk/x86_64-native-linuxapp-gcc/lib/librte_eal.a(eal_dev.o): in function `sigbus_handler':
eal_dev.c:(.text+0x69): undefined reference to `gettid'
collect2: error: ld returned 1 exit status
make[5]: *** [/tmp/UBT1810_K4.18.0_GCC8.2.0/x86_64-native-linuxapp-gcc/b4fb65c55ea3485f8509e6101dc7e6a0/dpdk/mk/rte.app.mk:399: dpdk-test-compress-perf] Error 1
make[4]: *** [/tmp/UBT1810_K4.18.0_GCC8.2.0/x86_64-native-linuxapp-gcc/b4fb65c55ea3485f8509e6101dc7e6a0/dpdk/mk/rte.subdir.mk:37: test-compress-perf] Error 2
  CC config.o
  CC test_table_tables.o
  CC iofwd.o
--
  CC test_table_combined.o
  CC test_table_acl.o
  CC macfwd.o
/usr/bin/ld: /tmp/UBT1810_K4.18.0_GCC8.2.0/x86_64-native-linuxapp-gcc/b4fb65c55ea3485f8509e6101dc7e6a0/dpdk/x86_64-native-linuxapp-gcc/lib/librte_eal.a(eal_dev.o): in function `sigbus_handler':
eal_dev.c:(.text+0x69): undefined reference to `gettid'
collect2: error: ld returned 1 exit status
make[5]: *** [/tmp/UBT1810_K4.18.0_GCC8.2.0/x86_64-native-linuxapp-gcc/b4fb65c55ea3485f8509e6101dc7e6a0/dpdk/mk/rte.app.mk:399: testbbdev] Error 1
make[4]: *** [/tmp/UBT1810_K4.18.0_GCC8.2.0/x86_64-native-linuxapp-gcc/b4fb65c55ea3485f8509e6101dc7e6a0/dpdk/mk/rte.subdir.mk:37: test-bbdev] Error 2
  CC macswap.o
  CC flowgen.o
  CC test_flow_classify.o
--
  CC test_lpm_perf.o
  CC test_lpm6.o
  CC test_lpm6_perf.o
/usr/bin/ld: /tmp/UBT1810_K4.18.0_GCC8.2.0/x86_64-native-linuxapp-gcc/b4fb65c55ea3485f8509e6101dc7e6a0/dpdk/x86_64-native-linuxapp-gcc/lib/librte_eal.a(eal_dev.o): in function `sigbus_handler':
eal_dev.c:(.text+0x69): undefined reference to `gettid'
collect2: error: ld returned 1 exit status
make[5]: *** [/tmp/UBT1810_K4.18.0_GCC8.2.0/x86_64-native-linuxapp-gcc/b4fb65c55ea3485f8509e6101dc7e6a0/dpdk/mk/rte.app.mk:399: testpmd] Error 1
make[4]: *** [/tmp/UBT1810_K4.18.0_GCC8.2.0/x86_64-native-linuxapp-gcc/b4fb65c55ea3485f8509e6101dc7e6a0/dpdk/mk/rte.subdir.mk:37: test-pmd] Error 2
  CC test_debug.o
  CC test_errno.o
  CC test_tailq.o
--
  CC test_ipsec.o
  MKRES test_resource_c.res.o
  LD test
/usr/bin/ld: /tmp/UBT1810_K4.18.0_GCC8.2.0/x86_64-native-linuxapp-gcc/b4fb65c55ea3485f8509e6101dc7e6a0/dpdk/x86_64-native-linuxapp-gcc/lib/librte_eal.a(eal_dev.o): in function `sigbus_handler':
eal_dev.c:(.text+0x69): undefined reference to `gettid'
collect2: error: ld returned 1 exit status
make[5]: *** [/tmp/UBT1810_K4.18.0_GCC8.2.0/x86_64-native-linuxapp-gcc/b4fb65c55ea3485f8509e6101dc7e6a0/dpdk/mk/rte.app.mk:399: test] Error 1
make[4]: *** [/tmp/UBT1810_K4.18.0_GCC8.2.0/x86_64-native-linuxapp-gcc/b4fb65c55ea3485f8509e6101dc7e6a0/dpdk/mk/rte.subdir.mk:37: test] Error 2
make[3]: *** [/tmp/UBT1810_K4.18.0_GCC8.2.0/x86_64-native-linuxapp-gcc/b4fb65c55ea3485f8509e6101dc7e6a0/dpdk/mk/rte.sdkbuild.mk:48: app] Error 2
make[2]: *** [/tmp/UBT1810_K4.18.0_GCC8.2.0/x86_64-native-linuxapp-gcc/b4fb65c55ea3485f8509e6101dc7e6a0/dpdk/mk/rte.sdkroot.mk:99: all] Error 2
make[1]: *** [/tmp/UBT1810_K4.18.0_GCC8.2.0/x86_64-native-linuxapp-gcc/b4fb65c55ea3485f8509e6101dc7e6a0/dpdk/mk/rte.sdkinstall.mk:58: pre_install] Error 2

*Failed Build #8:
OS: RHEL75
Target: x86_64-native-linuxapp-gcc
  CC eal_interrupts.o
  CC eal_alarm.o
  CC eal_dev.o
  CC eal_common_lcore.o
/tmp/RHEL75_K3.10.0_GCC4.8.5/x86_64-native-linuxapp-gcc/b4fb65c55ea3485f8509e6101dc7e6a0/dpdk/lib/librte_eal/linuxapp/eal/eal_dev.c: In function ‘sigbus_handler’:
/tmp/RHEL75_K3.10.0_GCC4.8.5/x86_64-native-linuxapp-gcc/b4fb65c55ea3485f8509e6101dc7e6a0/dpdk/lib/librte_eal/linuxapp/eal/eal_dev.c:75:2: warning: implicit declaration of function ‘gettid’ [-Wimplicit-function-declaration]
  RTE_LOG(DEBUG, EAL, "Thread[%d] catch SIGBUS, fault address:%p\n",
  ^
/tmp/RHEL75_K3.10.0_GCC4.8.5/x86_64-native-linuxapp-gcc/b4fb65c55ea3485f8509e6101dc7e6a0/dpdk/lib/librte_eal/linuxapp/eal/eal_dev.c:75:2: warning: nested extern declaration of ‘gettid’ [-Wnested-externs]
  CC eal_common_timer.o
  CC eal_common_memzone.o
  CC eal_common_log.o
  CC eal_common_launch.o
  CC eal_common_memalloc.o
--
  SYMLINK-FILE include/rte_pmd_dpaa2_cmdif.h
  CC ifpga_fme.o
  CC ifpga_fme_iperf.o
  CC ifpga_fme_dperf.o
  CC dpaa2_cmdif.o
  CC ifpga_fme_error.o
  PMDINFO skeleton_rawdev.o.pmd.c
  CC skeleton_rawdev.o.pmd.o
  CC ifpga_port.o
  LD skeleton_rawdev.o
  PMDINFO dpaa2_cmdif.o.pmd.c
  CC dpaa2_cmdif.o.pmd.o
  CC ifpga_port_error.o
  AR librte_pmd_skeleton_rawdev.a
  CC opae_hw_api.o
  CC opae_ifpga_hw_api.o
  CC opae_debug.o
  INSTALL-LIB librte_pmd_skeleton_rawdev.a
--
  CC init.o
  CC cperf_options_parsing.o
  CC test_prefetch.o
/tmp/RHEL75_K3.10.0_GCC4.8.5/x86_64-native-linuxapp-gcc/b4fb65c55ea3485f8509e6101dc7e6a0/dpdk/x86_64-native-linuxapp-gcc/lib/librte_eal.a(eal_dev.o): In function `sigbus_handler':
eal_dev.c:(.text+0x59): undefined reference to `gettid'
collect2: error: ld returned 1 exit status
make[5]: *** [testacl] Error 1
  CC comp_perf_options_parse.o
make[4]: *** [test-acl] Error 2
make[4]: *** Waiting for unfinished jobs....
  CC parameters.o
  CC test_byteorder.o
  CC test_bbdev_perf.o
/tmp/RHEL75_K3.10.0_GCC4.8.5/x86_64-native-linuxapp-gcc/b4fb65c55ea3485f8509e6101dc7e6a0/dpdk/x86_64-native-linuxapp-gcc/lib/librte_eal.a(eal_dev.o): In function `sigbus_handler':
eal_dev.c:(.text+0x59): undefined reference to `gettid'
collect2: error: ld returned 1 exit status
make[5]: *** [dpdk-procinfo] Error 1
make[4]: *** [proc-info] Error 2
  CC test_bbdev_vector.o
  CC runtime.o
  CC test_per_lcore.o
/tmp/RHEL75_K3.10.0_GCC4.8.5/x86_64-native-linuxapp-gcc/b4fb65c55ea3485f8509e6101dc7e6a0/dpdk/x86_64-native-linuxapp-gcc/lib/librte_eal.a(eal_dev.o): In function `sigbus_handler':
eal_dev.c:(.text+0x59): undefined reference to `gettid'
collect2: error: ld returned 1 exit status
make[5]: *** [dpdk-pdump] Error 1
make[4]: *** [pdump] Error 2
  CC test_atomic.o
/tmp/RHEL75_K3.10.0_GCC4.8.5/x86_64-native-linuxapp-gcc/b4fb65c55ea3485f8509e6101dc7e6a0/dpdk/x86_64-native-linuxapp-gcc/lib/librte_eal.a(eal_dev.o): In function `sigbus_handler':
eal_dev.c:(.text+0x59): undefined reference to `gettid'
  CC comp_perf_test_verify.o
collect2: error: ld returned 1 exit status
  CC test_barrier.o
make[5]: *** [cmdline_test] Error 1
make[4]: *** [test-cmdline] Error 2
  CC cperf_test_vectors.o
  CC comp_perf_test_benchmark.o
--
  CC test_external_mem.o
  CC cperf_test_pmd_cyclecount.o
  CC test_ring.o
/tmp/RHEL75_K3.10.0_GCC4.8.5/x86_64-native-linuxapp-gcc/b4fb65c55ea3485f8509e6101dc7e6a0/dpdk/x86_64-native-linuxapp-gcc/lib/librte_eal.a(eal_dev.o): In function `sigbus_handler':
eal_dev.c:(.text+0x59): undefined reference to `gettid'
collect2: error: ld returned 1 exit status
make[5]: *** [dpdk-test-compress-perf] Error 1
make[4]: *** [test-compress-perf] Error 2
  CC test_ring_perf.o
  CC test_pmd_perf.o
/tmp/RHEL75_K3.10.0_GCC4.8.5/x86_64-native-linuxapp-gcc/b4fb65c55ea3485f8509e6101dc7e6a0/dpdk/x86_64-native-linuxapp-gcc/lib/librte_eal.a(eal_dev.o): In function `sigbus_handler':
eal_dev.c:(.text+0x59): undefined reference to `gettid'
collect2: error: ld returned 1 exit status
make[5]: *** [testpipeline] Error 1
make[4]: *** [test-pipeline] Error 2
  CC test_table.o
  CC config.o
  CC iofwd.o
--
  CC cperf_test_vector_parsing.o
  CC test_table_combined.o
  CC rxonly.o
/tmp/RHEL75_K3.10.0_GCC4.8.5/x86_64-native-linuxapp-gcc/b4fb65c55ea3485f8509e6101dc7e6a0/dpdk/x86_64-native-linuxapp-gcc/lib/librte_eal.a(eal_dev.o): In function `sigbus_handler':
eal_dev.c:(.text+0x59): undefined reference to `gettid'
collect2: error: ld returned 1 exit status
make[5]: *** [testbbdev] Error 1
make[4]: *** [test-bbdev] Error 2
  CC txonly.o
  CC cperf_test_common.o
  CC csumonly.o
--
  CC bpf_cmd.o
  CC test_timer.o
  CC util.o
/tmp/RHEL75_K3.10.0_GCC4.8.5/x86_64-native-linuxapp-gcc/b4fb65c55ea3485f8509e6101dc7e6a0/dpdk/x86_64-native-linuxapp-gcc/lib/librte_eal.a(eal_dev.o): In function `sigbus_handler':
eal_dev.c:(.text+0x59): undefined reference to `gettid'
collect2: error: ld returned 1 exit status
make[5]: *** [dpdk-test-crypto-perf] Error 1
make[4]: *** [test-crypto-perf] Error 2
  CC softnicfwd.o
  CC test_timer_perf.o
  CC test_timer_racecond.o
--
  CC test_errno.o
  CC test_tailq.o
  CC test_string_fns.o
/tmp/RHEL75_K3.10.0_GCC4.8.5/x86_64-native-linuxapp-gcc/b4fb65c55ea3485f8509e6101dc7e6a0/dpdk/x86_64-native-linuxapp-gcc/lib/librte_eal.a(eal_dev.o): In function `sigbus_handler':
eal_dev.c:(.text+0x59): undefined reference to `gettid'
collect2: error: ld returned 1 exit status
make[5]: *** [testpmd] Error 1
make[4]: *** [test-pmd] Error 2
  CC test_cpuflags.o
  CC test_mp_secondary.o
  CC test_eal_flags.o
--
  CC test_ipsec.o
  MKRES test_resource_c.res.o
  LD test
/tmp/RHEL75_K3.10.0_GCC4.8.5/x86_64-native-linuxapp-gcc/b4fb65c55ea3485f8509e6101dc7e6a0/dpdk/x86_64-native-linuxapp-gcc/lib/librte_eal.a(eal_dev.o): In function `sigbus_handler':
eal_dev.c:(.text+0x59): undefined reference to `gettid'
collect2: error: ld returned 1 exit status
make[5]: *** [test] Error 1
make[4]: *** [test] Error 2
make[3]: *** [app] Error 2
make[2]: *** [all] Error 2
make[1]: *** [pre_install] Error 2

*Failed Build #9:
OS: FC28
Target: x86_64-native-linuxapp-gcc
  CC eal_dev.o
  CC eal_common_lcore.o
  CC eal_common_timer.o
In file included from /tmp/FC28_K4.16.3_GCC8.0.1/x86_64-native-linuxapp-gcc/b4fb65c55ea3485f8509e6101dc7e6a0/dpdk/lib/librte_eal/linuxapp/eal/eal_dev.c:14:
/tmp/FC28_K4.16.3_GCC8.0.1/x86_64-native-linuxapp-gcc/b4fb65c55ea3485f8509e6101dc7e6a0/dpdk/lib/librte_eal/linuxapp/eal/eal_dev.c: In function ‘sigbus_handler’:
/tmp/FC28_K4.16.3_GCC8.0.1/x86_64-native-linuxapp-gcc/b4fb65c55ea3485f8509e6101dc7e6a0/dpdk/lib/librte_eal/linuxapp/eal/eal_dev.c:76:8: warning: implicit declaration of function ‘gettid’; did you mean ‘getgid’? [-Wimplicit-function-declaration]
   (int)gettid(), info->si_addr);
        ^~~~~~
/tmp/FC28_K4.16.3_GCC8.0.1/x86_64-native-linuxapp-gcc/b4fb65c55ea3485f8509e6101dc7e6a0/dpdk/x86_64-native-linuxapp-gcc/include/rte_log.h:324:32: note: in definition of macro ‘RTE_LOG’
    RTE_LOGTYPE_ ## t, # t ": " __VA_ARGS__)
                                ^~~~~~~~~~~
/tmp/FC28_K4.16.3_GCC8.0.1/x86_64-native-linuxapp-gcc/b4fb65c55ea3485f8509e6101dc7e6a0/dpdk/lib/librte_eal/linuxapp/eal/eal_dev.c:76:8: warning: nested extern declaration of ‘gettid’ [-Wnested-externs]
   (int)gettid(), info->si_addr);
        ^~~~~~
/tmp/FC28_K4.16.3_GCC8.0.1/x86_64-native-linuxapp-gcc/b4fb65c55ea3485f8509e6101dc7e6a0/dpdk/x86_64-native-linuxapp-gcc/include/rte_log.h:324:32: note: in definition of macro ‘RTE_LOG’
    RTE_LOGTYPE_ ## t, # t ": " __VA_ARGS__)
                                ^~~~~~~~~~~
--
  CC ifpga_enumerate.o
  CC ifpga_feature_dev.o
  CC ifpga_fme.o
  CC ifpga_fme_iperf.o
  CC ifpga_fme_dperf.o
  CC ifpga_fme_error.o
  CC ifpga_port.o
  PMDINFO skeleton_rawdev.o.pmd.c
  CC ifpga_port_error.o
  CC skeleton_rawdev.o.pmd.o
  CC opae_hw_api.o
  CC opae_ifpga_hw_api.o
  LD skeleton_rawdev.o
  CC opae_debug.o
--
  CC config.o
  LD testacl
  CC cperf_ops.o
/tmp/FC28_K4.16.3_GCC8.0.1/x86_64-native-linuxapp-gcc/b4fb65c55ea3485f8509e6101dc7e6a0/dpdk/x86_64-native-linuxapp-gcc/lib/librte_eal.a(eal_dev.o): In function `sigbus_handler':
eal_dev.c:(.text+0x59): undefined reference to `gettid'
collect2: error: ld returned 1 exit status
make[5]: *** [/tmp/FC28_K4.16.3_GCC8.0.1/x86_64-native-linuxapp-gcc/b4fb65c55ea3485f8509e6101dc7e6a0/dpdk/mk/rte.app.mk:399: cmdline_test] Error 1
make[4]: *** [/tmp/FC28_K4.16.3_GCC8.0.1/x86_64-native-linuxapp-gcc/b4fb65c55ea3485f8509e6101dc7e6a0/dpdk/mk/rte.subdir.mk:35: test-cmdline] Error 2
make[4]: *** Waiting for unfinished jobs....
  CC init.o
  CC comp_perf_options_parse.o
  CC test.o
/tmp/FC28_K4.16.3_GCC8.0.1/x86_64-native-linuxapp-gcc/b4fb65c55ea3485f8509e6101dc7e6a0/dpdk/x86_64-native-linuxapp-gcc/lib/librte_eal.a(eal_dev.o): In function `sigbus_handler':
eal_dev.c:(.text+0x59): undefined reference to `gettid'
collect2: error: ld returned 1 exit status
make[5]: *** [/tmp/FC28_K4.16.3_GCC8.0.1/x86_64-native-linuxapp-gcc/b4fb65c55ea3485f8509e6101dc7e6a0/dpdk/mk/rte.app.mk:399: dpdk-pdump] Error 1
make[4]: *** [/tmp/FC28_K4.16.3_GCC8.0.1/x86_64-native-linuxapp-gcc/b4fb65c55ea3485f8509e6101dc7e6a0/dpdk/mk/rte.subdir.mk:35: pdump] Error 2
  CC resource.o
/tmp/FC28_K4.16.3_GCC8.0.1/x86_64-native-linuxapp-gcc/b4fb65c55ea3485f8509e6101dc7e6a0/dpdk/x86_64-native-linuxapp-gcc/lib/librte_eal.a(eal_dev.o): In function `sigbus_handler':
eal_dev.c:(.text+0x59): undefined reference to `gettid'
collect2: error: ld returned 1 exit status
make[5]: *** [/tmp/FC28_K4.16.3_GCC8.0.1/x86_64-native-linuxapp-gcc/b4fb65c55ea3485f8509e6101dc7e6a0/dpdk/mk/rte.app.mk:399: testacl] Error 1
make[4]: *** [/tmp/FC28_K4.16.3_GCC8.0.1/x86_64-native-linuxapp-gcc/b4fb65c55ea3485f8509e6101dc7e6a0/dpdk/mk/rte.subdir.mk:35: test-acl] Error 2
  CC test_resource.o
/tmp/FC28_K4.16.3_GCC8.0.1/x86_64-native-linuxapp-gcc/b4fb65c55ea3485f8509e6101dc7e6a0/dpdk/x86_64-native-linuxapp-gcc/lib/librte_eal.a(eal_dev.o): In function `sigbus_handler':
eal_dev.c:(.text+0x59): undefined reference to `gettid'
collect2: error: ld returned 1 exit status
make[5]: *** [/tmp/FC28_K4.16.3_GCC8.0.1/x86_64-native-linuxapp-gcc/b4fb65c55ea3485f8509e6101dc7e6a0/dpdk/mk/rte.app.mk:399: dpdk-procinfo] Error 1
make[4]: *** [/tmp/FC28_K4.16.3_GCC8.0.1/x86_64-native-linuxapp-gcc/b4fb65c55ea3485f8509e6101dc7e6a0/dpdk/mk/rte.subdir.mk:35: proc-info] Error 2
  CC runtime.o
  CC test_prefetch.o
  CC test_byteorder.o
--
  CC test_table.o
  CC cperf_test_latency.o
  CC cperf_test_pmd_cyclecount.o
/tmp/FC28_K4.16.3_GCC8.0.1/x86_64-native-linuxapp-gcc/b4fb65c55ea3485f8509e6101dc7e6a0/dpdk/x86_64-native-linuxapp-gcc/lib/librte_eal.a(eal_dev.o): In function `sigbus_handler':
eal_dev.c:(.text+0x59): undefined reference to `gettid'
collect2: error: ld returned 1 exit status
make[5]: *** [/tmp/FC28_K4.16.3_GCC8.0.1/x86_64-native-linuxapp-gcc/b4fb65c55ea3485f8509e6101dc7e6a0/dpdk/mk/rte.app.mk:399: testpipeline] Error 1
make[4]: *** [/tmp/FC28_K4.16.3_GCC8.0.1/x86_64-native-linuxapp-gcc/b4fb65c55ea3485f8509e6101dc7e6a0/dpdk/mk/rte.subdir.mk:35: test-pipeline] Error 2
  CC cperf_test_verify.o
  CC test_table_pipeline.o
  LD dpdk-test-compress-perf
--
  CC test_table_ports.o
  CC test_table_combined.o
  CC cmdline_flow.o
/tmp/FC28_K4.16.3_GCC8.0.1/x86_64-native-linuxapp-gcc/b4fb65c55ea3485f8509e6101dc7e6a0/dpdk/x86_64-native-linuxapp-gcc/lib/librte_eal.a(eal_dev.o): In function `sigbus_handler':
eal_dev.c:(.text+0x59): undefined reference to `gettid'
collect2: error: ld returned 1 exit status
make[5]: *** [/tmp/FC28_K4.16.3_GCC8.0.1/x86_64-native-linuxapp-gcc/b4fb65c55ea3485f8509e6101dc7e6a0/dpdk/mk/rte.app.mk:399: dpdk-test-compress-perf] Error 1
make[4]: *** [/tmp/FC28_K4.16.3_GCC8.0.1/x86_64-native-linuxapp-gcc/b4fb65c55ea3485f8509e6101dc7e6a0/dpdk/mk/rte.subdir.mk:35: test-compress-perf] Error 2
  CC cmdline_mtr.o
  CC test_bbdev_vector.o
  CC cmdline_tm.o
  LD dpdk-test-crypto-perf
  CC config.o
  CC test_table_acl.o
/tmp/FC28_K4.16.3_GCC8.0.1/x86_64-native-linuxapp-gcc/b4fb65c55ea3485f8509e6101dc7e6a0/dpdk/x86_64-native-linuxapp-gcc/lib/librte_eal.a(eal_dev.o): In function `sigbus_handler':
eal_dev.c:(.text+0x59): undefined reference to `gettid'
collect2: error: ld returned 1 exit status
make[5]: *** [/tmp/FC28_K4.16.3_GCC8.0.1/x86_64-native-linuxapp-gcc/b4fb65c55ea3485f8509e6101dc7e6a0/dpdk/mk/rte.app.mk:399: dpdk-test-crypto-perf] Error 1
make[4]: *** [/tmp/FC28_K4.16.3_GCC8.0.1/x86_64-native-linuxapp-gcc/b4fb65c55ea3485f8509e6101dc7e6a0/dpdk/mk/rte.subdir.mk:35: test-crypto-perf] Error 2
  CC test_flow_classify.o
  CC test_rwlock.o
  LD testbbdev
--
  CC test_timer_perf.o
  CC test_timer_racecond.o
  CC test_mempool.o
/tmp/FC28_K4.16.3_GCC8.0.1/x86_64-native-linuxapp-gcc/b4fb65c55ea3485f8509e6101dc7e6a0/dpdk/x86_64-native-linuxapp-gcc/lib/librte_eal.a(eal_dev.o): In function `sigbus_handler':
eal_dev.c:(.text+0x59): undefined reference to `gettid'
collect2: error: ld returned 1 exit status
make[5]: *** [/tmp/FC28_K4.16.3_GCC8.0.1/x86_64-native-linuxapp-gcc/b4fb65c55ea3485f8509e6101dc7e6a0/dpdk/mk/rte.app.mk:399: testbbdev] Error 1
make[4]: *** [/tmp/FC28_K4.16.3_GCC8.0.1/x86_64-native-linuxapp-gcc/b4fb65c55ea3485f8509e6101dc7e6a0/dpdk/mk/rte.subdir.mk:35: test-bbdev] Error 2
  CC test_mempool_perf.o
  CC macswap.o
  CC test_mbuf.o
--
  CC test_cmdline.o
  CC test_cmdline_num.o
  CC test_cmdline_etheraddr.o
/tmp/FC28_K4.16.3_GCC8.0.1/x86_64-native-linuxapp-gcc/b4fb65c55ea3485f8509e6101dc7e6a0/dpdk/x86_64-native-linuxapp-gcc/lib/librte_eal.a(eal_dev.o): In function `sigbus_handler':
eal_dev.c:(.text+0x59): undefined reference to `gettid'
collect2: error: ld returned 1 exit status
make[5]: *** [/tmp/FC28_K4.16.3_GCC8.0.1/x86_64-native-linuxapp-gcc/b4fb65c55ea3485f8509e6101dc7e6a0/dpdk/mk/rte.app.mk:399: testpmd] Error 1
  CC test_cmdline_portlist.o
make[4]: *** [/tmp/FC28_K4.16.3_GCC8.0.1/x86_64-native-linuxapp-gcc/b4fb65c55ea3485f8509e6101dc7e6a0/dpdk/mk/rte.subdir.mk:35: test-pmd] Error 2
  CC test_cmdline_ipaddr.o
  CC test_cmdline_cirbuf.o
--
  CC test_ipsec.o
  MKRES test_resource_c.res.o
  LD test
/tmp/FC28_K4.16.3_GCC8.0.1/x86_64-native-linuxapp-gcc/b4fb65c55ea3485f8509e6101dc7e6a0/dpdk/x86_64-native-linuxapp-gcc/lib/librte_eal.a(eal_dev.o): In function `sigbus_handler':
eal_dev.c:(.text+0x59): undefined reference to `gettid'
collect2: error: ld returned 1 exit status
make[5]: *** [/tmp/FC28_K4.16.3_GCC8.0.1/x86_64-native-linuxapp-gcc/b4fb65c55ea3485f8509e6101dc7e6a0/dpdk/mk/rte.app.mk:399: test] Error 1
make[4]: *** [/tmp/FC28_K4.16.3_GCC8.0.1/x86_64-native-linuxapp-gcc/b4fb65c55ea3485f8509e6101dc7e6a0/dpdk/mk/rte.subdir.mk:35: test] Error 2
make[3]: *** [/tmp/FC28_K4.16.3_GCC8.0.1/x86_64-native-linuxapp-gcc/b4fb65c55ea3485f8509e6101dc7e6a0/dpdk/mk/rte.sdkbuild.mk:48: app] Error 2
make[2]: *** [/tmp/FC28_K4.16.3_GCC8.0.1/x86_64-native-linuxapp-gcc/b4fb65c55ea3485f8509e6101dc7e6a0/dpdk/mk/rte.sdkroot.mk:99: all] Error 2
make[1]: *** [/tmp/FC28_K4.16.3_GCC8.0.1/x86_64-native-linuxapp-gcc/b4fb65c55ea3485f8509e6101dc7e6a0/dpdk/mk/rte.sdkinstall.mk:58: pre_install] Error 2

*Failed Build #10:
OS: FC28
Target: x86_64-native-linuxapp-clang
  CC eal_timer.o
  CC eal_interrupts.o
  CC eal_alarm.o
  CC eal_dev.o
  CC eal_common_lcore.o
/tmp/FC28_K4.16.3_Clang6.0.1/x86_64-native-linuxapp-clang/b4fb65c55ea3485f8509e6101dc7e6a0/dpdk/lib/librte_eal/linuxapp/eal/eal_dev.c:76:8: warning: implicit declaration of function 'gettid' is invalid in C99 [-Wimplicit-function-declaration]
                (int)gettid(), info->si_addr);
                     ^
/tmp/FC28_K4.16.3_Clang6.0.1/x86_64-native-linuxapp-clang/b4fb65c55ea3485f8509e6101dc7e6a0/dpdk/lib/librte_eal/linuxapp/eal/eal_dev.c:76:8: warning: this function declaration is not a prototype [-Wstrict-prototypes]
2 warnings generated.
  CC eal_common_timer.o
  CC eal_common_memzone.o
  CC eal_common_log.o
  CC eal_common_launch.o
  CC eal_common_memalloc.o
--
  CC skeleton_rawdev.o
  CC skeleton_rawdev_test.o
  CC ifpga_fme_dperf.o
  PMDINFO dpaa2_cmdif.o.pmd.c
  CC dpaa2_cmdif.o.pmd.o
  CC ifpga_fme_error.o
  LD dpaa2_cmdif.o
  CC ifpga_port.o
  AR librte_pmd_dpaa2_cmdif.a
  CC ifpga_port_error.o
  CC opae_ifpga_hw_api.o
  CC opae_hw_api.o
  INSTALL-LIB librte_pmd_dpaa2_cmdif.a
  CC opae_debug.o
  CC ifpga_fme_pr.o
--
  CC test_bbdev.o
/tmp/FC28_K4.16.3_Clang6.0.1/x86_64-native-linuxapp-clang/b4fb65c55ea3485f8509e6101dc7e6a0/dpdk/x86_64-native-linuxapp-clang/lib/librte_eal.a(eal_dev.o): In function `sigbus_handler':
eal_dev.c:(.text+0x4d5): undefined reference to `gettid'
  LD testacl
  CC config.o
clang-6.0: error: linker command failed with exit code 1 (use -v to see invocation)
make[5]: *** [/tmp/FC28_K4.16.3_Clang6.0.1/x86_64-native-linuxapp-clang/b4fb65c55ea3485f8509e6101dc7e6a0/dpdk/mk/rte.app.mk:399: cmdline_test] Error 1
make[4]: *** [/tmp/FC28_K4.16.3_Clang6.0.1/x86_64-native-linuxapp-clang/b4fb65c55ea3485f8509e6101dc7e6a0/dpdk/mk/rte.subdir.mk:37: test-cmdline] Error 2
make[4]: *** Waiting for unfinished jobs....
  LD dpdk-pdump
  CC init.o
  LD dpdk-procinfo
  CC test.o
/tmp/FC28_K4.16.3_Clang6.0.1/x86_64-native-linuxapp-clang/b4fb65c55ea3485f8509e6101dc7e6a0/dpdk/x86_64-native-linuxapp-clang/lib/librte_eal.a(eal_dev.o): In function `sigbus_handler':
eal_dev.c:(.text+0x4d5): undefined reference to `gettid'
  CC cperf_ops.o
clang-6.0: error: linker command failed with exit code 1 (use -v to see invocation)
make[5]: *** [/tmp/FC28_K4.16.3_Clang6.0.1/x86_64-native-linuxapp-clang/b4fb65c55ea3485f8509e6101dc7e6a0/dpdk/mk/rte.app.mk:399: testacl] Error 1
make[4]: *** [/tmp/FC28_K4.16.3_Clang6.0.1/x86_64-native-linuxapp-clang/b4fb65c55ea3485f8509e6101dc7e6a0/dpdk/mk/rte.subdir.mk:37: test-acl] Error 2
  CC resource.o
/tmp/FC28_K4.16.3_Clang6.0.1/x86_64-native-linuxapp-clang/b4fb65c55ea3485f8509e6101dc7e6a0/dpdk/x86_64-native-linuxapp-clang/lib/librte_eal.a(eal_dev.o): In function `sigbus_handler':
eal_dev.c:(.text+0x4d5): undefined reference to `gettid'
/tmp/FC28_K4.16.3_Clang6.0.1/x86_64-native-linuxapp-clang/b4fb65c55ea3485f8509e6101dc7e6a0/dpdk/x86_64-native-linuxapp-clang/lib/librte_eal.a(eal_dev.o): In function `sigbus_handler':
eal_dev.c:(.text+0x4d5): undefined reference to `gettid'
clang-6.0: error: linker command failed with exit code 1 (use -v to see invocation)
make[5]: *** [/tmp/FC28_K4.16.3_Clang6.0.1/x86_64-native-linuxapp-clang/b4fb65c55ea3485f8509e6101dc7e6a0/dpdk/mk/rte.app.mk:399: dpdk-procinfo] Error 1
make[4]: *** [/tmp/FC28_K4.16.3_Clang6.0.1/x86_64-native-linuxapp-clang/b4fb65c55ea3485f8509e6101dc7e6a0/dpdk/mk/rte.subdir.mk:37: proc-info] Error 2
  CC test_resource.o
  CC comp_perf_options_parse.o
  CC test_prefetch.o
clang-6.0: error: linker command failed with exit code 1 (use -v to see invocation)
make[5]: *** [/tmp/FC28_K4.16.3_Clang6.0.1/x86_64-native-linuxapp-clang/b4fb65c55ea3485f8509e6101dc7e6a0/dpdk/mk/rte.app.mk:399: dpdk-pdump] Error 1
make[4]: *** [/tmp/FC28_K4.16.3_Clang6.0.1/x86_64-native-linuxapp-clang/b4fb65c55ea3485f8509e6101dc7e6a0/dpdk/mk/rte.subdir.mk:37: pdump] Error 2
  CC test_byteorder.o
  CC comp_perf_test_verify.o
  CC test_per_lcore.o
--
  CC test_table.o
  CC cperf_test_throughput.o
/tmp/FC28_K4.16.3_Clang6.0.1/x86_64-native-linuxapp-clang/b4fb65c55ea3485f8509e6101dc7e6a0/dpdk/x86_64-native-linuxapp-clang/lib/librte_eal.a(eal_dev.o): In function `sigbus_handler':
eal_dev.c:(.text+0x4d5): undefined reference to `gettid'
  CC cmdline_flow.o
clang-6.0: error: linker command failed with exit code 1 (use -v to see invocation)
make[5]: *** [/tmp/FC28_K4.16.3_Clang6.0.1/x86_64-native-linuxapp-clang/b4fb65c55ea3485f8509e6101dc7e6a0/dpdk/mk/rte.app.mk:399: dpdk-test-compress-perf] Error 1
make[4]: *** [/tmp/FC28_K4.16.3_Clang6.0.1/x86_64-native-linuxapp-clang/b4fb65c55ea3485f8509e6101dc7e6a0/dpdk/mk/rte.subdir.mk:37: test-compress-perf] Error 2
  CC cmdline_mtr.o
  LD testpipeline
  CC test_table_pipeline.o
  CC test_bbdev_vector.o
  CC test_table_tables.o
/tmp/FC28_K4.16.3_Clang6.0.1/x86_64-native-linuxapp-clang/b4fb65c55ea3485f8509e6101dc7e6a0/dpdk/x86_64-native-linuxapp-clang/lib/librte_eal.a(eal_dev.o): In function `sigbus_handler':
eal_dev.c:(.text+0x4d5): undefined reference to `gettid'
clang-6.0: error: linker command failed with exit code 1 (use -v to see invocation)
make[5]: *** [/tmp/FC28_K4.16.3_Clang6.0.1/x86_64-native-linuxapp-clang/b4fb65c55ea3485f8509e6101dc7e6a0/dpdk/mk/rte.app.mk:399: testpipeline] Error 1
make[4]: *** [/tmp/FC28_K4.16.3_Clang6.0.1/x86_64-native-linuxapp-clang/b4fb65c55ea3485f8509e6101dc7e6a0/dpdk/mk/rte.subdir.mk:37: test-pipeline] Error 2
  CC cmdline_tm.o
  CC cperf_test_latency.o
  CC test_table_ports.o
--
  LD testbbdev
  CC test_table_acl.o
  CC macfwd.o
/tmp/FC28_K4.16.3_Clang6.0.1/x86_64-native-linuxapp-clang/b4fb65c55ea3485f8509e6101dc7e6a0/dpdk/x86_64-native-linuxapp-clang/lib/librte_eal.a(eal_dev.o): In function `sigbus_handler':
eal_dev.c:(.text+0x4d5): undefined reference to `gettid'
clang-6.0: error: linker command failed with exit code 1 (use -v to see invocation)
make[5]: *** [/tmp/FC28_K4.16.3_Clang6.0.1/x86_64-native-linuxapp-clang/b4fb65c55ea3485f8509e6101dc7e6a0/dpdk/mk/rte.app.mk:399: testbbdev] Error 1
make[4]: *** [/tmp/FC28_K4.16.3_Clang6.0.1/x86_64-native-linuxapp-clang/b4fb65c55ea3485f8509e6101dc7e6a0/dpdk/mk/rte.subdir.mk:37: test-bbdev] Error 2
  CC test_flow_classify.o
  CC macswap.o
  CC test_rwlock.o
--
  CC cperf_test_common.o
  CC test_lpm_perf.o
/tmp/FC28_K4.16.3_Clang6.0.1/x86_64-native-linuxapp-clang/b4fb65c55ea3485f8509e6101dc7e6a0/dpdk/x86_64-native-linuxapp-clang/lib/librte_eal.a(eal_dev.o): In function `sigbus_handler':
eal_dev.c:(.text+0x4d5): undefined reference to `gettid'
  CC test_lpm6.o
clang-6.0: error: linker command failed with exit code 1 (use -v to see invocation)
make[5]: *** [/tmp/FC28_K4.16.3_Clang6.0.1/x86_64-native-linuxapp-clang/b4fb65c55ea3485f8509e6101dc7e6a0/dpdk/mk/rte.app.mk:399: testpmd] Error 1
make[4]: *** [/tmp/FC28_K4.16.3_Clang6.0.1/x86_64-native-linuxapp-clang/b4fb65c55ea3485f8509e6101dc7e6a0/dpdk/mk/rte.subdir.mk:37: test-pmd] Error 2
  CC test_lpm6_perf.o
  CC test_debug.o
  CC test_errno.o
--
  CC test_service_cores.o
/tmp/FC28_K4.16.3_Clang6.0.1/x86_64-native-linuxapp-clang/b4fb65c55ea3485f8509e6101dc7e6a0/dpdk/x86_64-native-linuxapp-clang/lib/librte_eal.a(eal_dev.o): In function `sigbus_handler':
eal_dev.c:(.text+0x4d5): undefined reference to `gettid'
  CC test_bitratestats.o
  CC test_latencystats.o
clang-6.0: error: linker command failed with exit code 1 (use -v to see invocation)
make[5]: *** [/tmp/FC28_K4.16.3_Clang6.0.1/x86_64-native-linuxapp-clang/b4fb65c55ea3485f8509e6101dc7e6a0/dpdk/mk/rte.app.mk:399: dpdk-test-crypto-perf] Error 1
make[4]: *** [/tmp/FC28_K4.16.3_Clang6.0.1/x86_64-native-linuxapp-clang/b4fb65c55ea3485f8509e6101dc7e6a0/dpdk/mk/rte.subdir.mk:37: test-crypto-perf] Error 2
  CC test_cmdline.o
  CC test_cmdline_num.o
  CC test_cmdline_etheraddr.o
--
  CC test_ipsec.o
  MKRES test_resource_c.res.o
  LD test
/tmp/FC28_K4.16.3_Clang6.0.1/x86_64-native-linuxapp-clang/b4fb65c55ea3485f8509e6101dc7e6a0/dpdk/x86_64-native-linuxapp-clang/lib/librte_eal.a(eal_dev.o): In function `sigbus_handler':
eal_dev.c:(.text+0x4d5): undefined reference to `gettid'
clang-6.0: error: linker command failed with exit code 1 (use -v to see invocation)
make[5]: *** [/tmp/FC28_K4.16.3_Clang6.0.1/x86_64-native-linuxapp-clang/b4fb65c55ea3485f8509e6101dc7e6a0/dpdk/mk/rte.app.mk:399: test] Error 1
make[4]: *** [/tmp/FC28_K4.16.3_Clang6.0.1/x86_64-native-linuxapp-clang/b4fb65c55ea3485f8509e6101dc7e6a0/dpdk/mk/rte.subdir.mk:37: test] Error 2
make[3]: *** [/tmp/FC28_K4.16.3_Clang6.0.1/x86_64-native-linuxapp-clang/b4fb65c55ea3485f8509e6101dc7e6a0/dpdk/mk/rte.sdkbuild.mk:48: app] Error 2
make[2]: *** [/tmp/FC28_K4.16.3_Clang6.0.1/x86_64-native-linuxapp-clang/b4fb65c55ea3485f8509e6101dc7e6a0/dpdk/mk/rte.sdkroot.mk:99: all] Error 2
make[1]: *** [/tmp/FC28_K4.16.3_Clang6.0.1/x86_64-native-linuxapp-clang/b4fb65c55ea3485f8509e6101dc7e6a0/dpdk/mk/rte.sdkinstall.mk:58: pre_install] Error 2

*Failed Build #11:
OS: SUSE15
Target: x86_64-native-linuxapp-gcc
  CC eal_interrupts.o
  CC eal_alarm.o
  CC eal_dev.o
In file included from /tmp/SUSE15_K4.12.14_GCC7.3.1/x86_64-native-linuxapp-gcc/b4fb65c55ea3485f8509e6101dc7e6a0/dpdk/lib/librte_eal/linuxapp/eal/eal_dev.c:14:0:
/tmp/SUSE15_K4.12.14_GCC7.3.1/x86_64-native-linuxapp-gcc/b4fb65c55ea3485f8509e6101dc7e6a0/dpdk/lib/librte_eal/linuxapp/eal/eal_dev.c: In function ‘sigbus_handler’:
/tmp/SUSE15_K4.12.14_GCC7.3.1/x86_64-native-linuxapp-gcc/b4fb65c55ea3485f8509e6101dc7e6a0/dpdk/lib/librte_eal/linuxapp/eal/eal_dev.c:76:8: warning: implicit declaration of function ‘gettid’; did you mean ‘getgid’? [-Wimplicit-function-declaration]
   (int)gettid(), info->si_addr);
        ^
/tmp/SUSE15_K4.12.14_GCC7.3.1/x86_64-native-linuxapp-gcc/b4fb65c55ea3485f8509e6101dc7e6a0/dpdk/x86_64-native-linuxapp-gcc/include/rte_log.h:324:32: note: in definition of macro ‘RTE_LOG’
    RTE_LOGTYPE_ ## t, # t ": " __VA_ARGS__)
                                ^~~~~~~~~~~
/tmp/SUSE15_K4.12.14_GCC7.3.1/x86_64-native-linuxapp-gcc/b4fb65c55ea3485f8509e6101dc7e6a0/dpdk/lib/librte_eal/linuxapp/eal/eal_dev.c:76:8: warning: nested extern declaration of ‘gettid’ [-Wnested-externs]
   (int)gettid(), info->si_addr);
        ^
/tmp/SUSE15_K4.12.14_GCC7.3.1/x86_64-native-linuxapp-gcc/b4fb65c55ea3485f8509e6101dc7e6a0/dpdk/x86_64-native-linuxapp-gcc/include/rte_log.h:324:32: note: in definition of macro ‘RTE_LOG’
    RTE_LOGTYPE_ ## t, # t ": " __VA_ARGS__)
                                ^~~~~~~~~~~
--
  CC rte_hypervisor.o
  CC rte_spinlock.o
  CC rte_cycles.o
  AR librte_eal.a
  INSTALL-LIB librte_eal.a
make[7]: warning:  Clock skew detected.  Your build may be incomplete.
== Build lib/librte_ring
== Build lib/librte_timer
== Build lib/librte_cmdline
== Build lib/librte_pci
== Build lib/librte_meter
--
  CC base/fman/fman_hw.o
  AR librte_bus_pci.a
make[6]: Warning: File 'base/fman/netcfg_layer.c' has modification time 21103 s in the future
  CC base/fman/of.o
  INSTALL-LIB librte_bus_pci.a
make[6]: warning:  Clock skew detected.  Your build may be incomplete.
  CC base/fman/netcfg_layer.o
  CC mc/dpmng.o
  CC base/qbman/process.o
  AR librte_bus_vmbus.a
  CC      /tmp/SUSE15_K4.12.14_GCC7.3.1/x86_64-native-linuxapp-gcc/b4fb65c55ea3485f8509e6101dc7e6a0/dpdk/x86_64-native-linuxapp-gcc/build/kernel/linux/kni/rte_kni.mod.o
--
  LD portal/dpaa2_hw_dpci.o
  AR librte_bus_fslmc.a
  INSTALL-LIB librte_bus_fslmc.a
  AR librte_bus_dpaa.a
  INSTALL-LIB librte_bus_dpaa.a
make[6]: warning:  Clock skew detected.  Your build may be incomplete.
== Build drivers/mempool
== Build drivers/mempool/bucket
== Build drivers/mempool/dpaa
== Build drivers/mempool/dpaa2
== Build drivers/mempool/ring
--
== Build drivers/crypto/dpaa_sec
  AR librte_pmd_octeontx.a
  AR librte_pmd_netvsc.a
  INSTALL-LIB librte_pmd_octeontx.a
  INSTALL-LIB librte_pmd_netvsc.a
make[6]: warning:  Clock skew detected.  Your build may be incomplete.
== Build drivers/net/ring
  CC bnxt_flow.o
  CC nfp_nffw.o
  CC ecore_dev.o
  CC bnxt_hwrm.o
--
  CC ixgbe_mbx.o
  LD nfp_net.o
  AR librte_pmd_nfp.a
  CC ecore_l2.o
  INSTALL-LIB librte_pmd_nfp.a
make[6]: warning:  Clock skew detected.  Your build may be incomplete.
== Build drivers/net/vdev_netvsc
  PMDINFO i40e_ethdev_vf.o.pmd.c
  CC i40e_ethdev_vf.o.pmd.o
  LD i40e_ethdev_vf.o
  CC i40e_pf.o
--
  PMDINFO dpaa2_cmdif.o.pmd.c
  CC dpaa2_cmdif.o.pmd.o
  LD dpaa2_cmdif.o
  AR librte_pmd_dpaa2_cmdif.a
  INSTALL-LIB librte_pmd_dpaa2_cmdif.a
  CC ifpga_fme_error.o
  CC ifpga_port.o
  CC ifpga_port_error.o
  CC opae_hw_api.o
  CC opae_ifpga_hw_api.o
  CC opae_debug.o
  PMDINFO skeleton_rawdev.o.pmd.c
  CC skeleton_rawdev.o.pmd.o
--
  CC cperf_ops.o
  CC init.o
  CC resource.o
/usr/lib64/gcc/x86_64-suse-linux/7/../../../../x86_64-suse-linux/bin/ld: /tmp/SUSE15_K4.12.14_GCC7.3.1/x86_64-native-linuxapp-gcc/b4fb65c55ea3485f8509e6101dc7e6a0/dpdk/x86_64-native-linuxapp-gcc/lib/librte_eal.a(eal_dev.o): in function `sigbus_handler':
eal_dev.c:(.text+0x59): undefined reference to `gettid'
collect2: error: ld returned 1 exit status
make[5]: *** [/tmp/SUSE15_K4.12.14_GCC7.3.1/x86_64-native-linuxapp-gcc/b4fb65c55ea3485f8509e6101dc7e6a0/dpdk/mk/rte.app.mk:399: dpdk-pdump] Error 1
make[4]: *** [/tmp/SUSE15_K4.12.14_GCC7.3.1/x86_64-native-linuxapp-gcc/b4fb65c55ea3485f8509e6101dc7e6a0/dpdk/mk/rte.subdir.mk:37: pdump] Error 2
make[4]: *** Waiting for unfinished jobs....
  CC comp_perf_options_parse.o
  CC test_resource.o
/usr/lib64/gcc/x86_64-suse-linux/7/../../../../x86_64-suse-linux/bin/ld: /tmp/SUSE15_K4.12.14_GCC7.3.1/x86_64-native-linuxapp-gcc/b4fb65c55ea3485f8509e6101dc7e6a0/dpdk/x86_64-native-linuxapp-gcc/lib/librte_eal.a(eal_dev.o): in function `sigbus_handler':
eal_dev.c:(.text+0x59): undefined reference to `gettid'
collect2: error: ld returned 1 exit status
make[5]: *** [/tmp/SUSE15_K4.12.14_GCC7.3.1/x86_64-native-linuxapp-gcc/b4fb65c55ea3485f8509e6101dc7e6a0/dpdk/mk/rte.app.mk:399: testacl] Error 1
make[4]: *** [/tmp/SUSE15_K4.12.14_GCC7.3.1/x86_64-native-linuxapp-gcc/b4fb65c55ea3485f8509e6101dc7e6a0/dpdk/mk/rte.subdir.mk:37: test-acl] Error 2
/usr/lib64/gcc/x86_64-suse-linux/7/../../../../x86_64-suse-linux/bin/ld: /tmp/SUSE15_K4.12.14_GCC7.3.1/x86_64-native-linuxapp-gcc/b4fb65c55ea3485f8509e6101dc7e6a0/dpdk/x86_64-native-linuxapp-gcc/lib/librte_eal.a(eal_dev.o): in function `sigbus_handler':
eal_dev.c:(.text+0x59): undefined reference to `gettid'
collect2: error: ld returned 1 exit status
make[5]: *** [/tmp/SUSE15_K4.12.14_GCC7.3.1/x86_64-native-linuxapp-gcc/b4fb65c55ea3485f8509e6101dc7e6a0/dpdk/mk/rte.app.mk:399: dpdk-procinfo] Error 1
make[4]: *** [/tmp/SUSE15_K4.12.14_GCC7.3.1/x86_64-native-linuxapp-gcc/b4fb65c55ea3485f8509e6101dc7e6a0/dpdk/mk/rte.subdir.mk:37: proc-info] Error 2
  CC test_prefetch.o
  CC comp_perf_test_verify.o
/usr/lib64/gcc/x86_64-suse-linux/7/../../../../x86_64-suse-linux/bin/ld: /tmp/SUSE15_K4.12.14_GCC7.3.1/x86_64-native-linuxapp-gcc/b4fb65c55ea3485f8509e6101dc7e6a0/dpdk/x86_64-native-linuxapp-gcc/lib/librte_eal.a(eal_dev.o): in function `sigbus_handler':
eal_dev.c:(.text+0x59): undefined reference to `gettid'
collect2: error: ld returned 1 exit status
make[5]: *** [/tmp/SUSE15_K4.12.14_GCC7.3.1/x86_64-native-linuxapp-gcc/b4fb65c55ea3485f8509e6101dc7e6a0/dpdk/mk/rte.app.mk:399: cmdline_test] Error 1
make[4]: *** [/tmp/SUSE15_K4.12.14_GCC7.3.1/x86_64-native-linuxapp-gcc/b4fb65c55ea3485f8509e6101dc7e6a0/dpdk/mk/rte.subdir.mk:37: test-cmdline] Error 2
  CC test_byteorder.o
  CC comp_perf_test_benchmark.o
  CC test_per_lcore.o
--
  CC test_table.o
  CC cmdline.o
  CC test_table_pipeline.o
/usr/lib64/gcc/x86_64-suse-linux/7/../../../../x86_64-suse-linux/bin/ld: /tmp/SUSE15_K4.12.14_GCC7.3.1/x86_64-native-linuxapp-gcc/b4fb65c55ea3485f8509e6101dc7e6a0/dpdk/x86_64-native-linuxapp-gcc/lib/librte_eal.a(eal_dev.o): in function `sigbus_handler':
eal_dev.c:(.text+0x59): undefined reference to `gettid'
collect2: error: ld returned 1 exit status
make[5]: *** [/tmp/SUSE15_K4.12.14_GCC7.3.1/x86_64-native-linuxapp-gcc/b4fb65c55ea3485f8509e6101dc7e6a0/dpdk/mk/rte.app.mk:399: dpdk-test-compress-perf] Error 1
make[4]: *** [/tmp/SUSE15_K4.12.14_GCC7.3.1/x86_64-native-linuxapp-gcc/b4fb65c55ea3485f8509e6101dc7e6a0/dpdk/mk/rte.subdir.mk:37: test-compress-perf] Error 2
  CC test_table_tables.o
  CC cperf_test_throughput.o
  CC pipeline_hash.o
--
  CC test_efd.o
  CC test_efd_perf.o
  LD testpipeline
/usr/lib64/gcc/x86_64-suse-linux/7/../../../../x86_64-suse-linux/bin/ld: /tmp/SUSE15_K4.12.14_GCC7.3.1/x86_64-native-linuxapp-gcc/b4fb65c55ea3485f8509e6101dc7e6a0/dpdk/x86_64-native-linuxapp-gcc/lib/librte_eal.a(eal_dev.o): in function `sigbus_handler':
eal_dev.c:(.text+0x59): undefined reference to `gettid'
collect2: error: ld returned 1 exit status
make[5]: *** [/tmp/SUSE15_K4.12.14_GCC7.3.1/x86_64-native-linuxapp-gcc/b4fb65c55ea3485f8509e6101dc7e6a0/dpdk/mk/rte.app.mk:399: testbbdev] Error 1
make[4]: *** [/tmp/SUSE15_K4.12.14_GCC7.3.1/x86_64-native-linuxapp-gcc/b4fb65c55ea3485f8509e6101dc7e6a0/dpdk/mk/rte.subdir.mk:37: test-bbdev] Error 2
  CC cperf_test_vector_parsing.o
  CC test_hash.o
  CC cperf_test_common.o
  CC test_thash.o
  CC test_hash_perf.o
/usr/lib64/gcc/x86_64-suse-linux/7/../../../../x86_64-suse-linux/bin/ld: /tmp/SUSE15_K4.12.14_GCC7.3.1/x86_64-native-linuxapp-gcc/b4fb65c55ea3485f8509e6101dc7e6a0/dpdk/x86_64-native-linuxapp-gcc/lib/librte_eal.a(eal_dev.o): in function `sigbus_handler':
eal_dev.c:(.text+0x59): undefined reference to `gettid'
collect2: error: ld returned 1 exit status
make[5]: *** [/tmp/SUSE15_K4.12.14_GCC7.3.1/x86_64-native-linuxapp-gcc/b4fb65c55ea3485f8509e6101dc7e6a0/dpdk/mk/rte.app.mk:399: testpipeline] Error 1
make[4]: *** [/tmp/SUSE15_K4.12.14_GCC7.3.1/x86_64-native-linuxapp-gcc/b4fb65c55ea3485f8509e6101dc7e6a0/dpdk/mk/rte.subdir.mk:37: test-pipeline] Error 2
  CC test_hash_functions.o
  CC test_hash_multiwriter.o
  CC test_hash_readwrite.o
--
  CC test_lpm6.o
  CC test_lpm6_perf.o
  CC test_debug.o
/usr/lib64/gcc/x86_64-suse-linux/7/../../../../x86_64-suse-linux/bin/ld: /tmp/SUSE15_K4.12.14_GCC7.3.1/x86_64-native-linuxapp-gcc/b4fb65c55ea3485f8509e6101dc7e6a0/dpdk/x86_64-native-linuxapp-gcc/lib/librte_eal.a(eal_dev.o): in function `sigbus_handler':
eal_dev.c:(.text+0x59): undefined reference to `gettid'
collect2: error: ld returned 1 exit status
make[5]: *** [/tmp/SUSE15_K4.12.14_GCC7.3.1/x86_64-native-linuxapp-gcc/b4fb65c55ea3485f8509e6101dc7e6a0/dpdk/mk/rte.app.mk:399: dpdk-test-crypto-perf] Error 1
make[4]: *** [/tmp/SUSE15_K4.12.14_GCC7.3.1/x86_64-native-linuxapp-gcc/b4fb65c55ea3485f8509e6101dc7e6a0/dpdk/mk/rte.subdir.mk:37: test-crypto-perf] Error 2
  CC test_errno.o
  CC test_tailq.o
  CC cmdline_mtr.o
--
  CC test_eventdev.o
  CC test_event_ring.o
  CC test_event_eth_rx_adapter.o
/usr/lib64/gcc/x86_64-suse-linux/7/../../../../x86_64-suse-linux/bin/ld: /tmp/SUSE15_K4.12.14_GCC7.3.1/x86_64-native-linuxapp-gcc/b4fb65c55ea3485f8509e6101dc7e6a0/dpdk/x86_64-native-linuxapp-gcc/lib/librte_eal.a(eal_dev.o): in function `sigbus_handler':
eal_dev.c:(.text+0x59): undefined reference to `gettid'
collect2: error: ld returned 1 exit status
make[5]: *** [/tmp/SUSE15_K4.12.14_GCC7.3.1/x86_64-native-linuxapp-gcc/b4fb65c55ea3485f8509e6101dc7e6a0/dpdk/mk/rte.app.mk:399: testpmd] Error 1
make[4]: *** [/tmp/SUSE15_K4.12.14_GCC7.3.1/x86_64-native-linuxapp-gcc/b4fb65c55ea3485f8509e6101dc7e6a0/dpdk/mk/rte.subdir.mk:37: test-pmd] Error 2
  CC test_event_eth_tx_adapter.o
  CC test_event_timer_adapter.o
  CC test_event_crypto_adapter.o
--
  CC test_ipsec.o
  MKRES test_resource_c.res.o
  LD test
/usr/lib64/gcc/x86_64-suse-linux/7/../../../../x86_64-suse-linux/bin/ld: /tmp/SUSE15_K4.12.14_GCC7.3.1/x86_64-native-linuxapp-gcc/b4fb65c55ea3485f8509e6101dc7e6a0/dpdk/x86_64-native-linuxapp-gcc/lib/librte_eal.a(eal_dev.o): in function `sigbus_handler':
eal_dev.c:(.text+0x59): undefined reference to `gettid'
collect2: error: ld returned 1 exit status
make[5]: *** [/tmp/SUSE15_K4.12.14_GCC7.3.1/x86_64-native-linuxapp-gcc/b4fb65c55ea3485f8509e6101dc7e6a0/dpdk/mk/rte.app.mk:399: test] Error 1
make[4]: *** [/tmp/SUSE15_K4.12.14_GCC7.3.1/x86_64-native-linuxapp-gcc/b4fb65c55ea3485f8509e6101dc7e6a0/dpdk/mk/rte.subdir.mk:37: test] Error 2
make[3]: *** [/tmp/SUSE15_K4.12.14_GCC7.3.1/x86_64-native-linuxapp-gcc/b4fb65c55ea3485f8509e6101dc7e6a0/dpdk/mk/rte.sdkbuild.mk:48: app] Error 2
make[2]: *** [/tmp/SUSE15_K4.12.14_GCC7.3.1/x86_64-native-linuxapp-gcc/b4fb65c55ea3485f8509e6101dc7e6a0/dpdk/mk/rte.sdkroot.mk:99: all] Error 2
make[1]: *** [/tmp/SUSE15_K4.12.14_GCC7.3.1/x86_64-native-linuxapp-gcc/b4fb65c55ea3485f8509e6101dc7e6a0/dpdk/mk/rte.sdkinstall.mk:58: pre_install] Error 2

*Failed Build #12:
OS: RHEL76
Target: x86_64-native-linuxapp-gcc
  CC eal_alarm.o
  CC eal_dev.o
  CC eal_common_lcore.o
  CC eal_common_timer.o
/tmp/RHEL76_K3.10.0_GCC4.8.5/x86_64-native-linuxapp-gcc/b4fb65c55ea3485f8509e6101dc7e6a0/dpdk/lib/librte_eal/linuxapp/eal/eal_dev.c: In function ‘sigbus_handler’:
/tmp/RHEL76_K3.10.0_GCC4.8.5/x86_64-native-linuxapp-gcc/b4fb65c55ea3485f8509e6101dc7e6a0/dpdk/lib/librte_eal/linuxapp/eal/eal_dev.c:75:2: warning: implicit declaration of function ‘gettid’ [-Wimplicit-function-declaration]
  RTE_LOG(DEBUG, EAL, "Thread[%d] catch SIGBUS, fault address:%p\n",
  ^
/tmp/RHEL76_K3.10.0_GCC4.8.5/x86_64-native-linuxapp-gcc/b4fb65c55ea3485f8509e6101dc7e6a0/dpdk/lib/librte_eal/linuxapp/eal/eal_dev.c:75:2: warning: nested extern declaration of ‘gettid’ [-Wnested-externs]
  CC eal_common_memzone.o
  CC eal_common_log.o
  CC eal_common_launch.o
  CC eal_common_memalloc.o
  CC eal_common_memory.o
--
  SYMLINK-FILE include/rte_pmd_dpaa2_qdma.h
  CC ifpga_fme_iperf.o
  CC skeleton_rawdev.o
  CC ifpga_fme_dperf.o
  SYMLINK-FILE include/rte_pmd_dpaa2_cmdif.h
  CC ifpga_fme_error.o
  CC ifpga_port.o
  CC dpaa2_cmdif.o
  CC dpaa2_qdma.o
  CC ifpga_port_error.o
  CC opae_hw_api.o
  CC skeleton_rawdev_test.o
  CC opae_ifpga_hw_api.o
  PMDINFO dpaa2_cmdif.o.pmd.c
  CC dpaa2_cmdif.o.pmd.o
--
  LD dpdk-pdump
  CC test.o
  CC init.o
/tmp/RHEL76_K3.10.0_GCC4.8.5/x86_64-native-linuxapp-gcc/b4fb65c55ea3485f8509e6101dc7e6a0/dpdk/x86_64-native-linuxapp-gcc/lib/librte_eal.a(eal_dev.o): In function `sigbus_handler':
eal_dev.c:(.text+0x59): undefined reference to `gettid'
collect2: error: ld returned 1 exit status
make[5]: *** [cmdline_test] Error 1
make[4]: *** [test-cmdline] Error 2
make[4]: *** Waiting for unfinished jobs....
  CC comp_perf_options_parse.o
/tmp/RHEL76_K3.10.0_GCC4.8.5/x86_64-native-linuxapp-gcc/b4fb65c55ea3485f8509e6101dc7e6a0/dpdk/x86_64-native-linuxapp-gcc/lib/librte_eal.a(eal_dev.o): In function `sigbus_handler':
eal_dev.c:(.text+0x59): undefined reference to `gettid'
collect2: error: ld returned 1 exit status
make[5]: *** [dpdk-procinfo] Error 1
make[4]: *** [proc-info] Error 2
  CC resource.o
  CC cperf_ops.o
  CC test_resource.o
/tmp/RHEL76_K3.10.0_GCC4.8.5/x86_64-native-linuxapp-gcc/b4fb65c55ea3485f8509e6101dc7e6a0/dpdk/x86_64-native-linuxapp-gcc/lib/librte_eal.a(eal_dev.o): In function `sigbus_handler':
eal_dev.c:(.text+0x59): undefined reference to `gettid'
collect2: error: ld returned 1 exit status
make[5]: *** [dpdk-pdump] Error 1
  CC test_prefetch.o
make[4]: *** [pdump] Error 2
  CC test_bbdev_perf.o
  CC cperf_options_parsing.o
--
  CC test_byteorder.o
  CC test_per_lcore.o
  CC test_bbdev_vector.o
/tmp/RHEL76_K3.10.0_GCC4.8.5/x86_64-native-linuxapp-gcc/b4fb65c55ea3485f8509e6101dc7e6a0/dpdk/x86_64-native-linuxapp-gcc/lib/librte_eal.a(eal_dev.o): In function `sigbus_handler':
eal_dev.c:(.text+0x59): undefined reference to `gettid'
collect2: error: ld returned 1 exit status
make[5]: *** [testacl] Error 1
make[4]: *** [test-acl] Error 2
  CC runtime.o
  CC test_atomic.o
  CC test_barrier.o
--
  CC test_ring.o
  CC cmdline.o
  CC test_ring_perf.o
/tmp/RHEL76_K3.10.0_GCC4.8.5/x86_64-native-linuxapp-gcc/b4fb65c55ea3485f8509e6101dc7e6a0/dpdk/x86_64-native-linuxapp-gcc/lib/librte_eal.a(eal_dev.o): In function `sigbus_handler':
eal_dev.c:(.text+0x59): undefined reference to `gettid'
collect2: error: ld returned 1 exit status
make[5]: *** [dpdk-test-compress-perf] Error 1
make[4]: *** [test-compress-perf] Error 2
  CC cperf_test_vector_parsing.o
  CC test_pmd_perf.o
  CC cperf_test_common.o
  CC test_table.o
  CC cmdline_flow.o
/tmp/RHEL76_K3.10.0_GCC4.8.5/x86_64-native-linuxapp-gcc/b4fb65c55ea3485f8509e6101dc7e6a0/dpdk/x86_64-native-linuxapp-gcc/lib/librte_eal.a(eal_dev.o): In function `sigbus_handler':
eal_dev.c:(.text+0x59): undefined reference to `gettid'
collect2: error: ld returned 1 exit status
make[5]: *** [testpipeline] Error 1
make[4]: *** [test-pipeline] Error 2
  CC test_table_pipeline.o
  CC cmdline_mtr.o
  LD dpdk-test-crypto-perf
--
  CC test_table_combined.o
  LD testbbdev
  CC test_table_acl.o
/tmp/RHEL76_K3.10.0_GCC4.8.5/x86_64-native-linuxapp-gcc/b4fb65c55ea3485f8509e6101dc7e6a0/dpdk/x86_64-native-linuxapp-gcc/lib/librte_eal.a(eal_dev.o): In function `sigbus_handler':
eal_dev.c:(.text+0x59): undefined reference to `gettid'
collect2: error: ld returned 1 exit status
make[5]: *** [dpdk-test-crypto-perf] Error 1
make[4]: *** [test-crypto-perf] Error 2
  CC test_flow_classify.o
  CC config.o
  CC test_rwlock.o
  CC iofwd.o
/tmp/RHEL76_K3.10.0_GCC4.8.5/x86_64-native-linuxapp-gcc/b4fb65c55ea3485f8509e6101dc7e6a0/dpdk/x86_64-native-linuxapp-gcc/lib/librte_eal.a(eal_dev.o): In function `sigbus_handler':
eal_dev.c:(.text+0x59): undefined reference to `gettid'
collect2: error: ld returned 1 exit status
make[5]: *** [testbbdev] Error 1
make[4]: *** [test-bbdev] Error 2
  CC macfwd.o
  CC macswap.o
  CC flowgen.o
--
  CC test_cmdline_cirbuf.o
  CC test_cmdline_string.o
  CC test_cmdline_lib.o
/tmp/RHEL76_K3.10.0_GCC4.8.5/x86_64-native-linuxapp-gcc/b4fb65c55ea3485f8509e6101dc7e6a0/dpdk/x86_64-native-linuxapp-gcc/lib/librte_eal.a(eal_dev.o): In function `sigbus_handler':
eal_dev.c:(.text+0x59): undefined reference to `gettid'
collect2: error: ld returned 1 exit status
make[5]: *** [testpmd] Error 1
make[4]: *** [test-pmd] Error 2
  CC test_crc.o
  CC test_red.o
  CC test_sched.o
--
  CC test_ipsec.o
  MKRES test_resource_c.res.o
  LD test
/tmp/RHEL76_K3.10.0_GCC4.8.5/x86_64-native-linuxapp-gcc/b4fb65c55ea3485f8509e6101dc7e6a0/dpdk/x86_64-native-linuxapp-gcc/lib/librte_eal.a(eal_dev.o): In function `sigbus_handler':
eal_dev.c:(.text+0x59): undefined reference to `gettid'
collect2: error: ld returned 1 exit status
make[5]: *** [test] Error 1
make[4]: *** [test] Error 2
make[3]: *** [app] Error 2
make[2]: *** [all] Error 2
make[1]: *** [pre_install] Error 2

*Failed Build #13:
OS: FC29
Target: x86_64-native-linuxapp-gcc
  CC eal_alarm.o
  CC eal_dev.o
  CC eal_common_lcore.o
In file included from /tmp/FC29_K4.20_GCC8.0.1/x86_64-native-linuxapp-gcc/b4fb65c55ea3485f8509e6101dc7e6a0/dpdk/lib/librte_eal/linuxapp/eal/eal_dev.c:14:
/tmp/FC29_K4.20_GCC8.0.1/x86_64-native-linuxapp-gcc/b4fb65c55ea3485f8509e6101dc7e6a0/dpdk/lib/librte_eal/linuxapp/eal/eal_dev.c: In function ‘sigbus_handler’:
/tmp/FC29_K4.20_GCC8.0.1/x86_64-native-linuxapp-gcc/b4fb65c55ea3485f8509e6101dc7e6a0/dpdk/lib/librte_eal/linuxapp/eal/eal_dev.c:76:8: warning: implicit declaration of function ‘gettid’; did you mean ‘getgid’? [-Wimplicit-function-declaration]
   (int)gettid(), info->si_addr);
        ^~~~~~
/tmp/FC29_K4.20_GCC8.0.1/x86_64-native-linuxapp-gcc/b4fb65c55ea3485f8509e6101dc7e6a0/dpdk/x86_64-native-linuxapp-gcc/include/rte_log.h:324:32: note: in definition of macro ‘RTE_LOG’
    RTE_LOGTYPE_ ## t, # t ": " __VA_ARGS__)
                                ^~~~~~~~~~~
/tmp/FC29_K4.20_GCC8.0.1/x86_64-native-linuxapp-gcc/b4fb65c55ea3485f8509e6101dc7e6a0/dpdk/lib/librte_eal/linuxapp/eal/eal_dev.c:76:8: warning: nested extern declaration of ‘gettid’ [-Wnested-externs]
   (int)gettid(), info->si_addr);
        ^~~~~~
/tmp/FC29_K4.20_GCC8.0.1/x86_64-native-linuxapp-gcc/b4fb65c55ea3485f8509e6101dc7e6a0/dpdk/x86_64-native-linuxapp-gcc/include/rte_log.h:324:32: note: in definition of macro ‘RTE_LOG’
    RTE_LOGTYPE_ ## t, # t ": " __VA_ARGS__)
                                ^~~~~~~~~~~
--
  CC ifpga_feature_dev.o
  CC dpaa2_cmdif.o
  CC ifpga_fme.o
  CC ifpga_fme_iperf.o
  CC ifpga_fme_dperf.o
  CC ifpga_fme_error.o
  PMDINFO dpaa2_cmdif.o.pmd.c
  CC dpaa2_cmdif.o.pmd.o
  LD dpaa2_cmdif.o
  CC ifpga_port.o
  AR librte_pmd_dpaa2_cmdif.a
  CC ifpga_port_error.o
  INSTALL-LIB librte_pmd_dpaa2_cmdif.a
  PMDINFO skeleton_rawdev.o.pmd.c
  CC skeleton_rawdev.o.pmd.o
  CC opae_hw_api.o
  CC opae_ifpga_hw_api.o
--
  LD dpdk-pdump
  CC test.o
  CC cperf_ops.o
/usr/bin/ld: /tmp/FC29_K4.20_GCC8.0.1/x86_64-native-linuxapp-gcc/b4fb65c55ea3485f8509e6101dc7e6a0/dpdk/x86_64-native-linuxapp-gcc/lib/librte_eal.a(eal_dev.o): in function `sigbus_handler':
eal_dev.c:(.text+0x59): undefined reference to `gettid'
collect2: error: ld returned 1 exit status
make[5]: *** [/tmp/FC29_K4.20_GCC8.0.1/x86_64-native-linuxapp-gcc/b4fb65c55ea3485f8509e6101dc7e6a0/dpdk/mk/rte.app.mk:399: cmdline_test] Error 1
make[4]: *** [/tmp/FC29_K4.20_GCC8.0.1/x86_64-native-linuxapp-gcc/b4fb65c55ea3485f8509e6101dc7e6a0/dpdk/mk/rte.subdir.mk:37: test-cmdline] Error 2
make[4]: *** Waiting for unfinished jobs....
  CC cperf_options_parsing.o
  CC resource.o
/usr/bin/ld: /tmp/FC29_K4.20_GCC8.0.1/x86_64-native-linuxapp-gcc/b4fb65c55ea3485f8509e6101dc7e6a0/dpdk/x86_64-native-linuxapp-gcc/lib/librte_eal.a(eal_dev.o): in function `sigbus_handler':
eal_dev.c:(.text+0x59): undefined reference to `gettid'
collect2: error: ld returned 1 exit status
make[5]: *** [/tmp/FC29_K4.20_GCC8.0.1/x86_64-native-linuxapp-gcc/b4fb65c55ea3485f8509e6101dc7e6a0/dpdk/mk/rte.app.mk:399: dpdk-pdump] Error 1
make[4]: *** [/tmp/FC29_K4.20_GCC8.0.1/x86_64-native-linuxapp-gcc/b4fb65c55ea3485f8509e6101dc7e6a0/dpdk/mk/rte.subdir.mk:37: pdump] Error 2
  CC comp_perf_options_parse.o
  CC test_resource.o
/usr/bin/ld: /tmp/FC29_K4.20_GCC8.0.1/x86_64-native-linuxapp-gcc/b4fb65c55ea3485f8509e6101dc7e6a0/dpdk/x86_64-native-linuxapp-gcc/lib/librte_eal.a(eal_dev.o): in function `sigbus_handler':
eal_dev.c:(.text+0x59): undefined reference to `gettid'
collect2: error: ld returned 1 exit status
make[5]: *** [/tmp/FC29_K4.20_GCC8.0.1/x86_64-native-linuxapp-gcc/b4fb65c55ea3485f8509e6101dc7e6a0/dpdk/mk/rte.app.mk:399: dpdk-procinfo] Error 1
  CC cperf_test_vectors.o
make[4]: *** [/tmp/FC29_K4.20_GCC8.0.1/x86_64-native-linuxapp-gcc/b4fb65c55ea3485f8509e6101dc7e6a0/dpdk/mk/rte.subdir.mk:37: proc-info] Error 2
/usr/bin/ld: /tmp/FC29_K4.20_GCC8.0.1/x86_64-native-linuxapp-gcc/b4fb65c55ea3485f8509e6101dc7e6a0/dpdk/x86_64-native-linuxapp-gcc/lib/librte_eal.a(eal_dev.o): in function `sigbus_handler':
eal_dev.c:(.text+0x59): undefined reference to `gettid'
collect2: error: ld returned 1 exit status
make[5]: *** [/tmp/FC29_K4.20_GCC8.0.1/x86_64-native-linuxapp-gcc/b4fb65c55ea3485f8509e6101dc7e6a0/dpdk/mk/rte.app.mk:399: testacl] Error 1
make[4]: *** [/tmp/FC29_K4.20_GCC8.0.1/x86_64-native-linuxapp-gcc/b4fb65c55ea3485f8509e6101dc7e6a0/dpdk/mk/rte.subdir.mk:37: test-acl] Error 2
  CC cperf_test_throughput.o
  CC test_bbdev_perf.o
  CC init.o
--
  CC test_cycles.o
  CC cmdline_mtr.o
  CC test_spinlock.o
/usr/bin/ld: /tmp/FC29_K4.20_GCC8.0.1/x86_64-native-linuxapp-gcc/b4fb65c55ea3485f8509e6101dc7e6a0/dpdk/x86_64-native-linuxapp-gcc/lib/librte_eal.a(eal_dev.o): in function `sigbus_handler':
eal_dev.c:(.text+0x59): undefined reference to `gettid'
collect2: error: ld returned 1 exit status
make[5]: *** [/tmp/FC29_K4.20_GCC8.0.1/x86_64-native-linuxapp-gcc/b4fb65c55ea3485f8509e6101dc7e6a0/dpdk/mk/rte.app.mk:399: dpdk-test-compress-perf] Error 1
make[4]: *** [/tmp/FC29_K4.20_GCC8.0.1/x86_64-native-linuxapp-gcc/b4fb65c55ea3485f8509e6101dc7e6a0/dpdk/mk/rte.subdir.mk:37: test-compress-perf] Error 2
  CC cmdline_tm.o
/usr/bin/ld: /tmp/FC29_K4.20_GCC8.0.1/x86_64-native-linuxapp-gcc/b4fb65c55ea3485f8509e6101dc7e6a0/dpdk/x86_64-native-linuxapp-gcc/lib/librte_eal.a(eal_dev.o): in function `sigbus_handler':
eal_dev.c:(.text+0x59): undefined reference to `gettid'
collect2: error: ld returned 1 exit status
  CC test_memory.o
make[5]: *** [/tmp/FC29_K4.20_GCC8.0.1/x86_64-native-linuxapp-gcc/b4fb65c55ea3485f8509e6101dc7e6a0/dpdk/mk/rte.app.mk:399: dpdk-test-crypto-perf] Error 1
make[4]: *** [/tmp/FC29_K4.20_GCC8.0.1/x86_64-native-linuxapp-gcc/b4fb65c55ea3485f8509e6101dc7e6a0/dpdk/mk/rte.subdir.mk:37: test-crypto-perf] Error 2
  CC config.o
  CC test_memzone.o
--
  CC test_bitmap.o
  CC test_reciprocal_division.o
  CC macfwd.o
/usr/bin/ld: /tmp/FC29_K4.20_GCC8.0.1/x86_64-native-linuxapp-gcc/b4fb65c55ea3485f8509e6101dc7e6a0/dpdk/x86_64-native-linuxapp-gcc/lib/librte_eal.a(eal_dev.o): in function `sigbus_handler':
eal_dev.c:(.text+0x59): undefined reference to `gettid'
collect2: error: ld returned 1 exit status
make[5]: *** [/tmp/FC29_K4.20_GCC8.0.1/x86_64-native-linuxapp-gcc/b4fb65c55ea3485f8509e6101dc7e6a0/dpdk/mk/rte.app.mk:399: testpipeline] Error 1
make[4]: *** [/tmp/FC29_K4.20_GCC8.0.1/x86_64-native-linuxapp-gcc/b4fb65c55ea3485f8509e6101dc7e6a0/dpdk/mk/rte.subdir.mk:37: test-pipeline] Error 2
  LD testbbdev
  CC test_reciprocal_division_perf.o
  CC test_fbarray.o
--
  CC rxonly.o
  CC txonly.o
  CC test_ring.o
/usr/bin/ld: /tmp/FC29_K4.20_GCC8.0.1/x86_64-native-linuxapp-gcc/b4fb65c55ea3485f8509e6101dc7e6a0/dpdk/x86_64-native-linuxapp-gcc/lib/librte_eal.a(eal_dev.o): in function `sigbus_handler':
eal_dev.c:(.text+0x59): undefined reference to `gettid'
collect2: error: ld returned 1 exit status
make[5]: *** [/tmp/FC29_K4.20_GCC8.0.1/x86_64-native-linuxapp-gcc/b4fb65c55ea3485f8509e6101dc7e6a0/dpdk/mk/rte.app.mk:399: testbbdev] Error 1
make[4]: *** [/tmp/FC29_K4.20_GCC8.0.1/x86_64-native-linuxapp-gcc/b4fb65c55ea3485f8509e6101dc7e6a0/dpdk/mk/rte.subdir.mk:37: test-bbdev] Error 2
  CC test_ring_perf.o
  CC test_pmd_perf.o
  CC csumonly.o
--
  CC test_memcpy_perf.o
  CC test_member.o
  CC test_member_perf.o
/usr/bin/ld: /tmp/FC29_K4.20_GCC8.0.1/x86_64-native-linuxapp-gcc/b4fb65c55ea3485f8509e6101dc7e6a0/dpdk/x86_64-native-linuxapp-gcc/lib/librte_eal.a(eal_dev.o): in function `sigbus_handler':
eal_dev.c:(.text+0x59): undefined reference to `gettid'
collect2: error: ld returned 1 exit status
make[5]: *** [/tmp/FC29_K4.20_GCC8.0.1/x86_64-native-linuxapp-gcc/b4fb65c55ea3485f8509e6101dc7e6a0/dpdk/mk/rte.app.mk:399: testpmd] Error 1
make[4]: *** [/tmp/FC29_K4.20_GCC8.0.1/x86_64-native-linuxapp-gcc/b4fb65c55ea3485f8509e6101dc7e6a0/dpdk/mk/rte.subdir.mk:37: test-pmd] Error 2
  CC test_efd.o
  CC test_efd_perf.o
  CC test_hash.o
--
  CC test_ipsec.o
  MKRES test_resource_c.res.o
  LD test
/usr/bin/ld: /tmp/FC29_K4.20_GCC8.0.1/x86_64-native-linuxapp-gcc/b4fb65c55ea3485f8509e6101dc7e6a0/dpdk/x86_64-native-linuxapp-gcc/lib/librte_eal.a(eal_dev.o): in function `sigbus_handler':
eal_dev.c:(.text+0x59): undefined reference to `gettid'
collect2: error: ld returned 1 exit status
make[5]: *** [/tmp/FC29_K4.20_GCC8.0.1/x86_64-native-linuxapp-gcc/b4fb65c55ea3485f8509e6101dc7e6a0/dpdk/mk/rte.app.mk:399: test] Error 1
make[4]: *** [/tmp/FC29_K4.20_GCC8.0.1/x86_64-native-linuxapp-gcc/b4fb65c55ea3485f8509e6101dc7e6a0/dpdk/mk/rte.subdir.mk:37: test] Error 2
make[3]: *** [/tmp/FC29_K4.20_GCC8.0.1/x86_64-native-linuxapp-gcc/b4fb65c55ea3485f8509e6101dc7e6a0/dpdk/mk/rte.sdkbuild.mk:48: app] Error 2
make[2]: *** [/tmp/FC29_K4.20_GCC8.0.1/x86_64-native-linuxapp-gcc/b4fb65c55ea3485f8509e6101dc7e6a0/dpdk/mk/rte.sdkroot.mk:99: all] Error 2
make[1]: *** [/tmp/FC29_K4.20_GCC8.0.1/x86_64-native-linuxapp-gcc/b4fb65c55ea3485f8509e6101dc7e6a0/dpdk/mk/rte.sdkinstall.mk:58: pre_install] Error 2

*Failed Build #14:
OS: FC29
Target: x86_64-native-linuxapp-clang
  CC eal_interrupts.o
  CC eal_alarm.o
  CC eal_dev.o
  CC eal_common_lcore.o
  CC eal_common_timer.o
/tmp/FC29_K4.20_Clang6.0.1/x86_64-native-linuxapp-clang/b4fb65c55ea3485f8509e6101dc7e6a0/dpdk/lib/librte_eal/linuxapp/eal/eal_dev.c:76:8: warning: implicit declaration of function 'gettid' is invalid in C99 [-Wimplicit-function-declaration]
                (int)gettid(), info->si_addr);
                     ^
/tmp/FC29_K4.20_Clang6.0.1/x86_64-native-linuxapp-clang/b4fb65c55ea3485f8509e6101dc7e6a0/dpdk/lib/librte_eal/linuxapp/eal/eal_dev.c:76:8: warning: this function declaration is not a prototype [-Wstrict-prototypes]
2 warnings generated.
  CC eal_common_memzone.o
  CC eal_common_log.o
  CC eal_common_launch.o
  CC eal_common_memalloc.o
  CC eal_common_memory.o
--
  CC ifpga_feature_dev.o
  CC dpaa2_cmdif.o
  CC ifpga_fme.o
  CC ifpga_fme_iperf.o
  CC ifpga_fme_dperf.o
  CC ifpga_fme_error.o
  CC ifpga_port.o
  PMDINFO dpaa2_cmdif.o.pmd.c
  CC dpaa2_cmdif.o.pmd.o
  CC ifpga_port_error.o
  CC opae_hw_api.o
  LD dpaa2_cmdif.o
  CC opae_ifpga_hw_api.o
  AR librte_pmd_dpaa2_cmdif.a
  INSTALL-LIB librte_pmd_dpaa2_cmdif.a
--
  LD dpdk-pdump
  LD dpdk-procinfo
/usr/bin/ld: /tmp/FC29_K4.20_Clang6.0.1/x86_64-native-linuxapp-clang/b4fb65c55ea3485f8509e6101dc7e6a0/dpdk/x86_64-native-linuxapp-clang/lib/librte_eal.a(eal_dev.o): in function `sigbus_handler':
eal_dev.c:(.text+0x4d5): undefined reference to `gettid'
  CC test.o
clang-7: error: linker command failed with exit code 1 (use -v to see invocation)
make[5]: *** [/tmp/FC29_K4.20_Clang6.0.1/x86_64-native-linuxapp-clang/b4fb65c55ea3485f8509e6101dc7e6a0/dpdk/mk/rte.app.mk:399: cmdline_test] Error 1
make[4]: *** [/tmp/FC29_K4.20_Clang6.0.1/x86_64-native-linuxapp-clang/b4fb65c55ea3485f8509e6101dc7e6a0/dpdk/mk/rte.subdir.mk:37: test-cmdline] Error 2
make[4]: *** Waiting for unfinished jobs....
  CC cperf_ops.o
  CC init.o
/usr/bin/ld: /tmp/FC29_K4.20_Clang6.0.1/x86_64-native-linuxapp-clang/b4fb65c55ea3485f8509e6101dc7e6a0/dpdk/x86_64-native-linuxapp-clang/lib/librte_eal.a(eal_dev.o): in function `sigbus_handler':
eal_dev.c:(.text+0x4d5): undefined reference to `gettid'
/usr/bin/ld: /tmp/FC29_K4.20_Clang6.0.1/x86_64-native-linuxapp-clang/b4fb65c55ea3485f8509e6101dc7e6a0/dpdk/x86_64-native-linuxapp-clang/lib/librte_eal.a(eal_dev.o): in function `sigbus_handler':
eal_dev.c:(.text+0x4d5): undefined reference to `gettid'
  CC comp_perf_options_parse.o
clang-7: error: linker command failed with exit code 1 (use -v to see invocation)
make[5]: *** [/tmp/FC29_K4.20_Clang6.0.1/x86_64-native-linuxapp-clang/b4fb65c55ea3485f8509e6101dc7e6a0/dpdk/mk/rte.app.mk:399: dpdk-pdump] Error 1
make[4]: *** [/tmp/FC29_K4.20_Clang6.0.1/x86_64-native-linuxapp-clang/b4fb65c55ea3485f8509e6101dc7e6a0/dpdk/mk/rte.subdir.mk:37: pdump] Error 2
/usr/bin/ld: /tmp/FC29_K4.20_Clang6.0.1/x86_64-native-linuxapp-clang/b4fb65c55ea3485f8509e6101dc7e6a0/dpdk/x86_64-native-linuxapp-clang/lib/librte_eal.a(eal_dev.o): in function `sigbus_handler':
eal_dev.c:(.text+0x4d5): undefined reference to `gettid'
  CC runtime.o
  CC resource.o
clang-7: error: linker command failed with exit code 1 (use -v to see invocation)
make[5]: *** [/tmp/FC29_K4.20_Clang6.0.1/x86_64-native-linuxapp-clang/b4fb65c55ea3485f8509e6101dc7e6a0/dpdk/mk/rte.app.mk:399: testacl] Error 1
make[4]: *** [/tmp/FC29_K4.20_Clang6.0.1/x86_64-native-linuxapp-clang/b4fb65c55ea3485f8509e6101dc7e6a0/dpdk/mk/rte.subdir.mk:37: test-acl] Error 2
  CC pipeline_stub.o
clang-7: error: linker command failed with exit code 1 (use -v to see invocation)
make[5]: *** [/tmp/FC29_K4.20_Clang6.0.1/x86_64-native-linuxapp-clang/b4fb65c55ea3485f8509e6101dc7e6a0/dpdk/mk/rte.app.mk:399: dpdk-procinfo] Error 1
make[4]: *** [/tmp/FC29_K4.20_Clang6.0.1/x86_64-native-linuxapp-clang/b4fb65c55ea3485f8509e6101dc7e6a0/dpdk/mk/rte.subdir.mk:37: proc-info] Error 2
  CC pipeline_hash.o
  CC test_bbdev_perf.o
  CC test_resource.o
--
  CC test_cycles.o
  CC test_spinlock.o
/usr/bin/ld: /tmp/FC29_K4.20_Clang6.0.1/x86_64-native-linuxapp-clang/b4fb65c55ea3485f8509e6101dc7e6a0/dpdk/x86_64-native-linuxapp-clang/lib/librte_eal.a(eal_dev.o): in function `sigbus_handler':
eal_dev.c:(.text+0x4d5): undefined reference to `gettid'
  CC test_memory.o
clang-7: error: linker command failed with exit code 1 (use -v to see invocation)
  CC cperf_test_latency.o
make[5]: *** [/tmp/FC29_K4.20_Clang6.0.1/x86_64-native-linuxapp-clang/b4fb65c55ea3485f8509e6101dc7e6a0/dpdk/mk/rte.app.mk:399: testpipeline] Error 1
make[4]: *** [/tmp/FC29_K4.20_Clang6.0.1/x86_64-native-linuxapp-clang/b4fb65c55ea3485f8509e6101dc7e6a0/dpdk/mk/rte.subdir.mk:37: test-pipeline] Error 2
  CC test_memzone.o
  CC cmdline_mtr.o
--
  CC test_reciprocal_division.o
  CC test_reciprocal_division_perf.o
/usr/bin/ld: /tmp/FC29_K4.20_Clang6.0.1/x86_64-native-linuxapp-clang/b4fb65c55ea3485f8509e6101dc7e6a0/dpdk/x86_64-native-linuxapp-clang/lib/librte_eal.a(eal_dev.o): in function `sigbus_handler':
eal_dev.c:(.text+0x4d5): undefined reference to `gettid'
  CC cperf_test_pmd_cyclecount.o
clang-7: error: linker command failed with exit code 1 (use -v to see invocation)
make[5]: *** [/tmp/FC29_K4.20_Clang6.0.1/x86_64-native-linuxapp-clang/b4fb65c55ea3485f8509e6101dc7e6a0/dpdk/mk/rte.app.mk:399: dpdk-test-compress-perf] Error 1
make[4]: *** [/tmp/FC29_K4.20_Clang6.0.1/x86_64-native-linuxapp-clang/b4fb65c55ea3485f8509e6101dc7e6a0/dpdk/mk/rte.subdir.mk:37: test-compress-perf] Error 2
  CC cmdline_tm.o
  CC test_fbarray.o
  CC test_external_mem.o
--
  CC config.o
  CC iofwd.o
/usr/bin/ld: /tmp/FC29_K4.20_Clang6.0.1/x86_64-native-linuxapp-clang/b4fb65c55ea3485f8509e6101dc7e6a0/dpdk/x86_64-native-linuxapp-clang/lib/librte_eal.a(eal_dev.o): in function `sigbus_handler':
eal_dev.c:(.text+0x4d5): undefined reference to `gettid'
  CC test_ring_perf.o
clang-7: error: linker command failed with exit code 1 (use -v to see invocation)
make[5]: *** [/tmp/FC29_K4.20_Clang6.0.1/x86_64-native-linuxapp-clang/b4fb65c55ea3485f8509e6101dc7e6a0/dpdk/mk/rte.app.mk:399: testbbdev] Error 1
make[4]: *** [/tmp/FC29_K4.20_Clang6.0.1/x86_64-native-linuxapp-clang/b4fb65c55ea3485f8509e6101dc7e6a0/dpdk/mk/rte.subdir.mk:37: test-bbdev] Error 2
  CC cperf_test_verify.o
  CC test_pmd_perf.o
  CC cperf_test_vector_parsing.o
--
  LD dpdk-test-crypto-perf
  CC icmpecho.o
/usr/bin/ld: /tmp/FC29_K4.20_Clang6.0.1/x86_64-native-linuxapp-clang/b4fb65c55ea3485f8509e6101dc7e6a0/dpdk/x86_64-native-linuxapp-clang/lib/librte_eal.a(eal_dev.o): in function `sigbus_handler':
eal_dev.c:(.text+0x4d5): undefined reference to `gettid'
  CC noisy_vnf.o
clang-7: error: linker command failed with exit code 1 (use -v to see invocation)
make[5]: *** [/tmp/FC29_K4.20_Clang6.0.1/x86_64-native-linuxapp-clang/b4fb65c55ea3485f8509e6101dc7e6a0/dpdk/mk/rte.app.mk:399: dpdk-test-crypto-perf] Error 1
make[4]: *** [/tmp/FC29_K4.20_Clang6.0.1/x86_64-native-linuxapp-clang/b4fb65c55ea3485f8509e6101dc7e6a0/dpdk/mk/rte.subdir.mk:37: test-crypto-perf] Error 2
  CC test_table_tables.o
  CC bpf_cmd.o
  CC util.o
--
eal_dev.c:(.text+0x4d5): undefined reference to `gettid'
  CC test_mbuf.o
  CC test_logs.o
  CC test_memcpy.o
  CC test_memcpy_perf.o
clang-7: error: linker command failed with exit code 1 (use -v to see invocation)
make[5]: *** [/tmp/FC29_K4.20_Clang6.0.1/x86_64-native-linuxapp-clang/b4fb65c55ea3485f8509e6101dc7e6a0/dpdk/mk/rte.app.mk:399: testpmd] Error 1
make[4]: *** [/tmp/FC29_K4.20_Clang6.0.1/x86_64-native-linuxapp-clang/b4fb65c55ea3485f8509e6101dc7e6a0/dpdk/mk/rte.subdir.mk:37: test-pmd] Error 2
  CC test_member.o
  CC test_member_perf.o
  CC test_efd.o
--
  CC test_ipsec.o
  MKRES test_resource_c.res.o
  LD test
/usr/bin/ld: /tmp/FC29_K4.20_Clang6.0.1/x86_64-native-linuxapp-clang/b4fb65c55ea3485f8509e6101dc7e6a0/dpdk/x86_64-native-linuxapp-clang/lib/librte_eal.a(eal_dev.o): in function `sigbus_handler':
eal_dev.c:(.text+0x4d5): undefined reference to `gettid'
clang-7: error: linker command failed with exit code 1 (use -v to see invocation)
make[5]: *** [/tmp/FC29_K4.20_Clang6.0.1/x86_64-native-linuxapp-clang/b4fb65c55ea3485f8509e6101dc7e6a0/dpdk/mk/rte.app.mk:399: test] Error 1
make[4]: *** [/tmp/FC29_K4.20_Clang6.0.1/x86_64-native-linuxapp-clang/b4fb65c55ea3485f8509e6101dc7e6a0/dpdk/mk/rte.subdir.mk:37: test] Error 2
make[3]: *** [/tmp/FC29_K4.20_Clang6.0.1/x86_64-native-linuxapp-clang/b4fb65c55ea3485f8509e6101dc7e6a0/dpdk/mk/rte.sdkbuild.mk:48: app] Error 2
make[2]: *** [/tmp/FC29_K4.20_Clang6.0.1/x86_64-native-linuxapp-clang/b4fb65c55ea3485f8509e6101dc7e6a0/dpdk/mk/rte.sdkroot.mk:99: all] Error 2
make[1]: *** [/tmp/FC29_K4.20_Clang6.0.1/x86_64-native-linuxapp-clang/b4fb65c55ea3485f8509e6101dc7e6a0/dpdk/mk/rte.sdkinstall.mk:58: pre_install] Error 2

*Failed Build #15:
OS: FC29
Target: x86_64-native-linuxapp-icc
  CC eal_alarm.o
  CC eal_dev.o
  CC eal_common_lcore.o
  CC eal_common_timer.o
  CC eal_common_memzone.o
/tmp/FC29_K4.20_ICC19.0.0/x86_64-native-linuxapp-icc/b4fb65c55ea3485f8509e6101dc7e6a0/dpdk/lib/librte_eal/linuxapp/eal/eal_dev.c(75): warning #266: function "gettid" declared implicitly
  	RTE_LOG(DEBUG, EAL, "Thread[%d] catch SIGBUS, fault address:%p\n",
  	^

  CC eal_common_log.o
  CC eal_common_launch.o
--
  CC ifpga_fme.o
  CC ifpga_fme_iperf.o
  CC ifpga_fme_dperf.o
  SYMLINK-FILE include/rte_pmd_dpaa2_qdma.h
  CC dpaa2_qdma.o
  CC ifpga_fme_error.o
  CC ifpga_port.o
  CC ifpga_port_error.o
  PMDINFO skeleton_rawdev.o.pmd.c
  CC skeleton_rawdev.o.pmd.o
  PMDINFO dpaa2_cmdif.o.pmd.c
  CC dpaa2_cmdif.o.pmd.o
  CC opae_hw_api.o

*Failed Build #16:
OS: RHEL74
Target: x86_64-native-linuxapp-gcc
  CC eal_interrupts.o
  CC eal_alarm.o
  CC eal_dev.o
  CC eal_common_lcore.o
/tmp/RHEL74_K3.10.0_GCC4.8.5/x86_64-native-linuxapp-gcc/b4fb65c55ea3485f8509e6101dc7e6a0/dpdk/lib/librte_eal/linuxapp/eal/eal_dev.c: In function ‘sigbus_handler’:
/tmp/RHEL74_K3.10.0_GCC4.8.5/x86_64-native-linuxapp-gcc/b4fb65c55ea3485f8509e6101dc7e6a0/dpdk/lib/librte_eal/linuxapp/eal/eal_dev.c:75:2: warning: implicit declaration of function ‘gettid’ [-Wimplicit-function-declaration]
  RTE_LOG(DEBUG, EAL, "Thread[%d] catch SIGBUS, fault address:%p\n",
  ^
/tmp/RHEL74_K3.10.0_GCC4.8.5/x86_64-native-linuxapp-gcc/b4fb65c55ea3485f8509e6101dc7e6a0/dpdk/lib/librte_eal/linuxapp/eal/eal_dev.c:75:2: warning: nested extern declaration of ‘gettid’ [-Wnested-externs]
  CC eal_common_timer.o
  CC eal_common_memzone.o
  CC eal_common_log.o
  CC eal_common_launch.o
  CC eal_common_memalloc.o
--
  CC skeleton_rawdev.o.pmd.o
  AR librte_pmd_dpaa2_cmdif.a
  LD skeleton_rawdev.o
  CC dpaa2_qdma.o
  INSTALL-LIB librte_pmd_dpaa2_cmdif.a
  CC ifpga_fme_error.o
  CC ifpga_port.o
  AR librte_pmd_skeleton_rawdev.a
  CC ifpga_port_error.o
  INSTALL-LIB librte_pmd_skeleton_rawdev.a
  CC opae_hw_api.o
  CC opae_ifpga_hw_api.o
  CC opae_debug.o
  CC ifpga_fme_pr.o
--
  CC cperf_ops.o
  CC test_resource.o
  CC runtime.o
/tmp/RHEL74_K3.10.0_GCC4.8.5/x86_64-native-linuxapp-gcc/b4fb65c55ea3485f8509e6101dc7e6a0/dpdk/x86_64-native-linuxapp-gcc/lib/librte_eal.a(eal_dev.o): In function `sigbus_handler':
eal_dev.c:(.text+0x59): undefined reference to `gettid'
collect2: error: ld returned 1 exit status
make[5]: *** [testacl] Error 1
make[4]: *** [test-acl] Error 2
make[4]: *** Waiting for unfinished jobs....
  CC cperf_options_parsing.o
  CC test_prefetch.o
/tmp/RHEL74_K3.10.0_GCC4.8.5/x86_64-native-linuxapp-gcc/b4fb65c55ea3485f8509e6101dc7e6a0/dpdk/x86_64-native-linuxapp-gcc/lib/librte_eal.a(eal_dev.o): In function `sigbus_handler':
eal_dev.c:(.text+0x59): undefined reference to `gettid'
collect2: error: ld returned 1 exit status
make[5]: *** [dpdk-procinfo] Error 1
make[4]: *** [proc-info] Error 2
  CC test_byteorder.o
  CC test_per_lcore.o
  CC test_bbdev_perf.o
/tmp/RHEL74_K3.10.0_GCC4.8.5/x86_64-native-linuxapp-gcc/b4fb65c55ea3485f8509e6101dc7e6a0/dpdk/x86_64-native-linuxapp-gcc/lib/librte_eal.a(eal_dev.o): In function `sigbus_handler':
eal_dev.c:(.text+0x59): undefined reference to `gettid'
collect2: error: ld returned 1 exit status
make[5]: *** [cmdline_test] Error 1
make[4]: *** [test-cmdline] Error 2
  CC cperf_test_vectors.o
  CC cperf_test_throughput.o
/tmp/RHEL74_K3.10.0_GCC4.8.5/x86_64-native-linuxapp-gcc/b4fb65c55ea3485f8509e6101dc7e6a0/dpdk/x86_64-native-linuxapp-gcc/lib/librte_eal.a(eal_dev.o): In function `sigbus_handler':
eal_dev.c:(.text+0x59): undefined reference to `gettid'
collect2: error: ld returned 1 exit status
make[5]: *** [dpdk-pdump] Error 1
make[4]: *** [pdump] Error 2
  CC test_atomic.o
  CC test_bbdev_vector.o
  CC comp_perf_options_parse.o
--
  CC test_external_mem.o
  LD testpipeline
  CC test_ring.o
/tmp/RHEL74_K3.10.0_GCC4.8.5/x86_64-native-linuxapp-gcc/b4fb65c55ea3485f8509e6101dc7e6a0/dpdk/x86_64-native-linuxapp-gcc/lib/librte_eal.a(eal_dev.o): In function `sigbus_handler':
eal_dev.c:(.text+0x59): undefined reference to `gettid'
collect2: error: ld returned 1 exit status
make[5]: *** [dpdk-test-crypto-perf] Error 1
make[4]: *** [test-crypto-perf] Error 2
  CC test_ring_perf.o
  CC cmdline_flow.o
  CC test_pmd_perf.o
--
  CC cmdline_mtr.o
  CC test_table.o
  CC test_table_pipeline.o
/tmp/RHEL74_K3.10.0_GCC4.8.5/x86_64-native-linuxapp-gcc/b4fb65c55ea3485f8509e6101dc7e6a0/dpdk/x86_64-native-linuxapp-gcc/lib/librte_eal.a(eal_dev.o): In function `sigbus_handler':
eal_dev.c:(.text+0x59): undefined reference to `gettid'
collect2: error: ld returned 1 exit status
make[5]: *** [testpipeline] Error 1
make[4]: *** [test-pipeline] Error 2
  CC test_table_tables.o
/tmp/RHEL74_K3.10.0_GCC4.8.5/x86_64-native-linuxapp-gcc/b4fb65c55ea3485f8509e6101dc7e6a0/dpdk/x86_64-native-linuxapp-gcc/lib/librte_eal.a(eal_dev.o): In function `sigbus_handler':
eal_dev.c:(.text+0x59): undefined reference to `gettid'
collect2: error: ld returned 1 exit status
make[5]: *** [dpdk-test-compress-perf] Error 1
make[4]: *** [test-compress-perf] Error 2
  CC cmdline_tm.o
  CC test_table_ports.o
  LD testbbdev
--
  CC test_table_acl.o
  CC test_flow_classify.o
  CC config.o
/tmp/RHEL74_K3.10.0_GCC4.8.5/x86_64-native-linuxapp-gcc/b4fb65c55ea3485f8509e6101dc7e6a0/dpdk/x86_64-native-linuxapp-gcc/lib/librte_eal.a(eal_dev.o): In function `sigbus_handler':
eal_dev.c:(.text+0x59): undefined reference to `gettid'
collect2: error: ld returned 1 exit status
make[5]: *** [testbbdev] Error 1
make[4]: *** [test-bbdev] Error 2
  CC iofwd.o
  CC test_rwlock.o
  CC macfwd.o
--
  CC test_cmdline_etheraddr.o
  CC test_cmdline_portlist.o
  CC test_cmdline_ipaddr.o
/tmp/RHEL74_K3.10.0_GCC4.8.5/x86_64-native-linuxapp-gcc/b4fb65c55ea3485f8509e6101dc7e6a0/dpdk/x86_64-native-linuxapp-gcc/lib/librte_eal.a(eal_dev.o): In function `sigbus_handler':
eal_dev.c:(.text+0x59): undefined reference to `gettid'
collect2: error: ld returned 1 exit status
make[5]: *** [testpmd] Error 1
make[4]: *** [test-pmd] Error 2
  CC test_cmdline_cirbuf.o
  CC test_cmdline_string.o
  CC test_cmdline_lib.o
--
  CC test_ipsec.o
  MKRES test_resource_c.res.o
  LD test
/tmp/RHEL74_K3.10.0_GCC4.8.5/x86_64-native-linuxapp-gcc/b4fb65c55ea3485f8509e6101dc7e6a0/dpdk/x86_64-native-linuxapp-gcc/lib/librte_eal.a(eal_dev.o): In function `sigbus_handler':
eal_dev.c:(.text+0x59): undefined reference to `gettid'
collect2: error: ld returned 1 exit status
make[5]: *** [test] Error 1
make[4]: *** [test] Error 2
make[3]: *** [app] Error 2
make[2]: *** [all] Error 2
make[1]: *** [pre_install] Error 2

*Failed Build #17:
OS: CENTOS74
Target: x86_64-native-linuxapp-gcc
  CC eal_timer.o
  CC eal_interrupts.o
  CC eal_alarm.o
  CC eal_dev.o
/tmp/CENTOS74_K3.10.0_GCC4.8.5/x86_64-native-linuxapp-gcc/b4fb65c55ea3485f8509e6101dc7e6a0/dpdk/lib/librte_eal/linuxapp/eal/eal_dev.c: In function ‘sigbus_handler’:
/tmp/CENTOS74_K3.10.0_GCC4.8.5/x86_64-native-linuxapp-gcc/b4fb65c55ea3485f8509e6101dc7e6a0/dpdk/lib/librte_eal/linuxapp/eal/eal_dev.c:75:2: warning: implicit declaration of function ‘gettid’ [-Wimplicit-function-declaration]
  RTE_LOG(DEBUG, EAL, "Thread[%d] catch SIGBUS, fault address:%p\n",
  ^
/tmp/CENTOS74_K3.10.0_GCC4.8.5/x86_64-native-linuxapp-gcc/b4fb65c55ea3485f8509e6101dc7e6a0/dpdk/lib/librte_eal/linuxapp/eal/eal_dev.c:75:2: warning: nested extern declaration of ‘gettid’ [-Wnested-externs]
  CC eal_common_lcore.o
  CC eal_common_timer.o
  CC eal_common_memzone.o
  CC eal_common_log.o
  CC eal_common_launch.o
--
  SYMLINK-FILE include/rte_pmd_dpaa2_cmdif.h
  CC ifpga_fme_iperf.o
  CC dpaa2_cmdif.o
  CC skeleton_rawdev.o
  CC ifpga_fme_dperf.o
  CC ifpga_fme_error.o
  PMDINFO dpaa2_cmdif.o.pmd.c
  CC dpaa2_cmdif.o.pmd.o
  LD dpaa2_cmdif.o
  AR librte_pmd_dpaa2_cmdif.a
  INSTALL-LIB librte_pmd_dpaa2_cmdif.a
  PMDINFO skeleton_rawdev.o.pmd.c
  CC skeleton_rawdev.o.pmd.o
  CC skeleton_rawdev_test.o
  CC ifpga_port.o
  LD skeleton_rawdev.o
  CC ifpga_port_error.o
  PMDINFO dpaa2_qdma.o.pmd.c
  CC dpaa2_qdma.o.pmd.o
  LD dpaa2_qdma.o
  CC opae_hw_api.o
  CC opae_ifpga_hw_api.o
--
  CC test.o
  CC cperf_ops.o
  CC runtime.o
/tmp/CENTOS74_K3.10.0_GCC4.8.5/x86_64-native-linuxapp-gcc/b4fb65c55ea3485f8509e6101dc7e6a0/dpdk/x86_64-native-linuxapp-gcc/lib/librte_eal.a(eal_dev.o): In function `sigbus_handler':
eal_dev.c:(.text+0x59): undefined reference to `gettid'
collect2: error: ld returned 1 exit status
make[5]: *** [dpdk-procinfo] Error 1
make[4]: *** [proc-info] Error 2
make[4]: *** Waiting for unfinished jobs....
  CC pipeline_stub.o
/tmp/CENTOS74_K3.10.0_GCC4.8.5/x86_64-native-linuxapp-gcc/b4fb65c55ea3485f8509e6101dc7e6a0/dpdk/x86_64-native-linuxapp-gcc/lib/librte_eal.a(eal_dev.o): In function `sigbus_handler':
eal_dev.c:(.text+0x59): undefined reference to `gettid'
collect2: error: ld returned 1 exit status
make[5]: *** [cmdline_test] Error 1
make[4]: *** [test-cmdline] Error 2
  CC comp_perf_options_parse.o
  CC resource.o
  CC pipeline_hash.o
  CC test_bbdev_perf.o
/tmp/CENTOS74_K3.10.0_GCC4.8.5/x86_64-native-linuxapp-gcc/b4fb65c55ea3485f8509e6101dc7e6a0/dpdk/x86_64-native-linuxapp-gcc/lib/librte_eal.a(eal_dev.o): In function `sigbus_handler':
eal_dev.c:(.text+0x59): undefined reference to `gettid'
collect2: error: ld returned 1 exit status
make[5]: *** [testacl] Error 1
make[4]: *** [test-acl] Error 2
  CC test_resource.o
  CC cperf_options_parsing.o
  CC pipeline_lpm.o
  CC test_bbdev_vector.o
  CC comp_perf_test_verify.o
  CC pipeline_lpm_ipv6.o
/tmp/CENTOS74_K3.10.0_GCC4.8.5/x86_64-native-linuxapp-gcc/b4fb65c55ea3485f8509e6101dc7e6a0/dpdk/x86_64-native-linuxapp-gcc/lib/librte_eal.a(eal_dev.o): In function `sigbus_handler':
eal_dev.c:(.text+0x59): undefined reference to `gettid'
collect2: error: ld returned 1 exit status
make[5]: *** [dpdk-pdump] Error 1
make[4]: *** [pdump] Error 2
  CC pipeline_acl.o
  CC test_prefetch.o
  CC cperf_test_vectors.o
--
  CC cperf_test_vector_parsing.o
  CC test_malloc.o
  LD dpdk-test-compress-perf
/tmp/CENTOS74_K3.10.0_GCC4.8.5/x86_64-native-linuxapp-gcc/b4fb65c55ea3485f8509e6101dc7e6a0/dpdk/x86_64-native-linuxapp-gcc/lib/librte_eal.a(eal_dev.o): In function `sigbus_handler':
eal_dev.c:(.text+0x59): undefined reference to `gettid'
collect2: error: ld returned 1 exit status
make[5]: *** [testpipeline] Error 1
make[4]: *** [test-pipeline] Error 2
  CC test_cycles.o
  CC cperf_test_common.o
  CC cmdline_tm.o
--
  CC test_memzone.o
  LD dpdk-test-crypto-perf
  CC test_bitmap.o
/tmp/CENTOS74_K3.10.0_GCC4.8.5/x86_64-native-linuxapp-gcc/b4fb65c55ea3485f8509e6101dc7e6a0/dpdk/x86_64-native-linuxapp-gcc/lib/librte_eal.a(eal_dev.o): In function `sigbus_handler':
eal_dev.c:(.text+0x59): undefined reference to `gettid'
collect2: error: ld returned 1 exit status
make[5]: *** [dpdk-test-compress-perf] Error 1
make[4]: *** [test-compress-perf] Error 2
  CC test_reciprocal_division.o
  CC test_reciprocal_division_perf.o
  CC test_fbarray.o
--
  CC test_ring_perf.o
  LD testbbdev
  CC test_pmd_perf.o
/tmp/CENTOS74_K3.10.0_GCC4.8.5/x86_64-native-linuxapp-gcc/b4fb65c55ea3485f8509e6101dc7e6a0/dpdk/x86_64-native-linuxapp-gcc/lib/librte_eal.a(eal_dev.o): In function `sigbus_handler':
eal_dev.c:(.text+0x59): undefined reference to `gettid'
collect2: error: ld returned 1 exit status
make[5]: *** [dpdk-test-crypto-perf] Error 1
make[4]: *** [test-crypto-perf] Error 2
  CC test_table.o
  CC test_table_pipeline.o
  CC test_table_tables.o
--
  CC test_table_ports.o
  CC test_table_combined.o
  CC macswap.o
/tmp/CENTOS74_K3.10.0_GCC4.8.5/x86_64-native-linuxapp-gcc/b4fb65c55ea3485f8509e6101dc7e6a0/dpdk/x86_64-native-linuxapp-gcc/lib/librte_eal.a(eal_dev.o): In function `sigbus_handler':
eal_dev.c:(.text+0x59): undefined reference to `gettid'
collect2: error: ld returned 1 exit status
make[5]: *** [testbbdev] Error 1
make[4]: *** [test-bbdev] Error 2
  CC test_table_acl.o
  CC flowgen.o
  CC rxonly.o
--
  CC test_cmdline.o
  CC test_cmdline_num.o
  CC test_cmdline_etheraddr.o
/tmp/CENTOS74_K3.10.0_GCC4.8.5/x86_64-native-linuxapp-gcc/b4fb65c55ea3485f8509e6101dc7e6a0/dpdk/x86_64-native-linuxapp-gcc/lib/librte_eal.a(eal_dev.o): In function `sigbus_handler':
eal_dev.c:(.text+0x59): undefined reference to `gettid'
collect2: error: ld returned 1 exit status
make[5]: *** [testpmd] Error 1
make[4]: *** [test-pmd] Error 2
  CC test_cmdline_portlist.o
  CC test_cmdline_ipaddr.o
  CC test_cmdline_cirbuf.o
--
  CC test_ipsec.o
  MKRES test_resource_c.res.o
  LD test
/tmp/CENTOS74_K3.10.0_GCC4.8.5/x86_64-native-linuxapp-gcc/b4fb65c55ea3485f8509e6101dc7e6a0/dpdk/x86_64-native-linuxapp-gcc/lib/librte_eal.a(eal_dev.o): In function `sigbus_handler':
eal_dev.c:(.text+0x59): undefined reference to `gettid'
collect2: error: ld returned 1 exit status
make[5]: *** [test] Error 1
make[4]: *** [test] Error 2
make[3]: *** [app] Error 2
make[2]: *** [all] Error 2
make[1]: *** [pre_install] Error 2

*Failed Build #18:
OS: CENTOS75
Target: x86_64-native-linuxapp-gcc
  CC eal_timer.o
  CC eal_interrupts.o
  CC eal_alarm.o
  CC eal_dev.o
/tmp/CENTOS75_K3.10.0_GCC4.8.5/x86_64-native-linuxapp-gcc/b4fb65c55ea3485f8509e6101dc7e6a0/dpdk/lib/librte_eal/linuxapp/eal/eal_dev.c: In function ‘sigbus_handler’:
/tmp/CENTOS75_K3.10.0_GCC4.8.5/x86_64-native-linuxapp-gcc/b4fb65c55ea3485f8509e6101dc7e6a0/dpdk/lib/librte_eal/linuxapp/eal/eal_dev.c:75:2: warning: implicit declaration of function ‘gettid’ [-Wimplicit-function-declaration]
  RTE_LOG(DEBUG, EAL, "Thread[%d] catch SIGBUS, fault address:%p\n",
  ^
/tmp/CENTOS75_K3.10.0_GCC4.8.5/x86_64-native-linuxapp-gcc/b4fb65c55ea3485f8509e6101dc7e6a0/dpdk/lib/librte_eal/linuxapp/eal/eal_dev.c:75:2: warning: nested extern declaration of ‘gettid’ [-Wnested-externs]
  CC eal_common_lcore.o
  CC eal_common_timer.o
  CC eal_common_memzone.o
  CC eal_common_log.o
  CC eal_common_launch.o
--
  CC ifpga_feature_dev.o
  CC ifpga_fme.o
  CC ifpga_fme_iperf.o
  CC ifpga_fme_dperf.o
  PMDINFO dpaa2_cmdif.o.pmd.c
  CC ifpga_fme_error.o
  CC dpaa2_cmdif.o.pmd.o
  PMDINFO skeleton_rawdev.o.pmd.c
  CC skeleton_rawdev.o.pmd.o
  LD dpaa2_cmdif.o
  LD skeleton_rawdev.o
  CC ifpga_port.o
  AR librte_pmd_dpaa2_cmdif.a
  AR librte_pmd_skeleton_rawdev.a
  CC ifpga_port_error.o
  INSTALL-LIB librte_pmd_dpaa2_cmdif.a
  CC opae_hw_api.o
  CC opae_ifpga_hw_api.o
  CC opae_debug.o
  CC ifpga_fme_pr.o
--
  LD dpdk-pdump
  CC comp_perf_options_parse.o
  CC test.o
/tmp/CENTOS75_K3.10.0_GCC4.8.5/x86_64-native-linuxapp-gcc/b4fb65c55ea3485f8509e6101dc7e6a0/dpdk/x86_64-native-linuxapp-gcc/lib/librte_eal.a(eal_dev.o): In function `sigbus_handler':
eal_dev.c:(.text+0x59): undefined reference to `gettid'
collect2: error: ld returned 1 exit status
make[5]: *** [dpdk-procinfo] Error 1
make[4]: *** [proc-info] Error 2
make[4]: *** Waiting for unfinished jobs....
  CC init.o
  CC cperf_options_parsing.o
  CC resource.o
/tmp/CENTOS75_K3.10.0_GCC4.8.5/x86_64-native-linuxapp-gcc/b4fb65c55ea3485f8509e6101dc7e6a0/dpdk/x86_64-native-linuxapp-gcc/lib/librte_eal.a(eal_dev.o): In function `sigbus_handler':
eal_dev.c:(.text+0x59): undefined reference to `gettid'
collect2: error: ld returned 1 exit status
make[5]: *** [testacl] Error 1
make[4]: *** [test-acl] Error 2
  CC comp_perf_test_verify.o
  CC comp_perf_test_benchmark.o
  CC test_resource.o
  CC cperf_test_vectors.o
/tmp/CENTOS75_K3.10.0_GCC4.8.5/x86_64-native-linuxapp-gcc/b4fb65c55ea3485f8509e6101dc7e6a0/dpdk/x86_64-native-linuxapp-gcc/lib/librte_eal.a(eal_dev.o): In function `sigbus_handler':
eal_dev.c:(.text+0x59): undefined reference to `gettid'
collect2: error: ld returned 1 exit status
make[5]: *** [dpdk-pdump] Error 1
make[4]: *** [pdump] Error 2
  CC cperf_test_throughput.o
  CC runtime.o
  CC test_prefetch.o
  CC test_bbdev_perf.o
/tmp/CENTOS75_K3.10.0_GCC4.8.5/x86_64-native-linuxapp-gcc/b4fb65c55ea3485f8509e6101dc7e6a0/dpdk/x86_64-native-linuxapp-gcc/lib/librte_eal.a(eal_dev.o): In function `sigbus_handler':
eal_dev.c:(.text+0x59): undefined reference to `gettid'
collect2: error: ld returned 1 exit status
make[5]: *** [cmdline_test] Error 1
make[4]: *** [test-cmdline] Error 2
  CC test_bbdev_vector.o
  CC cperf_test_latency.o
  CC test_byteorder.o
--
  CC cperf_test_common.o
  CC test_cycles.o
  CC test_spinlock.o
/tmp/CENTOS75_K3.10.0_GCC4.8.5/x86_64-native-linuxapp-gcc/b4fb65c55ea3485f8509e6101dc7e6a0/dpdk/x86_64-native-linuxapp-gcc/lib/librte_eal.a(eal_dev.o): In function `sigbus_handler':
eal_dev.c:(.text+0x59): undefined reference to `gettid'
collect2: error: ld returned 1 exit status
make[5]: *** [dpdk-test-compress-perf] Error 1
make[4]: *** [test-compress-perf] Error 2
  CC pipeline_lpm.o
  CC cmdline_flow.o
  CC test_memory.o
--
  CC test_reciprocal_division_perf.o
  CC test_fbarray.o
  CC cmdline_mtr.o
/tmp/CENTOS75_K3.10.0_GCC4.8.5/x86_64-native-linuxapp-gcc/b4fb65c55ea3485f8509e6101dc7e6a0/dpdk/x86_64-native-linuxapp-gcc/lib/librte_eal.a(eal_dev.o): In function `sigbus_handler':
eal_dev.c:(.text+0x59): undefined reference to `gettid'
collect2: error: ld returned 1 exit status
make[5]: *** [dpdk-test-crypto-perf] Error 1
make[4]: *** [test-crypto-perf] Error 2
  CC cmdline_tm.o
  CC test_external_mem.o
  LD testpipeline
--
  CC test_pmd_perf.o
  CC test_table.o
  CC iofwd.o
/tmp/CENTOS75_K3.10.0_GCC4.8.5/x86_64-native-linuxapp-gcc/b4fb65c55ea3485f8509e6101dc7e6a0/dpdk/x86_64-native-linuxapp-gcc/lib/librte_eal.a(eal_dev.o): In function `sigbus_handler':
eal_dev.c:(.text+0x59): undefined reference to `gettid'
collect2: error: ld returned 1 exit status
make[5]: *** [testpipeline] Error 1
make[4]: *** [test-pipeline] Error 2
  CC macfwd.o
  CC test_table_pipeline.o
/tmp/CENTOS75_K3.10.0_GCC4.8.5/x86_64-native-linuxapp-gcc/b4fb65c55ea3485f8509e6101dc7e6a0/dpdk/x86_64-native-linuxapp-gcc/lib/librte_eal.a(eal_dev.o): In function `sigbus_handler':
eal_dev.c:(.text+0x59): undefined reference to `gettid'
collect2: error: ld returned 1 exit status
make[5]: *** [testbbdev] Error 1
  CC test_table_tables.o
make[4]: *** [test-bbdev] Error 2
  CC macswap.o
  CC flowgen.o
--
  CC test_tailq.o
  CC test_string_fns.o
  CC test_cpuflags.o
/tmp/CENTOS75_K3.10.0_GCC4.8.5/x86_64-native-linuxapp-gcc/b4fb65c55ea3485f8509e6101dc7e6a0/dpdk/x86_64-native-linuxapp-gcc/lib/librte_eal.a(eal_dev.o): In function `sigbus_handler':
eal_dev.c:(.text+0x59): undefined reference to `gettid'
collect2: error: ld returned 1 exit status
make[5]: *** [testpmd] Error 1
make[4]: *** [test-pmd] Error 2
  CC test_mp_secondary.o
  CC test_eal_flags.o
  CC test_eal_fs.o
--
  CC test_ipsec.o
  MKRES test_resource_c.res.o
  LD test
/tmp/CENTOS75_K3.10.0_GCC4.8.5/x86_64-native-linuxapp-gcc/b4fb65c55ea3485f8509e6101dc7e6a0/dpdk/x86_64-native-linuxapp-gcc/lib/librte_eal.a(eal_dev.o): In function `sigbus_handler':
eal_dev.c:(.text+0x59): undefined reference to `gettid'
collect2: error: ld returned 1 exit status
make[5]: *** [test] Error 1
make[4]: *** [test] Error 2
make[3]: *** [app] Error 2
make[2]: *** [all] Error 2
make[1]: *** [pre_install] Error 2

*Failed Build #19:
OS: FC28
Target: x86_64-native-linuxapp-icc
  CC eal_alarm.o
  CC eal_dev.o
  CC eal_common_lcore.o
  CC eal_common_timer.o
  CC eal_common_memzone.o
/tmp/FC28_K4.16.3_ICC19.0.0/x86_64-native-linuxapp-icc/b4fb65c55ea3485f8509e6101dc7e6a0/dpdk/lib/librte_eal/linuxapp/eal/eal_dev.c(75): warning #266: function "gettid" declared implicitly
  	RTE_LOG(DEBUG, EAL, "Thread[%d] catch SIGBUS, fault address:%p\n",
  	^

  CC eal_common_log.o
  CC eal_common_launch.o
--
  INSTALL-LIB librte_common_octeontx.a
  Building modules, stage 2.
  AR librte_common_dpaax.a
  INSTALL-LIB librte_common_dpaax.a
== Build drivers/bus
/tmp/FC28_K4.16.3_ICC19.0.0/x86_64-native-linuxapp-icc/b4fb65c55ea3485f8509e6101dc7e6a0/dpdk/x86_64-native-linuxapp-icc/build/kernel/linux/kni/kni_misc.o: warning: objtool: kni_ioctl_release()+0x60: sibling call from callable instruction with modified stack frame
/tmp/FC28_K4.16.3_ICC19.0.0/x86_64-native-linuxapp-icc/b4fb65c55ea3485f8509e6101dc7e6a0/dpdk/x86_64-native-linuxapp-icc/build/kernel/linux/kni/kni_misc.o: warning: objtool: kni_ioctl()+0x2d: sibling call from callable instruction with modified stack frame
/tmp/FC28_K4.16.3_ICC19.0.0/x86_64-native-linuxapp-icc/b4fb65c55ea3485f8509e6101dc7e6a0/dpdk/x86_64-native-linuxapp-icc/build/kernel/linux/kni/kni_misc.o: warning: objtool: kni_ioctl.cold.6()+0xc: sibling call from callable instruction with modified stack frame
/tmp/FC28_K4.16.3_ICC19.0.0/x86_64-native-linuxapp-icc/b4fb65c55ea3485f8509e6101dc7e6a0/dpdk/x86_64-native-linuxapp-icc/build/kernel/linux/kni/kni_net.o: warning: objtool: kni_fifo_trans_pa2va()+0x167: sibling call from callable instruction with modified stack frame
/tmp/FC28_K4.16.3_ICC19.0.0/x86_64-native-linuxapp-icc/b4fb65c55ea3485f8509e6101dc7e6a0/dpdk/x86_64-native-linuxapp-icc/build/kernel/linux/kni/kni_net.o: warning: objtool: kni_net_rx_lo_fifo_skb()+0x326: sibling call from callable instruction with modified stack frame
/tmp/FC28_K4.16.3_ICC19.0.0/x86_64-native-linuxapp-icc/b4fb65c55ea3485f8509e6101dc7e6a0/dpdk/x86_64-native-linuxapp-icc/build/kernel/linux/kni/kni_net.o: warning: objtool: kni_net_process_request()+0x2d: sibling call from callable instruction with modified stack frame
/tmp/FC28_K4.16.3_ICC19.0.0/x86_64-native-linuxapp-icc/b4fb65c55ea3485f8509e6101dc7e6a0/dpdk/x86_64-native-linuxapp-icc/build/kernel/linux/kni/kni_net.o: warning: objtool: kni_net_set_mac()+0x1a6: sibling call from callable instruction with modified stack frame
/tmp/FC28_K4.16.3_ICC19.0.0/x86_64-native-linuxapp-icc/b4fb65c55ea3485f8509e6101dc7e6a0/dpdk/x86_64-native-linuxapp-icc/build/kernel/linux/kni/kni_net.o: warning: objtool: kni_net_rx_lo_fifo()+0x31c: sibling call from callable instruction with modified stack frame
/tmp/FC28_K4.16.3_ICC19.0.0/x86_64-native-linuxapp-icc/b4fb65c55ea3485f8509e6101dc7e6a0/dpdk/x86_64-native-linuxapp-icc/build/kernel/linux/kni/kni_net.o: warning: objtool: kni_net_rx_normal()+0x2f9: sibling call from callable instruction with modified stack frame
/tmp/FC28_K4.16.3_ICC19.0.0/x86_64-native-linuxapp-icc/b4fb65c55ea3485f8509e6101dc7e6a0/dpdk/x86_64-native-linuxapp-icc/build/kernel/linux/kni/kni_net.o: warning: objtool: kni_fifo_trans_pa2va.cold.6()+0x1d: sibling call from callable instruction with modified stack frame
/tmp/FC28_K4.16.3_ICC19.0.0/x86_64-native-linuxapp-icc/b4fb65c55ea3485f8509e6101dc7e6a0/dpdk/x86_64-native-linuxapp-icc/build/kernel/linux/kni/kni_net.o: warning: objtool: kni_net_rx_lo_fifo_skb.cold.7()+0x25: sibling call from callable instruction with modified stack frame
/tmp/FC28_K4.16.3_ICC19.0.0/x86_64-native-linuxapp-icc/b4fb65c55ea3485f8509e6101dc7e6a0/dpdk/x86_64-native-linuxapp-icc/build/kernel/linux/kni/kni_net.o: warning: objtool: kni_net_rx_normal.cold.11()+0x25: sibling call from callable instruction with modified stack frame
  LD [M]  /tmp/FC28_K4.16.3_ICC19.0.0/x86_64-native-linuxapp-icc/b4fb65c55ea3485f8509e6101dc7e6a0/dpdk/x86_64-native-linuxapp-icc/build/kernel/linux/kni/rte_kni.o
  Building modules, stage 2.
  MODPOST 1 modules
  CC      /tmp/FC28_K4.16.3_ICC19.0.0/x86_64-native-linuxapp-icc/b4fb65c55ea3485f8509e6101dc7e6a0/dpdk/x86_64-native-linuxapp-icc/build/kernel/linux/igb_uio/igb_uio.mod.o
== Build drivers/bus/fslmc
--
  CC ifpga_feature_dev.o
  CC ifpga_fme_iperf.o
  CC ifpga_fme_dperf.o
  PMDINFO dpaa2_cmdif.o.pmd.c
  CC dpaa2_cmdif.o.pmd.o
  CC ifpga_fme_error.o
  PMDINFO skeleton_rawdev.o.pmd.c
  CC ifpga_port.o
  CC skeleton_rawdev.o.pmd.o
  CC ifpga_port_error.o
  CC opae_hw_api.o
  CC opae_ifpga_hw_api.o
  LD dpaa2_cmdif.o
  AR librte_pmd_dpaa2_cmdif.a
  INSTALL-LIB librte_pmd_dpaa2_cmdif.a

*Failed Build #20:
OS: SUSE12
Target: x86_64-native-linuxapp-gcc
  CC eal_alarm.o
  CC eal_dev.o
  CC eal_common_lcore.o
In file included from /tmp/SUSE12_K3.7.10_GCC4.7.2/x86_64-native-linuxapp-gcc/b4fb65c55ea3485f8509e6101dc7e6a0/dpdk/lib/librte_eal/linuxapp/eal/eal_dev.c:14:0:
/tmp/SUSE12_K3.7.10_GCC4.7.2/x86_64-native-linuxapp-gcc/b4fb65c55ea3485f8509e6101dc7e6a0/dpdk/lib/librte_eal/linuxapp/eal/eal_dev.c: In function ‘sigbus_handler’:
/tmp/SUSE12_K3.7.10_GCC4.7.2/x86_64-native-linuxapp-gcc/b4fb65c55ea3485f8509e6101dc7e6a0/dpdk/lib/librte_eal/linuxapp/eal/eal_dev.c:76:8: warning: implicit declaration of function ‘gettid’; did you mean ‘getgid’? [-Wimplicit-function-declaration]
   (int)gettid(), info->si_addr);
        ^
/tmp/SUSE12_K3.7.10_GCC4.7.2/x86_64-native-linuxapp-gcc/b4fb65c55ea3485f8509e6101dc7e6a0/dpdk/x86_64-native-linuxapp-gcc/include/rte_log.h:324:32: note: in definition of macro ‘RTE_LOG’
    RTE_LOGTYPE_ ## t, # t ": " __VA_ARGS__)
                                ^~~~~~~~~~~
/tmp/SUSE12_K3.7.10_GCC4.7.2/x86_64-native-linuxapp-gcc/b4fb65c55ea3485f8509e6101dc7e6a0/dpdk/lib/librte_eal/linuxapp/eal/eal_dev.c:76:8: warning: nested extern declaration of ‘gettid’ [-Wnested-externs]
   (int)gettid(), info->si_addr);
        ^
/tmp/SUSE12_K3.7.10_GCC4.7.2/x86_64-native-linuxapp-gcc/b4fb65c55ea3485f8509e6101dc7e6a0/dpdk/x86_64-native-linuxapp-gcc/include/rte_log.h:324:32: note: in definition of macro ‘RTE_LOG’
    RTE_LOGTYPE_ ## t, # t ": " __VA_ARGS__)
                                ^~~~~~~~~~~
--
  CC ifpga_enumerate.o
  CC ifpga_fme.o
  SYMLINK-FILE include/rte_pmd_dpaa2_cmdif.h
  CC ifpga_fme_dperf.o
  CC dpaa2_cmdif.o
  CC ifpga_fme_error.o
  CC ifpga_port_error.o
  CC ifpga_port.o
  CC opae_hw_api.o
  CC opae_ifpga_hw_api.o
  CC opae_debug.o
  PMDINFO dpaa2_cmdif.o.pmd.c
--
  LD dpdk-pdump
  CC test.o
  CC cperf_ops.o
/tmp/SUSE12_K3.7.10_GCC4.7.2/x86_64-native-linuxapp-gcc/b4fb65c55ea3485f8509e6101dc7e6a0/dpdk/x86_64-native-linuxapp-gcc/lib/librte_eal.a(eal_dev.o): In function `sigbus_handler':
eal_dev.c:(.text+0x59): undefined reference to `gettid'
collect2: error: ld returned 1 exit status
/tmp/SUSE12_K3.7.10_GCC4.7.2/x86_64-native-linuxapp-gcc/b4fb65c55ea3485f8509e6101dc7e6a0/dpdk/mk/rte.app.mk:397: recipe for target 'cmdline_test' failed
make[5]: *** [cmdline_test] Error 1
/tmp/SUSE12_K3.7.10_GCC4.7.2/x86_64-native-linuxapp-gcc/b4fb65c55ea3485f8509e6101dc7e6a0/dpdk/mk/rte.subdir.mk:35: recipe for target 'test-cmdline' failed
make[4]: *** [test-cmdline] Error 2
make[4]: *** Waiting for unfinished jobs....
  CC cperf_options_parsing.o
  CC comp_perf_options_parse.o
  CC resource.o
/tmp/SUSE12_K3.7.10_GCC4.7.2/x86_64-native-linuxapp-gcc/b4fb65c55ea3485f8509e6101dc7e6a0/dpdk/x86_64-native-linuxapp-gcc/lib/librte_eal.a(eal_dev.o): In function `sigbus_handler':
eal_dev.c:(.text+0x59): undefined reference to `gettid'
collect2: error: ld returned 1 exit status
/tmp/SUSE12_K3.7.10_GCC4.7.2/x86_64-native-linuxapp-gcc/b4fb65c55ea3485f8509e6101dc7e6a0/dpdk/mk/rte.app.mk:397: recipe for target 'dpdk-procinfo' failed
make[5]: *** [dpdk-procinfo] Error 1
/tmp/SUSE12_K3.7.10_GCC4.7.2/x86_64-native-linuxapp-gcc/b4fb65c55ea3485f8509e6101dc7e6a0/dpdk/mk/rte.subdir.mk:35: recipe for target 'proc-info' failed
make[4]: *** [proc-info] Error 2
  CC test_resource.o
/tmp/SUSE12_K3.7.10_GCC4.7.2/x86_64-native-linuxapp-gcc/b4fb65c55ea3485f8509e6101dc7e6a0/dpdk/x86_64-native-linuxapp-gcc/lib/librte_eal.a(eal_dev.o): In function `sigbus_handler':
eal_dev.c:(.text+0x59): undefined reference to `gettid'
collect2: error: ld returned 1 exit status
/tmp/SUSE12_K3.7.10_GCC4.7.2/x86_64-native-linuxapp-gcc/b4fb65c55ea3485f8509e6101dc7e6a0/dpdk/mk/rte.app.mk:397: recipe for target 'testacl' failed
make[5]: *** [testacl] Error 1
/tmp/SUSE12_K3.7.10_GCC4.7.2/x86_64-native-linuxapp-gcc/b4fb65c55ea3485f8509e6101dc7e6a0/dpdk/mk/rte.subdir.mk:35: recipe for target 'test-acl' failed
make[4]: *** [test-acl] Error 2
  CC init.o
  CC test_prefetch.o
  CC test_byteorder.o
  CC test_per_lcore.o
/tmp/SUSE12_K3.7.10_GCC4.7.2/x86_64-native-linuxapp-gcc/b4fb65c55ea3485f8509e6101dc7e6a0/dpdk/x86_64-native-linuxapp-gcc/lib/librte_eal.a(eal_dev.o): In function `sigbus_handler':
eal_dev.c:(.text+0x59): undefined reference to `gettid'
collect2: error: ld returned 1 exit status
/tmp/SUSE12_K3.7.10_GCC4.7.2/x86_64-native-linuxapp-gcc/b4fb65c55ea3485f8509e6101dc7e6a0/dpdk/mk/rte.app.mk:397: recipe for target 'dpdk-pdump' failed
make[5]: *** [dpdk-pdump] Error 1
/tmp/SUSE12_K3.7.10_GCC4.7.2/x86_64-native-linuxapp-gcc/b4fb65c55ea3485f8509e6101dc7e6a0/dpdk/mk/rte.subdir.mk:35: recipe for target 'pdump' failed
make[4]: *** [pdump] Error 2
  CC test_atomic.o
  CC test_barrier.o
  CC test_malloc.o
  CC test_cycles.o
--
  CC test_table_ports.o
  CC pipeline_lpm.o
  CC test_table_combined.o
/tmp/SUSE12_K3.7.10_GCC4.7.2/x86_64-native-linuxapp-gcc/b4fb65c55ea3485f8509e6101dc7e6a0/dpdk/x86_64-native-linuxapp-gcc/lib/librte_eal.a(eal_dev.o): In function `sigbus_handler':
eal_dev.c:(.text+0x59): undefined reference to `gettid'
collect2: error: ld returned 1 exit status
/tmp/SUSE12_K3.7.10_GCC4.7.2/x86_64-native-linuxapp-gcc/b4fb65c55ea3485f8509e6101dc7e6a0/dpdk/mk/rte.app.mk:397: recipe for target 'dpdk-test-compress-perf' failed
make[5]: *** [dpdk-test-compress-perf] Error 1
/tmp/SUSE12_K3.7.10_GCC4.7.2/x86_64-native-linuxapp-gcc/b4fb65c55ea3485f8509e6101dc7e6a0/dpdk/mk/rte.subdir.mk:35: recipe for target 'test-compress-perf' failed
make[4]: *** [test-compress-perf] Error 2
  CC pipeline_lpm_ipv6.o
  CC pipeline_acl.o
  LD dpdk-test-crypto-perf
  CC test_table_acl.o
  CC test_flow_classify.o
  LD testpipeline
  CC test_rwlock.o
/tmp/SUSE12_K3.7.10_GCC4.7.2/x86_64-native-linuxapp-gcc/b4fb65c55ea3485f8509e6101dc7e6a0/dpdk/x86_64-native-linuxapp-gcc/lib/librte_eal.a(eal_dev.o): In function `sigbus_handler':
eal_dev.c:(.text+0x59): undefined reference to `gettid'
collect2: error: ld returned 1 exit status
/tmp/SUSE12_K3.7.10_GCC4.7.2/x86_64-native-linuxapp-gcc/b4fb65c55ea3485f8509e6101dc7e6a0/dpdk/mk/rte.app.mk:397: recipe for target 'dpdk-test-crypto-perf' failed
make[5]: *** [dpdk-test-crypto-perf] Error 1
/tmp/SUSE12_K3.7.10_GCC4.7.2/x86_64-native-linuxapp-gcc/b4fb65c55ea3485f8509e6101dc7e6a0/dpdk/mk/rte.subdir.mk:35: recipe for target 'test-crypto-perf' failed
make[4]: *** [test-crypto-perf] Error 2
  CC test_timer.o
  CC test_bbdev_vector.o
  CC test_timer_perf.o
  CC test_mempool.o
--
  CC test_mbuf.o
  CC test_logs.o
  CC test_memcpy.o
/tmp/SUSE12_K3.7.10_GCC4.7.2/x86_64-native-linuxapp-gcc/b4fb65c55ea3485f8509e6101dc7e6a0/dpdk/x86_64-native-linuxapp-gcc/lib/librte_eal.a(eal_dev.o): In function `sigbus_handler':
eal_dev.c:(.text+0x59): undefined reference to `gettid'
collect2: error: ld returned 1 exit status
/tmp/SUSE12_K3.7.10_GCC4.7.2/x86_64-native-linuxapp-gcc/b4fb65c55ea3485f8509e6101dc7e6a0/dpdk/mk/rte.app.mk:397: recipe for target 'testpipeline' failed
make[5]: *** [testpipeline] Error 1
/tmp/SUSE12_K3.7.10_GCC4.7.2/x86_64-native-linuxapp-gcc/b4fb65c55ea3485f8509e6101dc7e6a0/dpdk/mk/rte.subdir.mk:35: recipe for target 'test-pipeline' failed
make[4]: *** [test-pipeline] Error 2
  CC test_memcpy_perf.o
  CC test_member.o
  CC test_member_perf.o
  CC test_efd.o
--
  CC test_hash_perf.o
  CC test_hash_functions.o
  CC test_hash_multiwriter.o
/tmp/SUSE12_K3.7.10_GCC4.7.2/x86_64-native-linuxapp-gcc/b4fb65c55ea3485f8509e6101dc7e6a0/dpdk/x86_64-native-linuxapp-gcc/lib/librte_eal.a(eal_dev.o): In function `sigbus_handler':
eal_dev.c:(.text+0x59): undefined reference to `gettid'
collect2: error: ld returned 1 exit status
/tmp/SUSE12_K3.7.10_GCC4.7.2/x86_64-native-linuxapp-gcc/b4fb65c55ea3485f8509e6101dc7e6a0/dpdk/mk/rte.app.mk:397: recipe for target 'testbbdev' failed
make[5]: *** [testbbdev] Error 1
/tmp/SUSE12_K3.7.10_GCC4.7.2/x86_64-native-linuxapp-gcc/b4fb65c55ea3485f8509e6101dc7e6a0/dpdk/mk/rte.subdir.mk:35: recipe for target 'test-bbdev' failed
make[4]: *** [test-bbdev] Error 2
  CC test_hash_readwrite.o
  CC test_hash_readwrite_lf.o
  CC test_lpm.o
  CC test_lpm_perf.o
--
  CC softnicfwd.o
  LD testpmd
  LD test
/tmp/SUSE12_K3.7.10_GCC4.7.2/x86_64-native-linuxapp-gcc/b4fb65c55ea3485f8509e6101dc7e6a0/dpdk/x86_64-native-linuxapp-gcc/lib/librte_eal.a(eal_dev.o): In function `sigbus_handler':
eal_dev.c:(.text+0x59): undefined reference to `gettid'
collect2: error: ld returned 1 exit status
/tmp/SUSE12_K3.7.10_GCC4.7.2/x86_64-native-linuxapp-gcc/b4fb65c55ea3485f8509e6101dc7e6a0/dpdk/mk/rte.app.mk:397: recipe for target 'testpmd' failed
make[5]: *** [testpmd] Error 1
/tmp/SUSE12_K3.7.10_GCC4.7.2/x86_64-native-linuxapp-gcc/b4fb65c55ea3485f8509e6101dc7e6a0/dpdk/mk/rte.subdir.mk:35: recipe for target 'test-pmd' failed
make[4]: *** [test-pmd] Error 2
/tmp/SUSE12_K3.7.10_GCC4.7.2/x86_64-native-linuxapp-gcc/b4fb65c55ea3485f8509e6101dc7e6a0/dpdk/x86_64-native-linuxapp-gcc/lib/librte_eal.a(eal_dev.o): In function `sigbus_handler':
eal_dev.c:(.text+0x59): undefined reference to `gettid'
collect2: error: ld returned 1 exit status
/tmp/SUSE12_K3.7.10_GCC4.7.2/x86_64-native-linuxapp-gcc/b4fb65c55ea3485f8509e6101dc7e6a0/dpdk/mk/rte.app.mk:397: recipe for target 'test' failed
make[5]: *** [test] Error 1
/tmp/SUSE12_K3.7.10_GCC4.7.2/x86_64-native-linuxapp-gcc/b4fb65c55ea3485f8509e6101dc7e6a0/dpdk/mk/rte.subdir.mk:35: recipe for target 'test' failed
make[4]: *** [test] Error 2
/tmp/SUSE12_K3.7.10_GCC4.7.2/x86_64-native-linuxapp-gcc/b4fb65c55ea3485f8509e6101dc7e6a0/dpdk/mk/rte.sdkbuild.mk:46: recipe for target 'app' failed
make[3]: *** [app] Error 2
/tmp/SUSE12_K3.7.10_GCC4.7.2/x86_64-native-linuxapp-gcc/b4fb65c55ea3485f8509e6101dc7e6a0/dpdk/mk/rte.sdkroot.mk:98: recipe for target 'all' failed
make[2]: *** [all] Error 2
/tmp/SUSE12_K3.7.10_GCC4.7.2/x86_64-native-linuxapp-gcc/b4fb65c55ea3485f8509e6101dc7e6a0/dpdk/mk/rte.sdkinstall.mk:57: recipe for target 'pre_install' failed
make[1]: *** [pre_install] Error 2
/tmp/SUSE12_K3.7.10_GCC4.7.2/x86_64-native-linuxapp-gcc/b4fb65c55ea3485f8509e6101dc7e6a0/dpdk/mk/rte.sdkroot.mk:77: recipe for target 'install' failed
make: *** [install] Error 2

*Failed Build #21:
OS: CENTOS76
Target: x86_64-native-linuxapp-gcc
  CC eal_alarm.o
  CC eal_dev.o
  CC eal_common_lcore.o
  CC eal_common_timer.o
/tmp/CENTOS76_K3.10.0_GCC4.8.5/x86_64-native-linuxapp-gcc/b4fb65c55ea3485f8509e6101dc7e6a0/dpdk/lib/librte_eal/linuxapp/eal/eal_dev.c: In function ‘sigbus_handler’:
/tmp/CENTOS76_K3.10.0_GCC4.8.5/x86_64-native-linuxapp-gcc/b4fb65c55ea3485f8509e6101dc7e6a0/dpdk/lib/librte_eal/linuxapp/eal/eal_dev.c:75:2: warning: implicit declaration of function ‘gettid’ [-Wimplicit-function-declaration]
  RTE_LOG(DEBUG, EAL, "Thread[%d] catch SIGBUS, fault address:%p\n",
  ^
/tmp/CENTOS76_K3.10.0_GCC4.8.5/x86_64-native-linuxapp-gcc/b4fb65c55ea3485f8509e6101dc7e6a0/dpdk/lib/librte_eal/linuxapp/eal/eal_dev.c:75:2: warning: nested extern declaration of ‘gettid’ [-Wnested-externs]
  CC eal_common_memzone.o
  CC eal_common_log.o
  CC eal_common_launch.o
  CC eal_common_memalloc.o
  CC eal_common_memory.o
--
  PMDINFO skeleton_rawdev.o.pmd.c
  CC skeleton_rawdev.o.pmd.o
  CC ifpga_fme_iperf.o
  LD skeleton_rawdev.o
  CC ifpga_fme_dperf.o
  CC ifpga_fme_error.o
  CC ifpga_port.o
  AR librte_pmd_skeleton_rawdev.a
  PMDINFO dpaa2_qdma.o.pmd.c
  CC ifpga_port_error.o
  CC dpaa2_qdma.o.pmd.o
  INSTALL-LIB librte_pmd_skeleton_rawdev.a
  CC opae_hw_api.o
  LD dpaa2_qdma.o
  CC opae_ifpga_hw_api.o
--
  CC cperf_ops.o
  LD testacl
  CC test_bbdev.o
/tmp/CENTOS76_K3.10.0_GCC4.8.5/x86_64-native-linuxapp-gcc/b4fb65c55ea3485f8509e6101dc7e6a0/dpdk/x86_64-native-linuxapp-gcc/lib/librte_eal.a(eal_dev.o): In function `sigbus_handler':
eal_dev.c:(.text+0x59): undefined reference to `gettid'
collect2: error: ld returned 1 exit status
make[5]: *** [cmdline_test] Error 1
make[4]: *** [test-cmdline] Error 2
make[4]: *** Waiting for unfinished jobs....
  CC test.o
  CC runtime.o
  CC test_bbdev_perf.o
/tmp/CENTOS76_K3.10.0_GCC4.8.5/x86_64-native-linuxapp-gcc/b4fb65c55ea3485f8509e6101dc7e6a0/dpdk/x86_64-native-linuxapp-gcc/lib/librte_eal.a(eal_dev.o): In function `sigbus_handler':
eal_dev.c:(.text+0x59): undefined reference to `gettid'
collect2: error: ld returned 1 exit status
make[5]: *** [dpdk-procinfo] Error 1
make[4]: *** [proc-info] Error 2
  CC cperf_options_parsing.o
/tmp/CENTOS76_K3.10.0_GCC4.8.5/x86_64-native-linuxapp-gcc/b4fb65c55ea3485f8509e6101dc7e6a0/dpdk/x86_64-native-linuxapp-gcc/lib/librte_eal.a(eal_dev.o): In function `sigbus_handler':
eal_dev.c:(.text+0x59): undefined reference to `gettid'
collect2: error: ld returned 1 exit status
make[5]: *** [dpdk-pdump] Error 1
make[4]: *** [pdump] Error 2
  CC test_bbdev_vector.o
/tmp/CENTOS76_K3.10.0_GCC4.8.5/x86_64-native-linuxapp-gcc/b4fb65c55ea3485f8509e6101dc7e6a0/dpdk/x86_64-native-linuxapp-gcc/lib/librte_eal.a(eal_dev.o): In function `sigbus_handler':
eal_dev.c:(.text+0x59): undefined reference to `gettid'
collect2: error: ld returned 1 exit status
make[5]: *** [testacl] Error 1
make[4]: *** [test-acl] Error 2
  CC pipeline_stub.o
  CC resource.o
  CC comp_perf_options_parse.o
--
  LD dpdk-test-compress-perf
  CC test_cycles.o
  CC cperf_test_vector_parsing.o
/tmp/CENTOS76_K3.10.0_GCC4.8.5/x86_64-native-linuxapp-gcc/b4fb65c55ea3485f8509e6101dc7e6a0/dpdk/x86_64-native-linuxapp-gcc/lib/librte_eal.a(eal_dev.o): In function `sigbus_handler':
eal_dev.c:(.text+0x59): undefined reference to `gettid'
collect2: error: ld returned 1 exit status
make[5]: *** [testpipeline] Error 1
  CC test_spinlock.o
  CC cperf_test_common.o
make[4]: *** [test-pipeline] Error 2
  CC cmdline.o
--
  LD dpdk-test-crypto-perf
  CC cmdline_mtr.o
  CC test_fbarray.o
/tmp/CENTOS76_K3.10.0_GCC4.8.5/x86_64-native-linuxapp-gcc/b4fb65c55ea3485f8509e6101dc7e6a0/dpdk/x86_64-native-linuxapp-gcc/lib/librte_eal.a(eal_dev.o): In function `sigbus_handler':
eal_dev.c:(.text+0x59): undefined reference to `gettid'
collect2: error: ld returned 1 exit status
make[5]: *** [dpdk-test-compress-perf] Error 1
make[4]: *** [test-compress-perf] Error 2
  CC test_external_mem.o
  CC cmdline_tm.o
  LD testbbdev
  CC test_ring.o
  CC test_ring_perf.o
/tmp/CENTOS76_K3.10.0_GCC4.8.5/x86_64-native-linuxapp-gcc/b4fb65c55ea3485f8509e6101dc7e6a0/dpdk/x86_64-native-linuxapp-gcc/lib/librte_eal.a(eal_dev.o): In function `sigbus_handler':
eal_dev.c:(.text+0x59): undefined reference to `gettid'
collect2: error: ld returned 1 exit status
make[5]: *** [dpdk-test-crypto-perf] Error 1
make[4]: *** [test-crypto-perf] Error 2
  CC test_pmd_perf.o
  CC config.o
  CC test_table.o
  CC iofwd.o
/tmp/CENTOS76_K3.10.0_GCC4.8.5/x86_64-native-linuxapp-gcc/b4fb65c55ea3485f8509e6101dc7e6a0/dpdk/x86_64-native-linuxapp-gcc/lib/librte_eal.a(eal_dev.o): In function `sigbus_handler':
eal_dev.c:(.text+0x59): undefined reference to `gettid'
collect2: error: ld returned 1 exit status
make[5]: *** [testbbdev] Error 1
make[4]: *** [test-bbdev] Error 2
  CC macfwd.o
  CC macswap.o
  CC test_table_pipeline.o
--
  CC test_debug.o
  CC test_errno.o
  CC test_tailq.o
/tmp/CENTOS76_K3.10.0_GCC4.8.5/x86_64-native-linuxapp-gcc/b4fb65c55ea3485f8509e6101dc7e6a0/dpdk/x86_64-native-linuxapp-gcc/lib/librte_eal.a(eal_dev.o): In function `sigbus_handler':
eal_dev.c:(.text+0x59): undefined reference to `gettid'
collect2: error: ld returned 1 exit status
make[5]: *** [testpmd] Error 1
make[4]: *** [test-pmd] Error 2
  CC test_string_fns.o
  CC test_cpuflags.o
  CC test_mp_secondary.o
--
  CC test_ipsec.o
  MKRES test_resource_c.res.o
  LD test
/tmp/CENTOS76_K3.10.0_GCC4.8.5/x86_64-native-linuxapp-gcc/b4fb65c55ea3485f8509e6101dc7e6a0/dpdk/x86_64-native-linuxapp-gcc/lib/librte_eal.a(eal_dev.o): In function `sigbus_handler':
eal_dev.c:(.text+0x59): undefined reference to `gettid'
collect2: error: ld returned 1 exit status
make[5]: *** [test] Error 1
make[4]: *** [test] Error 2
make[3]: *** [app] Error 2
make[2]: *** [all] Error 2
make[1]: *** [pre_install] Error 2

DPDK STV team


More information about the test-report mailing list