[dpdk-test-report] |FAILURE| pw51085-51099 [PATCH] [01/15] app/testpmd: replace uint with unsigned int

dpdklab at iol.unh.edu dpdklab at iol.unh.edu
Tue Mar 12 14:55:18 CET 2019


Test-Label: Performance-Testing
Test-Status: FAILURE
http://dpdk.org/patch/51085

_build patch failure_

Submitter: Natanael Copa <ncopa at alpinelinux.org>
Date: Monday, March 11 2019 17:36:48 
Applied on: CommitID:610e235a11e49a1e5d55c2804a5bc628e87417f1
Apply patch set 51085-51099 failed:

Configuration done using x86_64-native-linuxapp-gcc
== Build lib
== Build lib/librte_kvargs
== Build lib/librte_eal
== Build lib/librte_eal/common
== Build lib/librte_eal/linuxapp
== Build lib/librte_eal/linuxapp/eal
  CC eal_dev.o
/var/lib/jenkins/workspace/Apply-Custom-Patch-Set/dpdk/lib/librte_eal/linuxapp/eal/eal_dev.c: In function ‘sigbus_handler’:
/var/lib/jenkins/workspace/Apply-Custom-Patch-Set/dpdk/lib/librte_eal/linuxapp/eal/eal_dev.c:75:2: error: implicit declaration of function ‘gettid’ [-Werror=implicit-function-declaration]
  RTE_LOG(DEBUG, EAL, "Thread[%d] catch SIGBUS, fault address:%p\n",
  ^
/var/lib/jenkins/workspace/Apply-Custom-Patch-Set/dpdk/lib/librte_eal/linuxapp/eal/eal_dev.c:75:2: error: nested extern declaration of ‘gettid’ [-Werror=nested-externs]
cc1: all warnings being treated as errors
make[7]: *** [eal_dev.o] Error 1
make[6]: *** [eal] Error 2
make[5]: *** [linuxapp] Error 2
make[4]: *** [librte_eal] Error 2
make[3]: *** [lib] Error 2
make[2]: *** [all] Error 2
make[1]: *** [pre_install] Error 2
make: *** [install] Error 2

https://lab.dpdk.org/results/dashboard/patchsets/4836/

UNH-IOL DPDK Performance Test Lab


More information about the test-report mailing list