[dpdk-test-report] |FAILURE| pw51134[1/1] net/qede: fix receive packet drop

sys_stv at intel.com sys_stv at intel.com
Thu Mar 14 08:34:24 CET 2019


Test-Label: Intel-compilation
Test-Status: FAILURE
http://dpdk.org/patch/51134

_Compilation issues_

Submitter: Shahed Shaikh <shshaikh at marvell.com>
Date: 2019-03-12 16:51:14
Reply_mail: 20190312165114.23740-1-shshaikh at marvell.com
DPDK git baseline: Repo:dpdk-master, CommitID: 239912fa798e6e671072ca7ff987afd74c1e506c

Build Summary: 25 Builds Done, 23 Successful, 2 Failures

Test environment and configuration as below:

OS: SUSE15
	Kernel Version: 4.12.14-lp150.12.22-default
	CPU info: Intel(R) Xeon(R) CPU E5-2699 v3 @ 2.30GHz
	GCC Version: gcc (SUSE Linux) 7.3.1 20180323 [gcc-7-branch revision 258812]
	Clang Version: 5.0.1 (tags/RELEASE_501/final 312548)
	x86_64-native-linuxapp-gcc

OS: CENTOS76
	Kernel Version: 3.10.0-957.5.1.el7.x86_64
	CPU info: Intel(R) Xeon(R) CPU E5-2699 v4 @ 2.20GHz
	GCC Version: gcc (GCC) 4.8.5 20150623 (Red Hat 4.8.5-36)
	Clang Version: 3.4.2 (tags/RELEASE_34/dot2-final)
	x86_64-native-linuxapp-gcc

OS: UBT144-32
	Kernel Version: 3.13.0-161-generic
	CPU info: Intel(R) Xeon(R) CPU E5-2699 v3 @ 2.30GHz
	GCC Version: gcc (Ubuntu 4.8.4-2ubuntu1~14.04.4) 4.8.4
	Clang Version: NA
	i686-native-linuxapp-gcc

OS: SUSE12
	Kernel Version: 4.4.73-5-default
	CPU info: Intel(R) Xeon(R) CPU E5-2699 v4 @ 2.20GHz
	GCC Version: gcc (SUSE Linux) 7.1.1 20170607 [gcc-7-branch revision 248970]
	Clang Version: NA
	x86_64-native-linuxapp-gcc

OS: FreeBSD12.0
	Kernel Version: 12.0-RC3
	CPU info: Intel(R) Xeon(R) CPU E5-2699 v3 @ 2.30GHz (2294.74-MHz K8-class CPU)
	GCC Version: gcc (FreeBSD Ports Collection) 7.3.0
	Clang Version: 6.0.1 (tags/RELEASE_601/final 335540) (based on LLVM 6.0.1)
	x86_64-native-bsdapp-clang
	x86_64-native-bsdapp-gcc

OS: UBT144-64
	Kernel Version: 4.2.0-27-generic
	CPU info: Intel(R) Xeon(R) CPU E5-2699 v3 @ 2.30GHz
	GCC Version: gcc (Ubuntu 4.8.4-2ubuntu1~14.04.4) 4.8.4
	Clang Version: NA
	x86_64-native-linuxapp-gcc

OS: CENTOS75
	Kernel Version: 3.10.0-957.5.1.el7.x86_64
	CPU info: Intel(R) Xeon(R) CPU E5-2699 v4 @ 2.20GHz
	GCC Version: gcc (GCC) 4.8.5 20150623 (Red Hat 4.8.5-36)
	Clang Version: 3.4.2 (tags/RELEASE_34/dot2-final)
	x86_64-native-linuxapp-gcc

OS: UBT1804
	Kernel Version: 4.15.0-20-generic
	CPU info: Intel(R) Xeon(R) CPU E5-2699 v3 @ 2.30GHz
	GCC Version: gcc (Ubuntu 7.3.0-16ubuntu3) 7.3.0
	Clang Version: NA
	x86_64-native-linuxapp-clang
	x86_64-native-linuxapp-icc
	x86_64-native-linuxapp-gcc

OS: UBT1810
	Kernel Version: 4.18.0-10-generic
	CPU info: Intel(R) Xeon(R) CPU E5-2699 v3 @ 2.30GHz
	GCC Version: gcc (Ubuntu 8.2.0-7ubuntu1) 8.2.0
	Clang Version: NA
	x86_64-native-linuxapp-gcc

OS: RHEL74
	Kernel Version: 3.10.0-693.el7.x86_64
	CPU info: Intel(R) Xeon(R) CPU E5-2699 v4 @ 2.20GHz
	GCC Version: gcc (GCC) 4.8.5 20150623 (Red Hat 4.8.5-16)
	Clang Version: NA
	x86_64-native-linuxapp-gcc

OS: CENTOS74
	Kernel Version: 3.10.0-862.14.4.el7.x86_64
	CPU info: Intel(R) Xeon(R) CPU E5-2699 v4 @ 2.20GHz
	GCC Version: gcc (GCC) 4.8.5 20150623 (Red Hat 4.8.5-28)
	Clang Version: 3.4.2 (tags/RELEASE_34/dot2-final)
	x86_64-native-linuxapp-gcc

OS: FreeBSD11.2
	Kernel Version: 11.2-RELEASE
	CPU info: Intel(R) Xeon(R) CPU E5-2699 v3 @ 2.30GHz (2294.74-MHz K8-class CPU)
	GCC Version: gcc (FreeBSD Ports Collection) 6.4.0
	Clang Version: 6.0.0 (tags/RELEASE_600/final 326565) (based on LLVM 6.0.0)
	x86_64-native-bsdapp-clang
	x86_64-native-bsdapp-gcc

OS: UBT164-64
	Kernel Version: 4.4.0-47-generic
	CPU info: Intel(R) Xeon(R) CPU E5-2699 v3 @ 2.30GHz
	GCC Version: gcc (Ubuntu 5.4.0-6ubuntu1~16.04.10) 5.4.0 20160609
	Clang Version: 3.8.0-2ubuntu4 (tags/RELEASE_380/final)
	x86_64-native-linuxapp-gcc

OS: RHEL75
	Kernel Version: 3.10.0-862.el7.x86_64
	CPU info: Intel(R) Xeon(R) CPU E5-2699 v4 @ 2.20GHz
	GCC Version: gcc (GCC) 4.8.5 20150623 (Red Hat 4.8.5-28)
	Clang Version: NA
	x86_64-native-linuxapp-gcc

OS: RHEL76
	Kernel Version: 3.10.0-957.el7.x86_64
	CPU info: Intel(R) Xeon(R) CPU E5-2699 v4 @ 2.20GHz
	GCC Version: gcc (GCC) 4.8.5 20150623 (Red Hat 4.8.5-36)
	Clang Version: NA
	x86_64-native-linuxapp-gcc

OS: FC29
	Kernel Version: 4.18.16-300.fc29.x86_64
	CPU info: Intel(R) Xeon(R) CPU E5-2699 v4 @ 2.20GHz
	GCC Version: gcc (GCC) 8.2.1 20181215 (Red Hat 8.2.1-6)
	Clang Version: NA
	x86_64-native-linuxapp-gcc
	x86_64-native-linuxapp-clang
	x86_64-native-linuxapp-icc

OS: FC28
	Kernel Version: 4.16.3-301.fc28.x86_64
	CPU info: Intel(R) Xeon(R) CPU E5-2699 v4 @ 2.20GHz
	GCC Version: gcc (GCC) 8.1.1 20180712 (Red Hat 8.1.1-5)
	Clang Version: NA
	x86_64-native-linuxapp-gcc
	x86_64-native-linuxapp-clang
	x86_64-native-linuxapp-icc

*Failed Build #1:
OS: FC28
Target: x86_64-native-linuxapp-clang
  INSTALL-LIB librte_pmd_dpaa2_event.a
  CC timvf_probe.o
  LD ssovf_evdev.o
  PMDINFO ssovf_probe.o.pmd.c
  CC ssovf_probe.o.pmd.o
fatal error: error in backend: IO failure on output stream: No space left on device
make[6]: *** [/tmp/FC28_K4.16.3_Clang6.0.1/x86_64-native-linuxapp-clang/86c67f1e1d6c4093ae5f3bb1ddd4a75d/dpdk/mk/internal/rte.compile-pre.mk:114: timvf_evdev.o] Error 1
make[6]: *** Waiting for unfinished jobs....
fatal error: error in backend: IO failure on output stream: No space left on device
make[6]: *** [/tmp/FC28_K4.16.3_Clang6.0.1/x86_64-native-linuxapp-clang/86c67f1e1d6c4093ae5f3bb1ddd4a75d/dpdk/mk/internal/rte.compile-pre.mk:114: ssovf_evdev_selftest.o] Error 1
fatal error: error in backend: IO failure on output stream: No space left on device
make[6]: *** [/tmp/FC28_K4.16.3_Clang6.0.1/x86_64-native-linuxapp-clang/86c67f1e1d6c4093ae5f3bb1ddd4a75d/dpdk/mk/internal/rte.compile-pre.mk:114: ssovf_probe.o] Error 1
fatal error: error in backend: IO failure on output stream: No space left on device
make[6]: *** [/tmp/FC28_K4.16.3_Clang6.0.1/x86_64-native-linuxapp-clang/86c67f1e1d6c4093ae5f3bb1ddd4a75d/dpdk/mk/internal/rte.compile-pre.mk:114: opdl_test.o] Error 1
make[6]: *** Waiting for unfinished jobs....
fatal error: error in backend: IO failure on output stream: No space left on device
make[6]: *** [/tmp/FC28_K4.16.3_Clang6.0.1/x86_64-native-linuxapp-clang/86c67f1e1d6c4093ae5f3bb1ddd4a75d/dpdk/mk/internal/rte.compile-pre.mk:114: dsw_event.o] Error 1
make[5]: *** [/tmp/FC28_K4.16.3_Clang6.0.1/x86_64-native-linuxapp-clang/86c67f1e1d6c4093ae5f3bb1ddd4a75d/dpdk/mk/rte.subdir.mk:35: dsw] Error 2
make[5]: *** Waiting for unfinished jobs....
fatal error: error in backend: IO failure on output stream: No space left on device
make[6]: *** [/tmp/FC28_K4.16.3_Clang6.0.1/x86_64-native-linuxapp-clang/86c67f1e1d6c4093ae5f3bb1ddd4a75d/dpdk/mk/internal/rte.compile-pre.mk:114: timvf_worker.o] Error 1
fatal error: error in backend: IO failure on output stream: No space left on device
make[6]: *** [/tmp/FC28_K4.16.3_Clang6.0.1/x86_64-native-linuxapp-clang/86c67f1e1d6c4093ae5f3bb1ddd4a75d/dpdk/mk/internal/rte.compile-pre.mk:114: timvf_probe.o] Error 1
make[5]: *** [/tmp/FC28_K4.16.3_Clang6.0.1/x86_64-native-linuxapp-clang/86c67f1e1d6c4093ae5f3bb1ddd4a75d/dpdk/mk/rte.subdir.mk:35: octeontx] Error 2
fatal error: error in backend: IO failure on output stream: No space left on device
make[6]: *** [/tmp/FC28_K4.16.3_Clang6.0.1/x86_64-native-linuxapp-clang/86c67f1e1d6c4093ae5f3bb1ddd4a75d/dpdk/mk/internal/rte.compile-pre.mk:114: opdl_ring.o] Error 1
make[5]: *** [/tmp/FC28_K4.16.3_Clang6.0.1/x86_64-native-linuxapp-clang/86c67f1e1d6c4093ae5f3bb1ddd4a75d/dpdk/mk/rte.subdir.mk:35: opdl] Error 2
fatal error: error in backend: IO failure on output stream: No space left on device
make[6]: *** [/tmp/FC28_K4.16.3_Clang6.0.1/x86_64-native-linuxapp-clang/86c67f1e1d6c4093ae5f3bb1ddd4a75d/dpdk/mk/internal/rte.compile-pre.mk:114: sw_evdev_selftest.o] Error 1
make[5]: *** [/tmp/FC28_K4.16.3_Clang6.0.1/x86_64-native-linuxapp-clang/86c67f1e1d6c4093ae5f3bb1ddd4a75d/dpdk/mk/rte.subdir.mk:35: sw] Error 2
make[4]: *** [/tmp/FC28_K4.16.3_Clang6.0.1/x86_64-native-linuxapp-clang/86c67f1e1d6c4093ae5f3bb1ddd4a75d/dpdk/mk/rte.subdir.mk:37: event] Error 2
make[3]: *** [/tmp/FC28_K4.16.3_Clang6.0.1/x86_64-native-linuxapp-clang/86c67f1e1d6c4093ae5f3bb1ddd4a75d/dpdk/mk/rte.sdkbuild.mk:46: drivers] Error 2
make[2]: *** [/tmp/FC28_K4.16.3_Clang6.0.1/x86_64-native-linuxapp-clang/86c67f1e1d6c4093ae5f3bb1ddd4a75d/dpdk/mk/rte.sdkroot.mk:99: all] Error 2

*Failed Build #2:
OS: FC29
Target: x86_64-native-linuxapp-clang
  CC ifpga_fme.o
  CC skeleton_rawdev_test.o
  CC ifpga_fme_iperf.o
  CC dpaa2_cmdif.o
  CC ifpga_fme_dperf.o
  CC ifpga_fme_error.o
  CC ifpga_port.o
  PMDINFO dpaa2_cmdif.o.pmd.c
  CC ifpga_port_error.o
  CC dpaa2_cmdif.o.pmd.o
  CC opae_hw_api.o
  CC opae_ifpga_hw_api.o
  CC opae_debug.o
  LD dpaa2_cmdif.o
--
  LD testacl
  LD dpdk-procinfo
  INSTALL-APP cmdline_test
  LD dpdk-pdump
  INSTALL-MAP cmdline_test.map
cp: error writing '/tmp/FC29_K4.20_Clang6.0.1/x86_64-native-linuxapp-clang/86c67f1e1d6c4093ae5f3bb1ddd4a75d/dpdk/x86_64-native-linuxapp-clang/app/cmdline_test.map': No space left on device
make[5]: *** [/tmp/FC29_K4.20_Clang6.0.1/x86_64-native-linuxapp-clang/86c67f1e1d6c4093ae5f3bb1ddd4a75d/dpdk/mk/rte.app.mk:425: /tmp/FC29_K4.20_Clang6.0.1/x86_64-native-linuxapp-clang/86c67f1e1d6c4093ae5f3bb1ddd4a75d/dpdk/x86_64-native-linuxapp-clang/app/cmdline_test.map] Error 1
make[4]: *** [/tmp/FC29_K4.20_Clang6.0.1/x86_64-native-linuxapp-clang/86c67f1e1d6c4093ae5f3bb1ddd4a75d/dpdk/mk/rte.subdir.mk:37: test-cmdline] Error 2
make[4]: *** Waiting for unfinished jobs....
  CC parameters.o
/usr/bin/ld: final link failed: No space left on device
fatal errorclang-7: error: linker command failed with exit code 1 (use -v to see invocation)
: error in backend: IO failure on output stream: No space left on device
make[5]: *** [/tmp/FC29_K4.20_Clang6.0.1/x86_64-native-linuxapp-clang/86c67f1e1d6c4093ae5f3bb1ddd4a75d/dpdk/mk/rte.app.mk:399: testacl] Error 1
make[4]: *** [/tmp/FC29_K4.20_Clang6.0.1/x86_64-native-linuxapp-clang/86c67f1e1d6c4093ae5f3bb1ddd4a75d/dpdk/mk/rte.subdir.mk:37: test-acl] Error 2
  CC cmdline.o
make[5]: *** [/tmp/FC29_K4.20_Clang6.0.1/x86_64-native-linuxapp-clang/86c67f1e1d6c4093ae5f3bb1ddd4a75d/dpdk/mk/internal/rte.compile-pre.mk:114: test.o] Error 1
make[4]: *** [/tmp/FC29_K4.20_Clang6.0.1/x86_64-native-linuxapp-clang/86c67f1e1d6c4093ae5f3bb1ddd4a75d/dpdk/mk/rte.subdir.mk:37: test] Error 2
  CC cmdline_flow.o
fatal error: error in backend: IO failure on output stream: No space left on device
make[5]: *** [/tmp/FC29_K4.20_Clang6.0.1/x86_64-native-linuxapp-clang/86c67f1e1d6c4093ae5f3bb1ddd4a75d/dpdk/mk/internal/rte.compile-pre.mk:114: main.o] Error 1
make[4]: *** [/tmp/FC29_K4.20_Clang6.0.1/x86_64-native-linuxapp-clang/86c67f1e1d6c4093ae5f3bb1ddd4a75d/dpdk/mk/rte.subdir.mk:37: test-crypto-perf] Error 2
  CC cmdline_mtr.o
/usr/bin/ld: final link failed: No space left on device
clang-7: error: linker command failed with exit code 1 (use -v to see invocation)
make[5]: *** [/tmp/FC29_K4.20_Clang6.0.1/x86_64-native-linuxapp-clang/86c67f1e1d6c4093ae5f3bb1ddd4a75d/dpdk/mk/rte.app.mk:399: dpdk-procinfo] Error 1
make[4]: *** [/tmp/FC29_K4.20_Clang6.0.1/x86_64-native-linuxapp-clang/86c67f1e1d6c4093ae5f3bb1ddd4a75d/dpdk/mk/rte.subdir.mk:37: proc-info] Error 2
  CC cmdline_tm.o
fatal error: error in backend: IO failure on output stream: No space left on device
make[5]: *** [/tmp/FC29_K4.20_Clang6.0.1/x86_64-native-linuxapp-clang/86c67f1e1d6c4093ae5f3bb1ddd4a75d/dpdk/mk/internal/rte.compile-pre.mk:116: main.o] Error 1
make[4]: *** [/tmp/FC29_K4.20_Clang6.0.1/x86_64-native-linuxapp-clang/86c67f1e1d6c4093ae5f3bb1ddd4a75d/dpdk/mk/rte.subdir.mk:37: test-compress-perf] Error 2
  CC config.o
/usr/bin/ld: final link failed: No space left on device
clang-7: error: linker command failed with exit code 1 (use -v to see invocation)
make[5]: *** [/tmp/FC29_K4.20_Clang6.0.1/x86_64-native-linuxapp-clang/86c67f1e1d6c4093ae5f3bb1ddd4a75d/dpdk/mk/rte.app.mk:399: dpdk-pdump] Error 1
make[4]: *** [/tmp/FC29_K4.20_Clang6.0.1/x86_64-native-linuxapp-clang/86c67f1e1d6c4093ae5f3bb1ddd4a75d/dpdk/mk/rte.subdir.mk:37: pdump] Error 2
  CC iofwd.o
fatal error: error in backend: IO failure on output stream: No space left on device
make[5]: *** [/tmp/FC29_K4.20_Clang6.0.1/x86_64-native-linuxapp-clang/86c67f1e1d6c4093ae5f3bb1ddd4a75d/dpdk/mk/internal/rte.compile-pre.mk:114: config.o] Error 1
make[4]: *** [/tmp/FC29_K4.20_Clang6.0.1/x86_64-native-linuxapp-clang/86c67f1e1d6c4093ae5f3bb1ddd4a75d/dpdk/mk/rte.subdir.mk:37: test-pipeline] Error 2
  CC macfwd.o
fatal error: error in backend: IO failure on output stream: No space left on device
make[5]: *** [/tmp/FC29_K4.20_Clang6.0.1/x86_64-native-linuxapp-clang/86c67f1e1d6c4093ae5f3bb1ddd4a75d/dpdk/mk/internal/rte.compile-pre.mk:114: test_bbdev.o] Error 1
make[4]: *** [/tmp/FC29_K4.20_Clang6.0.1/x86_64-native-linuxapp-clang/86c67f1e1d6c4093ae5f3bb1ddd4a75d/dpdk/mk/rte.subdir.mk:37: test-bbdev] Error 2
  CC macswap.o
fatal error: error in backend: IO failure on output stream: No space left on device
make[5]: *** [/tmp/FC29_K4.20_Clang6.0.1/x86_64-native-linuxapp-clang/86c67f1e1d6c4093ae5f3bb1ddd4a75d/dpdk/mk/internal/rte.compile-pre.mk:114: testpmd.o] Error 1
make[5]: *** Waiting for unfinished jobs....
fatal error: error in backend: IO failure on output stream: No space left on device
make[5]: *** [/tmp/FC29_K4.20_Clang6.0.1/x86_64-native-linuxapp-clang/86c67f1e1d6c4093ae5f3bb1ddd4a75d/dpdk/mk/internal/rte.compile-pre.mk:114: cmdline_mtr.o] Error 1
fatal error: error in backend: IO failure on output stream: No space left on device
make[5]: *** [/tmp/FC29_K4.20_Clang6.0.1/x86_64-native-linuxapp-clang/86c67f1e1d6c4093ae5f3bb1ddd4a75d/dpdk/mk/internal/rte.compile-pre.mk:114: iofwd.o] Error 1
fatal error: error in backend: IO failure on output stream: No space left on device
make[5]: *** [/tmp/FC29_K4.20_Clang6.0.1/x86_64-native-linuxapp-clang/86c67f1e1d6c4093ae5f3bb1ddd4a75d/dpdk/mk/internal/rte.compile-pre.mk:114: parameters.o] Error 1
fatal error: error in backend: IO failure on output stream: No space left on device
make[5]: *** [/tmp/FC29_K4.20_Clang6.0.1/x86_64-native-linuxapp-clang/86c67f1e1d6c4093ae5f3bb1ddd4a75d/dpdk/mk/internal/rte.compile-pre.mk:114: cmdline_tm.o] Error 1
fatal error: error in backend: IO failure on output stream: No space left on device
make[5]: *** [/tmp/FC29_K4.20_Clang6.0.1/x86_64-native-linuxapp-clang/86c67f1e1d6c4093ae5f3bb1ddd4a75d/dpdk/mk/internal/rte.compile-pre.mk:114: macfwd.o] Error 1
fatal error: error in backend: IO failure on output stream: No space left on device
make[5]: *** [/tmp/FC29_K4.20_Clang6.0.1/x86_64-native-linuxapp-clang/86c67f1e1d6c4093ae5f3bb1ddd4a75d/dpdk/mk/internal/rte.compile-pre.mk:114: cmdline_flow.o] Error 1
fatal error: error in backend: IO failure on output stream: No space left on device
make[5]: *** [/tmp/FC29_K4.20_Clang6.0.1/x86_64-native-linuxapp-clang/86c67f1e1d6c4093ae5f3bb1ddd4a75d/dpdk/mk/internal/rte.compile-pre.mk:114: macswap.o] Error 1
fatal error: error in backend: IO failure on output stream: No space left on device
make[5]: *** [/tmp/FC29_K4.20_Clang6.0.1/x86_64-native-linuxapp-clang/86c67f1e1d6c4093ae5f3bb1ddd4a75d/dpdk/mk/internal/rte.compile-pre.mk:114: config.o] Error 1
fatal error: error in backend: IO failure on output stream: No space left on device
make[5]: *** [/tmp/FC29_K4.20_Clang6.0.1/x86_64-native-linuxapp-clang/86c67f1e1d6c4093ae5f3bb1ddd4a75d/dpdk/mk/internal/rte.compile-pre.mk:114: cmdline.o] Error 1
make[4]: *** [/tmp/FC29_K4.20_Clang6.0.1/x86_64-native-linuxapp-clang/86c67f1e1d6c4093ae5f3bb1ddd4a75d/dpdk/mk/rte.subdir.mk:37: test-pmd] Error 2
make[3]: *** [/tmp/FC29_K4.20_Clang6.0.1/x86_64-native-linuxapp-clang/86c67f1e1d6c4093ae5f3bb1ddd4a75d/dpdk/mk/rte.sdkbuild.mk:48: app] Error 2
make[2]: *** [/tmp/FC29_K4.20_Clang6.0.1/x86_64-native-linuxapp-clang/86c67f1e1d6c4093ae5f3bb1ddd4a75d/dpdk/mk/rte.sdkroot.mk:99: all] Error 2
make[1]: *** [/tmp/FC29_K4.20_Clang6.0.1/x86_64-native-linuxapp-clang/86c67f1e1d6c4093ae5f3bb1ddd4a75d/dpdk/mk/rte.sdkinstall.mk:61: pre_install] Error 2

DPDK STV team


More information about the test-report mailing list