[dpdk-test-report] |FAILURE| pw51194[1/4] power: fix non thread-safe power env modification

sys_stv at intel.com sys_stv at intel.com
Thu Mar 14 16:49:51 CET 2019


Test-Label: Intel-compilation
Test-Status: FAILURE
http://dpdk.org/patch/51194

_Compilation issues_

Submitter: Hajkowski <marcinx.hajkowski at intel.com>
Date: 2019-03-13 19:48:41
Reply_mail: 20190313194844.11820-2-marcinx.hajkowski at intel.com
DPDK git baseline: Repo:dpdk-master, CommitID: 239912fa798e6e671072ca7ff987afd74c1e506c

Build Summary: 26 Builds Done, 18 Successful, 8 Failures

Test environment and configuration as below:

OS: SUSE15
	Kernel Version: 4.12.14-lp150.12.22-default
	CPU info: Intel(R) Xeon(R) CPU E5-2699 v3 @ 2.30GHz
	GCC Version: gcc (SUSE Linux) 7.3.1 20180323 [gcc-7-branch revision 258812]
	Clang Version: 5.0.1 (tags/RELEASE_501/final 312548)
	x86_64-native-linuxapp-gcc

OS: CENTOS76
	Kernel Version: 3.10.0-957.5.1.el7.x86_64
	CPU info: Intel(R) Xeon(R) CPU E5-2699 v4 @ 2.20GHz
	GCC Version: gcc (GCC) 4.8.5 20150623 (Red Hat 4.8.5-36)
	Clang Version: 3.4.2 (tags/RELEASE_34/dot2-final)
	x86_64-native-linuxapp-gcc

OS: UBT144-32
	Kernel Version: 3.13.0-161-generic
	CPU info: Intel(R) Xeon(R) CPU E5-2699 v3 @ 2.30GHz
	GCC Version: gcc (Ubuntu 4.8.4-2ubuntu1~14.04.4) 4.8.4
	Clang Version: NA
	i686-native-linuxapp-gcc

OS: UBT164-32
	
	
	
	
	i686-native-linuxapp-gcc

OS: SUSE12
	Kernel Version: 4.4.73-5-default
	CPU info: Intel(R) Xeon(R) CPU E5-2699 v4 @ 2.20GHz
	GCC Version: gcc (SUSE Linux) 7.1.1 20170607 [gcc-7-branch revision 248970]
	Clang Version: NA
	x86_64-native-linuxapp-gcc

OS: FreeBSD12.0
	Kernel Version: 12.0-RC3
	CPU info: Intel(R) Xeon(R) CPU E5-2699 v3 @ 2.30GHz (2294.74-MHz K8-class CPU)
	GCC Version: gcc (FreeBSD Ports Collection) 7.3.0
	Clang Version: 6.0.1 (tags/RELEASE_601/final 335540) (based on LLVM 6.0.1)
	x86_64-native-bsdapp-clang
	x86_64-native-bsdapp-gcc

OS: UBT144-64
	Kernel Version: 4.2.0-27-generic
	CPU info: Intel(R) Xeon(R) CPU E5-2699 v3 @ 2.30GHz
	GCC Version: gcc (Ubuntu 4.8.4-2ubuntu1~14.04.4) 4.8.4
	Clang Version: NA
	x86_64-native-linuxapp-gcc

OS: CENTOS75
	Kernel Version: 3.10.0-957.5.1.el7.x86_64
	CPU info: Intel(R) Xeon(R) CPU E5-2699 v4 @ 2.20GHz
	GCC Version: gcc (GCC) 4.8.5 20150623 (Red Hat 4.8.5-36)
	Clang Version: 3.4.2 (tags/RELEASE_34/dot2-final)
	x86_64-native-linuxapp-gcc

OS: UBT1804
	Kernel Version: 4.15.0-20-generic
	CPU info: Intel(R) Xeon(R) CPU E5-2699 v3 @ 2.30GHz
	GCC Version: gcc (Ubuntu 7.3.0-27ubuntu1~18.04) 7.3.0
	Clang Version: NA
	x86_64-native-linuxapp-clang
	x86_64-native-linuxapp-gcc
	x86_64-native-linuxapp-icc

OS: UBT1810
	Kernel Version: 4.18.0-10-generic
	CPU info: Intel(R) Xeon(R) CPU E5-2699 v3 @ 2.30GHz
	GCC Version: gcc (Ubuntu 8.2.0-7ubuntu1) 8.2.0
	Clang Version: NA
	x86_64-native-linuxapp-gcc

OS: RHEL74
	Kernel Version: 3.10.0-693.el7.x86_64
	CPU info: Intel(R) Xeon(R) CPU E5-2699 v4 @ 2.20GHz
	GCC Version: gcc (GCC) 4.8.5 20150623 (Red Hat 4.8.5-16)
	Clang Version: NA
	x86_64-native-linuxapp-gcc

OS: CENTOS74
	Kernel Version: 3.10.0-862.14.4.el7.x86_64
	CPU info: Intel(R) Xeon(R) CPU E5-2699 v4 @ 2.20GHz
	GCC Version: gcc (GCC) 4.8.5 20150623 (Red Hat 4.8.5-28)
	Clang Version: 3.4.2 (tags/RELEASE_34/dot2-final)
	x86_64-native-linuxapp-gcc

OS: FreeBSD11.2
	Kernel Version: 11.2-RELEASE
	CPU info: Intel(R) Xeon(R) CPU E5-2699 v3 @ 2.30GHz (2294.74-MHz K8-class CPU)
	GCC Version: gcc (FreeBSD Ports Collection) 6.4.0
	Clang Version: 6.0.0 (tags/RELEASE_600/final 326565) (based on LLVM 6.0.0)
	x86_64-native-bsdapp-clang
	x86_64-native-bsdapp-gcc

OS: UBT164-64
	Kernel Version: 4.4.0-47-generic
	CPU info: Intel(R) Xeon(R) CPU E5-2699 v3 @ 2.30GHz
	GCC Version: gcc (Ubuntu 5.4.0-6ubuntu1~16.04.10) 5.4.0 20160609
	Clang Version: 3.8.0-2ubuntu4 (tags/RELEASE_380/final)
	x86_64-native-linuxapp-gcc

OS: FC28
	Kernel Version: 4.16.3-301.fc28.x86_64
	CPU info: Intel(R) Xeon(R) CPU E5-2699 v4 @ 2.20GHz
	GCC Version: gcc (GCC) 8.1.1 20180712 (Red Hat 8.1.1-5)
	Clang Version: NA
	x86_64-native-linuxapp-gcc
	x86_64-native-linuxapp-clang
	x86_64-native-linuxapp-icc

OS: RHEL76
	Kernel Version: 3.10.0-957.el7.x86_64
	CPU info: Intel(R) Xeon(R) CPU E5-2699 v4 @ 2.20GHz
	GCC Version: gcc (GCC) 4.8.5 20150623 (Red Hat 4.8.5-36)
	Clang Version: NA
	x86_64-native-linuxapp-gcc

OS: FC29
	Kernel Version: 4.18.16-300.fc29.x86_64
	CPU info: Intel(R) Xeon(R) CPU E5-2699 v4 @ 2.20GHz
	GCC Version: gcc (GCC) 8.2.1 20181215 (Red Hat 8.2.1-6)
	Clang Version: NA
	x86_64-native-linuxapp-gcc
	x86_64-native-linuxapp-clang
	x86_64-native-linuxapp-icc

OS: RHEL75
	Kernel Version: 3.10.0-862.el7.x86_64
	CPU info: Intel(R) Xeon(R) CPU E5-2699 v4 @ 2.20GHz
	GCC Version: gcc (GCC) 4.8.5 20150623 (Red Hat 4.8.5-28)
	Clang Version: NA
	x86_64-native-linuxapp-gcc

*Failed Build #1:
OS: UBT144-64
Target: x86_64-native-linuxapp-gcc
  CC rte_hypervisor.o
  CC rte_spinlock.o
  CC rte_cycles.o
  AR librte_eal.a
  INSTALL-LIB librte_eal.a
make[7]: warning:  Clock skew detected.  Your build may be incomplete.
== Build lib/librte_pci
== Build lib/librte_ring
== Build lib/librte_cmdline
== Build lib/librte_acl
== Build lib/librte_jobstats
--
  AR librte_mempool.a
  INSTALL-LIB librte_mempool.a
== Build lib/librte_mbuf
  AR librte_power.a
  INSTALL-LIB librte_power.a
make[5]: warning:  Clock skew detected.  Your build may be incomplete.
  SYMLINK-FILE include/rte_mbuf.h
  SYMLINK-FILE include/rte_mbuf_ptype.h
  SYMLINK-FILE include/rte_mbuf_pool_ops.h
  CC rte_mbuf.o
  CC rte_mbuf_ptype.o
--
  AR librte_bbdev.a
  INSTALL-LIB librte_bbdev.a
  AR librte_cryptodev.a
  INSTALL-LIB librte_cryptodev.a
  CC rte_tm.o
make[5]: warning:  Clock skew detected.  Your build may be incomplete.
  CC rte_mtr.o
  SYMLINK-FILE include/rte_efd.h
  CC rte_efd.o
  SYMLINK-FILE include/rte_member.h
  CC rte_member.o
--
  INSTALL-LIB librte_table.a
  AR librte_vhost.a
== Build lib/librte_pipeline
  INSTALL-LIB librte_vhost.a
== Build lib/librte_flow_classify
make[5]: warning:  Clock skew detected.  Your build may be incomplete.
  SYMLINK-FILE include/rte_flow_classify.h
  CC rte_flow_classify.o
  CC rte_flow_classify_parse.o
  SYMLINK-FILE include/rte_pipeline.h
  SYMLINK-FILE include/rte_port_in_action.h
--
  AR librte_bus_vdev.a
  AR librte_bus_pci.a
  INSTALL-LIB librte_bus_ifpga.a
  INSTALL-LIB librte_bus_pci.a
  INSTALL-LIB librte_bus_vdev.a
make[6]: warning:  Clock skew detected.  Your build may be incomplete.
  CC base/fman/netcfg_layer.o
  CC vmbus_common.o
  CC vmbus_channel.o
  CC vmbus_bufring.o
  LD [M]  /tmp/UBT144-64_K4.2.0_GCC4.8.4/x86_64-native-linuxapp-gcc/3a27ae2b047c46999dd233dd283902e5/dpdk/x86_64-native-linuxapp-gcc/build/kernel/linux/igb_uio/igb_uio.ko
--
  LD portal/dpaa2_hw_dpbp.o
  AR librte_bus_fslmc.a
  INSTALL-LIB librte_bus_fslmc.a
  AR librte_bus_dpaa.a
  INSTALL-LIB librte_bus_dpaa.a
make[6]: warning:  Clock skew detected.  Your build may be incomplete.
== Build drivers/mempool
== Build drivers/mempool/dpaa2
== Build drivers/mempool/dpaa
== Build drivers/mempool/bucket
== Build drivers/mempool/stack
--
  AR librte_pmd_bond.a
  INSTALL-LIB librte_pmd_dpaa2_sec.a
  CC e1000_mbx.o
  INSTALL-LIB librte_pmd_bond.a
  CC cxgbe_flow.o
make[6]: warning:  Clock skew detected.  Your build may be incomplete.
  CC e1000_nvm.o
== Build drivers/net/enic
  CC dpaa2_ethdev.o
  CC e1000_osdep.o
  CC ena_ethdev.o
--
  CC ice_sched.o
  CC iavf_vchnl.o
  CC nfp_cpp_pcie_ops.o
  AR librte_pmd_enic.a
  INSTALL-LIB librte_pmd_enic.a
make[6]: warning:  Clock skew detected.  Your build may be incomplete.
== Build drivers/net/bnxt
  CC fm10k_tlv.o
  CC ixgbe_82598.o
  CC hn_rndis.o
  CC i40e_diag.o
--
  CC nfp_mip.o
  CC nfp_nffw.o
  AR librte_pmd_netvsc.a
  INSTALL-LIB librte_pmd_netvsc.a
  CC i40e_nvm.o
make[6]: warning:  Clock skew detected.  Your build may be incomplete.
== Build drivers/net/octeontx
  CC nfp_hwinfo.o
  AR librte_pmd_fm10k.a
  INSTALL-LIB librte_pmd_fm10k.a
== Build drivers/net/pcap
--
  LD nfp_net.o
== Build drivers/net/tap
  CC ixgbe_phy.o
  AR librte_pmd_nfp.a
  INSTALL-LIB librte_pmd_nfp.a
make[6]: warning:  Clock skew detected.  Your build may be incomplete.
  CC ecore_dev.o
== Build drivers/net/thunderx
  CC ice_ethdev.o
  SYMLINK-FILE include/rte_eth_ring.h
  CC rte_eth_ring.o
--
  CC vdev_netvsc.o.pmd.o
  CC bnxt_rxq.o
  LD vdev_netvsc.o
  AR librte_pmd_vdev_netvsc.a
  INSTALL-LIB librte_pmd_vdev_netvsc.a
make[6]: warning:  Clock skew detected.  Your build may be incomplete.
== Build drivers/net/virtio
  CC sfc_port.o
  CC nicvf_svf.o
  CC ecore_hw.o
  PMDINFO i40e_ethdev.o.pmd.c
--
  CC ifpga_feature_dev.o
  CC ifpga_fme.o
  CC ifpga_fme_iperf.o
  CC ifpga_fme_dperf.o
  CC skeleton_rawdev.o
  CC ifpga_fme_error.o
  CC ifpga_port.o
  PMDINFO dpaa2_cmdif.o.pmd.c
  CC dpaa2_cmdif.o.pmd.o
  CC ifpga_port_error.o
  LD dpaa2_cmdif.o
  AR librte_pmd_dpaa2_cmdif.a
  CC skeleton_rawdev_test.o
  CC opae_hw_api.o
  INSTALL-LIB librte_pmd_dpaa2_cmdif.a
--
  CC test_meter.o
  CC test_kni.o
  CC test_power.o
  CC test_power_acpi_cpufreq.o
/tmp/UBT144-64_K4.2.0_GCC4.8.4/x86_64-native-linuxapp-gcc/3a27ae2b047c46999dd233dd283902e5/dpdk/app/test/test_power.c: In function ‘test_power’:
/tmp/UBT144-64_K4.2.0_GCC4.8.4/x86_64-native-linuxapp-gcc/3a27ae2b047c46999dd233dd283902e5/dpdk/app/test/test_power.c:140:2: error: ‘for’ loop initial declarations are only allowed in C99 mode
  for (int i = 0; i < envs_size; ++i) {
  ^
/tmp/UBT144-64_K4.2.0_GCC4.8.4/x86_64-native-linuxapp-gcc/3a27ae2b047c46999dd233dd283902e5/dpdk/app/test/test_power.c:140:2: note: use option -std=c99 or -std=gnu99 to compile your code
make[5]: *** [test_power.o] Error 1
make[5]: *** Waiting for unfinished jobs....

*Failed Build #2:
OS: UBT144-32
Target: i686-native-linuxapp-gcc
  CC rte_hypervisor.o
  CC rte_spinlock.o
  CC rte_cycles.o
  AR librte_eal.a
  INSTALL-LIB librte_eal.a
make[7]: warning:  Clock skew detected.  Your build may be incomplete.
== Build lib/librte_pci
== Build lib/librte_ring
== Build lib/librte_timer
== Build lib/librte_cmdline
== Build lib/librte_meter
--
  AR librte_mempool.a
  INSTALL-LIB librte_mempool.a
== Build lib/librte_mbuf
  AR librte_power.a
  INSTALL-LIB librte_power.a
make[5]: warning:  Clock skew detected.  Your build may be incomplete.
  SYMLINK-FILE include/rte_mbuf.h
  SYMLINK-FILE include/rte_mbuf_ptype.h
  SYMLINK-FILE include/rte_mbuf_pool_ops.h
  CC rte_mbuf.o
  CC rte_mbuf_ptype.o
--
  SYMLINK-FILE include/rte_lpm6.h
  SYMLINK-FILE include/rte_efd.h
  AR librte_cryptodev.a
  INSTALL-LIB librte_cryptodev.a
  CC rte_efd.o
make[5]: warning:  Clock skew detected.  Your build may be incomplete.
  SYMLINK-FILE include/rte_lpm_sse.h
  CC rte_lpm.o
  CC rte_lpm6.o
  CC rte_member.o
  SYMLINK-FILE include/rte_member.h
--
  CC rte_table_hash_lru.o
  CC rte_table_array.o
  CC rte_table_stub.o
  AR librte_vhost.a
  INSTALL-LIB librte_vhost.a
make[5]: warning:  Clock skew detected.  Your build may be incomplete.
  AR librte_table.a
  INSTALL-LIB librte_table.a
== Build lib/librte_flow_classify
== Build lib/librte_pipeline
  SYMLINK-FILE include/rte_pipeline.h
--
  CC base/qbman/bman_driver.o
  CC portal/dpaa2_hw_dpci.o.pmd.o
  LD portal/dpaa2_hw_dpbp.o
  PMDINFO portal/dpaa2_hw_dpio.o.pmd.c
  CC portal/dpaa2_hw_dpio.o.pmd.o
make[6]: warning:  Clock skew detected.  Your build may be incomplete.
INSTALL-MODULE rte_kni.ko
  LD portal/dpaa2_hw_dpci.o
  LD portal/dpaa2_hw_dpio.o
  CC base/qbman/qman.o
  CC base/qbman/qman_driver.o
--
  CC base/qbman/dpaa_sys.o
  AR librte_bus_fslmc.a
  INSTALL-LIB librte_bus_fslmc.a
  AR librte_bus_dpaa.a
  INSTALL-LIB librte_bus_dpaa.a
make[6]: warning:  Clock skew detected.  Your build may be incomplete.
== Build drivers/mempool
== Build drivers/mempool/dpaa
== Build drivers/mempool/bucket
== Build drivers/mempool/dpaa2
== Build drivers/mempool/ring
--
== Build drivers/crypto/dpaa_sec
  CC hw_atl_b0.o
  AR librte_pmd_bond.a
  SYMLINK-FILE include/rte_pmd_dpaa.h
  INSTALL-LIB librte_pmd_bond.a
make[6]: warning:  Clock skew detected.  Your build may be incomplete.
== Build drivers/net/e1000
  CC dpaa_ethdev.o
  CC cxgbe_ethdev.o
  AR librte_pmd_atlantic.a
  INSTALL-LIB librte_pmd_atlantic.a
--
  INSTALL-LIB librte_pmd_fm10k.a
  CC ixgbe_common.o
== Build drivers/net/bnxt
  AR librte_pmd_enic.a
  INSTALL-LIB librte_pmd_enic.a
make[6]: warning:  Clock skew detected.  Your build may be incomplete.
  CC i40e_ethdev_vf.o
  CC i40e_pf.o
  PMDINFO lio_ethdev.o.pmd.c
  CC lio_ethdev.o.pmd.o
  LD lio_ethdev.o
--
== Build drivers/net/qede
  CC ixgbe_x550.o
  AR librte_pmd_netvsc.a
  AR librte_pmd_i40e.a
  INSTALL-LIB librte_pmd_netvsc.a
make[6]: warning:  Clock skew detected.  Your build may be incomplete.
  CC ixgbe_phy.o
  INSTALL-LIB librte_pmd_i40e.a
  CC bnxt_rxr.o
  PMDINFO ice_ethdev.o.pmd.c
  CC ice_ethdev.o.pmd.o
--
  PMDINFO vdev_netvsc.o.pmd.c
  CC vdev_netvsc.o.pmd.o
  LD vdev_netvsc.o
  AR librte_pmd_vdev_netvsc.a
  INSTALL-LIB librte_pmd_vdev_netvsc.a
make[6]: warning:  Clock skew detected.  Your build may be incomplete.
  CC virtio_pci.o
  CC tap_netlink.o
  CC tap_tcmsgs.o
  CC nicvf_hw.o
  CC virtio_rxtx.o
--
  CC ifpga_fme.o
  CC ifpga_fme_iperf.o
  CC dpaa2_cmdif.o.pmd.o
  CC ifpga_fme_dperf.o
  LD dpaa2_cmdif.o
  CC ifpga_fme_error.o
  AR librte_pmd_dpaa2_cmdif.a
  INSTALL-LIB librte_pmd_dpaa2_cmdif.a
  CC ifpga_port.o
  CC ifpga_port_error.o
  CC opae_hw_api.o
  PMDINFO skeleton_rawdev.o.pmd.c
  CC skeleton_rawdev.o.pmd.o
  CC opae_ifpga_hw_api.o
  CC opae_debug.o
--
  CC test_meter.o
  CC test_power.o
  CC test_power_acpi_cpufreq.o
  CC test_power_kvm_vm.o
/tmp/UBT144-32_K3.13.0_GCC4.8.4/i686-native-linuxapp-gcc/3a27ae2b047c46999dd233dd283902e5/dpdk/app/test/test_power.c: In function ‘test_power’:
/tmp/UBT144-32_K3.13.0_GCC4.8.4/i686-native-linuxapp-gcc/3a27ae2b047c46999dd233dd283902e5/dpdk/app/test/test_power.c:140:2: error: ‘for’ loop initial declarations are only allowed in C99 mode
  for (int i = 0; i < envs_size; ++i) {
  ^
/tmp/UBT144-32_K3.13.0_GCC4.8.4/i686-native-linuxapp-gcc/3a27ae2b047c46999dd233dd283902e5/dpdk/app/test/test_power.c:140:2: note: use option -std=c99 or -std=gnu99 to compile your code
  CC test_common.o
make[5]: *** [test_power.o] Error 1

*Failed Build #3:
OS: RHEL75
Target: x86_64-native-linuxapp-gcc
  CC ifpga_enumerate.o
  CC ifpga_feature_dev.o
  CC ifpga_fme.o
  CC ifpga_fme_iperf.o
  CC ifpga_fme_dperf.o
  CC ifpga_fme_error.o
  PMDINFO dpaa2_cmdif.o.pmd.c
  CC dpaa2_cmdif.o.pmd.o
  CC ifpga_port.o
  LD dpaa2_cmdif.o
  CC ifpga_port_error.o
  CC opae_hw_api.o
  CC opae_ifpga_hw_api.o
  PMDINFO skeleton_rawdev.o.pmd.c
  CC opae_debug.o
  CC skeleton_rawdev.o.pmd.o
--
  CC test_sched.o
  CC test_meter.o
  CC test_kni.o
  CC test_power.o
/tmp/RHEL75_K3.10.0_GCC4.8.5/x86_64-native-linuxapp-gcc/3a27ae2b047c46999dd233dd283902e5/dpdk/app/test/test_power.c: In function ‘test_power’:
/tmp/RHEL75_K3.10.0_GCC4.8.5/x86_64-native-linuxapp-gcc/3a27ae2b047c46999dd233dd283902e5/dpdk/app/test/test_power.c:140:2: error: ‘for’ loop initial declarations are only allowed in C99 mode
  for (int i = 0; i < envs_size; ++i) {
  ^
/tmp/RHEL75_K3.10.0_GCC4.8.5/x86_64-native-linuxapp-gcc/3a27ae2b047c46999dd233dd283902e5/dpdk/app/test/test_power.c:140:2: note: use option -std=c99 or -std=gnu99 to compile your code
make[5]: *** [test_power.o] Error 1
make[5]: *** Waiting for unfinished jobs....

*Failed Build #4:
OS: RHEL76
Target: x86_64-native-linuxapp-gcc
  CC ifpga_feature_dev.o
  CC ifpga_fme.o
  CC dpaa2_cmdif.o
  CC ifpga_fme_iperf.o
  CC ifpga_fme_dperf.o
  CC ifpga_fme_error.o
  CC ifpga_port.o
  CC ifpga_port_error.o
  PMDINFO skeleton_rawdev.o.pmd.c
  CC opae_hw_api.o
  PMDINFO dpaa2_cmdif.o.pmd.c
  CC dpaa2_cmdif.o.pmd.o
  CC skeleton_rawdev.o.pmd.o
--
  CC test_kni.o
  CC test_power.o
  CC test_power_acpi_cpufreq.o
  CC test_power_kvm_vm.o
/tmp/RHEL76_K3.10.0_GCC4.8.5/x86_64-native-linuxapp-gcc/3a27ae2b047c46999dd233dd283902e5/dpdk/app/test/test_power.c: In function ‘test_power’:
/tmp/RHEL76_K3.10.0_GCC4.8.5/x86_64-native-linuxapp-gcc/3a27ae2b047c46999dd233dd283902e5/dpdk/app/test/test_power.c:140:2: error: ‘for’ loop initial declarations are only allowed in C99 mode
  for (int i = 0; i < envs_size; ++i) {
  ^
/tmp/RHEL76_K3.10.0_GCC4.8.5/x86_64-native-linuxapp-gcc/3a27ae2b047c46999dd233dd283902e5/dpdk/app/test/test_power.c:140:2: note: use option -std=c99 or -std=gnu99 to compile your code
  CC test_common.o
make[5]: *** [test_power.o] Error 1

*Failed Build #5:
OS: RHEL74
Target: x86_64-native-linuxapp-gcc
  CC dpaa2_cmdif.o.pmd.o
  CC ifpga_feature_dev.o
  CC ifpga_fme_iperf.o
  CC ifpga_fme_dperf.o
  LD dpaa2_cmdif.o
  CC ifpga_fme_error.o
  PMDINFO skeleton_rawdev.o.pmd.c
  CC skeleton_rawdev.o.pmd.o
  AR librte_pmd_dpaa2_cmdif.a
  CC ifpga_port.o
  LD skeleton_rawdev.o
  INSTALL-LIB librte_pmd_dpaa2_cmdif.a
  PMDINFO dpaa2_qdma.o.pmd.c
  CC dpaa2_qdma.o.pmd.o
  LD dpaa2_qdma.o
  CC ifpga_port_error.o
  AR librte_pmd_skeleton_rawdev.a
  CC opae_hw_api.o
  INSTALL-LIB librte_pmd_skeleton_rawdev.a
  CC opae_ifpga_hw_api.o
  CC opae_debug.o
--
  CC test_meter.o
  CC test_kni.o
  CC test_power.o
  CC test_power_acpi_cpufreq.o
/tmp/RHEL74_K3.10.0_GCC4.8.5/x86_64-native-linuxapp-gcc/3a27ae2b047c46999dd233dd283902e5/dpdk/app/test/test_power.c: In function ‘test_power’:
/tmp/RHEL74_K3.10.0_GCC4.8.5/x86_64-native-linuxapp-gcc/3a27ae2b047c46999dd233dd283902e5/dpdk/app/test/test_power.c:140:2: error: ‘for’ loop initial declarations are only allowed in C99 mode
  for (int i = 0; i < envs_size; ++i) {
  ^
/tmp/RHEL74_K3.10.0_GCC4.8.5/x86_64-native-linuxapp-gcc/3a27ae2b047c46999dd233dd283902e5/dpdk/app/test/test_power.c:140:2: note: use option -std=c99 or -std=gnu99 to compile your code
  CC test_power_kvm_vm.o
make[5]: *** [test_power.o] Error 1

*Failed Build #6:
OS: CENTOS74
Target: x86_64-native-linuxapp-gcc
  CC ifpga_feature_dev.o
  CC dpaa2_cmdif.o
  CC ifpga_fme.o
  CC ifpga_fme_iperf.o
  CC ifpga_fme_dperf.o
  CC ifpga_fme_error.o
  CC ifpga_port.o
  PMDINFO dpaa2_cmdif.o.pmd.c
  CC dpaa2_cmdif.o.pmd.o
  PMDINFO skeleton_rawdev.o.pmd.c
  CC ifpga_port_error.o
  CC opae_hw_api.o
  CC skeleton_rawdev.o.pmd.o
  LD dpaa2_cmdif.o
  LD skeleton_rawdev.o
  AR librte_pmd_dpaa2_cmdif.a
--
  CC test_kni.o
  CC test_power.o
  CC test_power_acpi_cpufreq.o
  CC test_power_kvm_vm.o
/tmp/CENTOS74_K3.10.0_GCC4.8.5/x86_64-native-linuxapp-gcc/3a27ae2b047c46999dd233dd283902e5/dpdk/app/test/test_power.c: In function ‘test_power’:
/tmp/CENTOS74_K3.10.0_GCC4.8.5/x86_64-native-linuxapp-gcc/3a27ae2b047c46999dd233dd283902e5/dpdk/app/test/test_power.c:140:2: error: ‘for’ loop initial declarations are only allowed in C99 mode
  for (int i = 0; i < envs_size; ++i) {
  ^
/tmp/CENTOS74_K3.10.0_GCC4.8.5/x86_64-native-linuxapp-gcc/3a27ae2b047c46999dd233dd283902e5/dpdk/app/test/test_power.c:140:2: note: use option -std=c99 or -std=gnu99 to compile your code
  CC test_common.o
make[5]: *** [test_power.o] Error 1

*Failed Build #7:
OS: CENTOS75
Target: x86_64-native-linuxapp-gcc
  CC ifpga_feature_dev.o
  CC ifpga_fme_iperf.o
  PMDINFO skeleton_rawdev.o.pmd.c
  CC ifpga_fme_dperf.o
  CC skeleton_rawdev.o.pmd.o
  CC ifpga_fme_error.o
  AR librte_pmd_dpaa2_cmdif.a
  INSTALL-LIB librte_pmd_dpaa2_cmdif.a
  LD skeleton_rawdev.o
  PMDINFO dpaa2_qdma.o.pmd.c
  CC dpaa2_qdma.o.pmd.o
  AR librte_pmd_skeleton_rawdev.a
  LD dpaa2_qdma.o
  CC ifpga_port.o
  CC ifpga_port_error.o
  CC opae_hw_api.o
  CC opae_ifpga_hw_api.o
  CC opae_debug.o
  CC ifpga_fme_pr.o
  INSTALL-LIB librte_pmd_skeleton_rawdev.a
--
  CC test_kni.o
  CC test_power.o
  CC test_power_acpi_cpufreq.o
  CC test_power_kvm_vm.o
/tmp/CENTOS75_K3.10.0_GCC4.8.5/x86_64-native-linuxapp-gcc/3a27ae2b047c46999dd233dd283902e5/dpdk/app/test/test_power.c: In function ‘test_power’:
/tmp/CENTOS75_K3.10.0_GCC4.8.5/x86_64-native-linuxapp-gcc/3a27ae2b047c46999dd233dd283902e5/dpdk/app/test/test_power.c:140:2: error: ‘for’ loop initial declarations are only allowed in C99 mode
  for (int i = 0; i < envs_size; ++i) {
  ^
/tmp/CENTOS75_K3.10.0_GCC4.8.5/x86_64-native-linuxapp-gcc/3a27ae2b047c46999dd233dd283902e5/dpdk/app/test/test_power.c:140:2: note: use option -std=c99 or -std=gnu99 to compile your code
make[5]: *** [test_power.o] Error 1
make[5]: *** Waiting for unfinished jobs....

*Failed Build #8:
OS: CENTOS76
Target: x86_64-native-linuxapp-gcc
  CC ifpga_feature_dev.o
  SYMLINK-FILE include/rte_pmd_dpaa2_qdma.h
  CC ifpga_fme.o
  CC ifpga_fme_iperf.o
  CC ifpga_fme_dperf.o
  CC ifpga_fme_error.o
  PMDINFO dpaa2_cmdif.o.pmd.c
  CC dpaa2_cmdif.o.pmd.o
  LD dpaa2_cmdif.o
  CC ifpga_port.o
  CC dpaa2_qdma.o
  PMDINFO skeleton_rawdev.o.pmd.c
  CC skeleton_rawdev.o.pmd.o
  AR librte_pmd_dpaa2_cmdif.a
  LD skeleton_rawdev.o
  CC ifpga_port_error.o
  INSTALL-LIB librte_pmd_dpaa2_cmdif.a
  CC opae_hw_api.o
  CC opae_ifpga_hw_api.o
  CC opae_debug.o
  CC ifpga_fme_pr.o
--
  CC test_kni.o
  CC test_power.o
  CC test_power_acpi_cpufreq.o
  CC test_power_kvm_vm.o
/tmp/CENTOS76_K3.10.0_GCC4.8.5/x86_64-native-linuxapp-gcc/3a27ae2b047c46999dd233dd283902e5/dpdk/app/test/test_power.c: In function ‘test_power’:
/tmp/CENTOS76_K3.10.0_GCC4.8.5/x86_64-native-linuxapp-gcc/3a27ae2b047c46999dd233dd283902e5/dpdk/app/test/test_power.c:140:2: error: ‘for’ loop initial declarations are only allowed in C99 mode
  for (int i = 0; i < envs_size; ++i) {
  ^
/tmp/CENTOS76_K3.10.0_GCC4.8.5/x86_64-native-linuxapp-gcc/3a27ae2b047c46999dd233dd283902e5/dpdk/app/test/test_power.c:140:2: note: use option -std=c99 or -std=gnu99 to compile your code
make[5]: *** [test_power.o] Error 1
make[5]: *** Waiting for unfinished jobs....

DPDK STV team


More information about the test-report mailing list