[dpdk-test-report] |FAILURE| pw51219-51220 [PATCH] [v6, 1/2] eal/ticketlock: ticket based to improve fairness

dpdklab at iol.unh.edu dpdklab at iol.unh.edu
Fri Mar 15 08:17:42 CET 2019


Test-Label: Performance-Testing
Test-Status: FAILURE
http://dpdk.org/patch/51219

_build patch failure_

Submitter: Joyce Kong (Arm Technology China) <joyce.kong at arm.com>
Date: Friday, March 15 2019 06:56:27 
Applied on: CommitID:239912fa798e6e671072ca7ff987afd74c1e506c
Apply patch set 51219-51220 failed:

Configuration done using x86_64-native-linuxapp-gcc
== Build lib
== Build lib/librte_kvargs
== Build lib/librte_eal
== Build lib/librte_eal/common
== Build lib/librte_eal/linux
== Build lib/librte_eal/linux/eal
== Build lib/librte_pci
== Build lib/librte_ring
== Build lib/librte_mempool
== Build lib/librte_mbuf
== Build lib/librte_timer
== Build lib/librte_cfgfile
== Build lib/librte_cmdline
== Build lib/librte_net
== Build lib/librte_meter
== Build lib/librte_ethdev
== Build lib/librte_bbdev
== Build lib/librte_cryptodev
== Build lib/librte_security
== Build lib/librte_compressdev
== Build lib/librte_hash
== Build lib/librte_eventdev
== Build lib/librte_rawdev
== Build lib/librte_vhost
== Build lib/librte_efd
== Build lib/librte_lpm
== Build lib/librte_acl
== Build lib/librte_member
== Build lib/librte_ip_frag
== Build lib/librte_gro
== Build lib/librte_jobstats
== Build lib/librte_metrics
== Build lib/librte_bitratestats
== Build lib/librte_latencystats
== Build lib/librte_power
== Build lib/librte_sched
== Build lib/librte_kni
== Build lib/librte_port
== Build lib/librte_table
== Build lib/librte_flow_classify
== Build lib/librte_distributor
== Build lib/librte_pipeline
== Build lib/librte_reorder
== Build lib/librte_pdump
== Build lib/librte_gso
== Build lib/librte_bpf
== Build lib/librte_ipsec
== Build buildtools
== Build buildtools/pmdinfogen
== Build kernel
== Build kernel/linux
== Build kernel/linux/igb_uio
  Building modules, stage 2.
  MODPOST 1 modules
== Build kernel/linux/kni
  Building modules, stage 2.
  MODPOST 1 modules
== Build drivers
== Build drivers/common
== Build drivers/common/cpt
== Build drivers/common/octeontx
== Build drivers/common/dpaax
== Build drivers/bus
== Build drivers/bus/dpaa
== Build drivers/bus/fslmc
== Build drivers/bus/ifpga
== Build drivers/bus/pci
== Build drivers/bus/vdev
== Build drivers/bus/vmbus
== Build drivers/mempool
== Build drivers/mempool/bucket
== Build drivers/mempool/dpaa
== Build drivers/mempool/dpaa2
== Build drivers/mempool/ring
== Build drivers/mempool/stack
== Build drivers/mempool/octeontx
== Build drivers/net
== Build drivers/net/af_packet
== Build drivers/net/ark
== Build drivers/net/atlantic
== Build drivers/net/avp
== Build drivers/net/axgbe
== Build drivers/net/bonding
== Build drivers/net/cxgbe
== Build drivers/net/dpaa
== Build drivers/net/dpaa2
== Build drivers/net/e1000
== Build drivers/net/ena
== Build drivers/net/enetc
== Build drivers/net/enic
== Build drivers/net/failsafe
== Build drivers/net/fm10k
== Build drivers/net/i40e
== Build drivers/net/iavf
== Build drivers/net/ice
== Build drivers/net/ixgbe
== Build drivers/net/liquidio
== Build drivers/net/netvsc
== Build drivers/net/nfp
== Build drivers/net/bnxt
== Build drivers/net/null
== Build drivers/net/octeontx
== Build drivers/net/qede
== Build drivers/net/ring
== Build drivers/net/sfc
== Build drivers/net/tap
== Build drivers/net/thunderx
== Build drivers/net/vdev_netvsc
== Build drivers/net/virtio
== Build drivers/net/vmxnet3
== Build drivers/net/kni
== Build drivers/net/softnic
== Build drivers/net/vhost
== Build drivers/net/ifc
== Build drivers/baseband
== Build drivers/baseband/null
== Build drivers/crypto
== Build drivers/crypto/octeontx
== Build drivers/crypto/scheduler
== Build drivers/crypto/null
== Build drivers/crypto/dpaa2_sec
== Build drivers/crypto/dpaa_sec
== Build drivers/crypto/caam_jr
== Build drivers/crypto/virtio
== Build drivers/common/qat
== Build drivers/compress
== Build drivers/compress/octeontx
== Build drivers/event
== Build drivers/event/skeleton
== Build drivers/event/sw
== Build drivers/event/dsw
== Build drivers/event/octeontx
== Build drivers/event/dpaa
== Build drivers/event/dpaa2
== Build drivers/event/opdl
== Build drivers/raw
== Build drivers/raw/skeleton_rawdev
== Build drivers/raw/dpaa2_cmdif
== Build drivers/raw/dpaa2_qdma
== Build drivers/raw/ifpga_rawdev
== Build app
== Build app/test
  MKRES test_resource_c.res.o
  CC test_ticketlock.o
/var/lib/jenkins/workspace/Apply-Custom-Patch-Set/dpdk/app/test/test_ticketlock.c:20:28: fatal error: rte_ticketlock.h: No such file or directory
 #include <rte_ticketlock.h>
                            ^
compilation terminated.
make[5]: *** [test_ticketlock.o] Error 1
make[4]: *** [test] Error 2
make[3]: *** [app] Error 2
make[2]: *** [all] Error 2
make[1]: *** [pre_install] Error 2
make: *** [install] Error 2

https://lab.dpdk.org/results/dashboard/patchsets/4884/

UNH-IOL DPDK Performance Test Lab


More information about the test-report mailing list