[dpdk-test-report] |FAILURE| pw51329-51334 [PATCH] [v2, 1/6] net/af_xdp: introduce AF XDP PMD driver

dpdklab at iol.unh.edu dpdklab at iol.unh.edu
Tue Mar 19 08:45:45 CET 2019


Test-Label: Performance-Testing
Test-Status: FAILURE
http://dpdk.org/patch/51329

_build patch failure_

Submitter: Xiaolong Ye <xiaolong.ye at intel.com>
Date: Tuesday, March 19 2019 07:12:51 
Applied on: CommitID:239912fa798e6e671072ca7ff987afd74c1e506c
Apply patch set 51329-51334 failed:

Configuration done using x86_64-native-linuxapp-gcc
== Build lib
== Build lib/librte_kvargs
== Build lib/librte_eal
== Build lib/librte_eal/common
== Build lib/librte_eal/linux
== Build lib/librte_eal/linux/eal
== Build lib/librte_pci
== Build lib/librte_ring
== Build lib/librte_mempool
== Build lib/librte_mbuf
== Build lib/librte_timer
== Build lib/librte_cfgfile
== Build lib/librte_cmdline
== Build lib/librte_net
== Build lib/librte_meter
== Build lib/librte_ethdev
== Build lib/librte_bbdev
== Build lib/librte_cryptodev
== Build lib/librte_security
== Build lib/librte_compressdev
== Build lib/librte_hash
== Build lib/librte_eventdev
== Build lib/librte_rawdev
== Build lib/librte_vhost
== Build lib/librte_efd
== Build lib/librte_lpm
== Build lib/librte_acl
== Build lib/librte_member
== Build lib/librte_ip_frag
== Build lib/librte_gro
== Build lib/librte_jobstats
== Build lib/librte_metrics
== Build lib/librte_bitratestats
== Build lib/librte_latencystats
== Build lib/librte_power
== Build lib/librte_sched
== Build lib/librte_kni
== Build lib/librte_port
== Build lib/librte_table
== Build lib/librte_flow_classify
== Build lib/librte_distributor
== Build lib/librte_pipeline
== Build lib/librte_reorder
== Build lib/librte_pdump
== Build lib/librte_gso
== Build lib/librte_bpf
== Build lib/librte_ipsec
== Build buildtools
== Build buildtools/pmdinfogen
== Build kernel
== Build kernel/linux
== Build kernel/linux/igb_uio
  Building modules, stage 2.
  MODPOST 1 modules
== Build kernel/linux/kni
  Building modules, stage 2.
  MODPOST 1 modules
== Build drivers
== Build drivers/common
== Build drivers/common/cpt
== Build drivers/common/octeontx
== Build drivers/common/dpaax
== Build drivers/bus
== Build drivers/bus/dpaa
== Build drivers/bus/fslmc
== Build drivers/bus/ifpga
== Build drivers/bus/pci
== Build drivers/bus/vdev
== Build drivers/bus/vmbus
== Build drivers/mempool
== Build drivers/mempool/bucket
== Build drivers/mempool/dpaa
== Build drivers/mempool/dpaa2
== Build drivers/mempool/ring
== Build drivers/mempool/stack
== Build drivers/mempool/octeontx
== Build drivers/net
== Build drivers/net/af_packet
== Build drivers/net/af_xdp
  CC rte_eth_af_xdp.o
/var/lib/jenkins/workspace/Apply-Custom-Patch-Set/dpdk/drivers/net/af_xdp/rte_eth_af_xdp.c:14:26: fatal error: linux/if_xdp.h: No such file or directory
 #include <linux/if_xdp.h>
                          ^
compilation terminated.
make[6]: *** [rte_eth_af_xdp.o] Error 1
make[5]: *** [af_xdp] Error 2
make[4]: *** [net] Error 2
make[3]: *** [drivers] Error 2
make[2]: *** [all] Error 2
make[1]: *** [pre_install] Error 2
make: *** [install] Error 2

https://lab.dpdk.org/results/dashboard/patchsets/4926/

UNH-IOL DPDK Performance Test Lab


More information about the test-report mailing list