[dpdk-test-report] |FAILURE| pw51334[v2, 6/6] app/testpmd: add mempool flags parameter

sys_stv at intel.com sys_stv at intel.com
Tue Mar 19 10:00:28 CET 2019


Test-Label: Intel-compilation
Test-Status: FAILURE
http://dpdk.org/patch/51334

_Compilation issues_

Submitter: Xiaolong Ye <xiaolong.ye at intel.com>
Date: 2019-03-19 07:12:56
Reply_mail: 20190319071256.26302-7-xiaolong.ye at intel.com
DPDK git baseline: Repo:dpdk-master, CommitID: 239912fa798e6e671072ca7ff987afd74c1e506c

Build Summary: 26 Builds Done, 4 Successful, 22 Failures

Test environment and configuration as below:

OS: SUSE15
	Kernel Version: 4.12.14-lp150.12.22-default
	CPU info: Intel(R) Xeon(R) CPU E5-2699 v3 @ 2.30GHz
	GCC Version: gcc (SUSE Linux) 7.3.1 20180323 [gcc-7-branch revision 258812]
	Clang Version: 5.0.1 (tags/RELEASE_501/final 312548)
	x86_64-native-linuxapp-gcc

OS: CENTOS76
	Kernel Version: 3.10.0-957.5.1.el7.x86_64
	CPU info: Intel(R) Xeon(R) CPU E5-2699 v4 @ 2.20GHz
	GCC Version: gcc (GCC) 4.8.5 20150623 (Red Hat 4.8.5-36)
	Clang Version: 3.4.2 (tags/RELEASE_34/dot2-final)
	x86_64-native-linuxapp-gcc

OS: UBT144-32
	Kernel Version: 3.13.0-161-generic
	CPU info: Intel(R) Xeon(R) CPU E5-2699 v3 @ 2.30GHz
	GCC Version: gcc (Ubuntu 4.8.4-2ubuntu1~14.04.4) 4.8.4
	Clang Version: NA
	i686-native-linuxapp-gcc

OS: UBT164-32
	Kernel Version: 4.4.0-131-generic
	CPU info: Intel(R) Xeon(R) CPU E5-2699 v3 @ 2.30GHz
	GCC Version: gcc (Ubuntu 5.4.0-6ubuntu1~16.04.10) 5.4.0 20160609
	Clang Version: NA
	i686-native-linuxapp-gcc

OS: SUSE12
	Kernel Version: 4.4.73-5-default
	CPU info: Intel(R) Xeon(R) CPU E5-2699 v4 @ 2.20GHz
	GCC Version: gcc (SUSE Linux) 7.1.1 20170607 [gcc-7-branch revision 248970]
	Clang Version: NA
	x86_64-native-linuxapp-gcc

OS: FreeBSD12.0
	Kernel Version: 12.0-RC3
	CPU info: Intel(R) Xeon(R) CPU E5-2699 v3 @ 2.30GHz (2294.75-MHz K8-class CPU)
	GCC Version: gcc (FreeBSD Ports Collection) 7.3.0
	Clang Version: 6.0.1 (tags/RELEASE_601/final 335540) (based on LLVM 6.0.1)
	x86_64-native-bsdapp-clang
	x86_64-native-bsdapp-gcc

OS: UBT144-64
	Kernel Version: 4.2.0-27-generic
	CPU info: Intel(R) Xeon(R) CPU E5-2699 v3 @ 2.30GHz
	GCC Version: gcc (Ubuntu 4.8.4-2ubuntu1~14.04.4) 4.8.4
	Clang Version: NA
	x86_64-native-linuxapp-gcc

OS: CENTOS75
	Kernel Version: 3.10.0-957.5.1.el7.x86_64
	CPU info: Intel(R) Xeon(R) CPU E5-2699 v4 @ 2.20GHz
	GCC Version: gcc (GCC) 4.8.5 20150623 (Red Hat 4.8.5-36)
	Clang Version: 3.4.2 (tags/RELEASE_34/dot2-final)
	x86_64-native-linuxapp-gcc

OS: UBT1804
	Kernel Version: 4.15.0-20-generic
	CPU info: Intel(R) Xeon(R) CPU E5-2699 v3 @ 2.30GHz
	GCC Version: gcc (Ubuntu 7.3.0-27ubuntu1~18.04) 7.3.0
	Clang Version: NA
	x86_64-native-linuxapp-clang
	x86_64-native-linuxapp-gcc
	x86_64-native-linuxapp-icc

OS: UBT1810
	Kernel Version: 4.18.0-10-generic
	CPU info: Intel(R) Xeon(R) CPU E5-2699 v3 @ 2.30GHz
	GCC Version: gcc (Ubuntu 8.2.0-7ubuntu1) 8.2.0
	Clang Version: NA
	x86_64-native-linuxapp-gcc

OS: RHEL74
	Kernel Version: 3.10.0-693.el7.x86_64
	CPU info: Intel(R) Xeon(R) CPU E5-2699 v4 @ 2.20GHz
	GCC Version: gcc (GCC) 4.8.5 20150623 (Red Hat 4.8.5-16)
	Clang Version: NA
	x86_64-native-linuxapp-gcc

OS: CENTOS74
	Kernel Version: 3.10.0-862.14.4.el7.x86_64
	CPU info: Intel(R) Xeon(R) CPU E5-2699 v4 @ 2.20GHz
	GCC Version: gcc (GCC) 4.8.5 20150623 (Red Hat 4.8.5-28)
	Clang Version: 3.4.2 (tags/RELEASE_34/dot2-final)
	x86_64-native-linuxapp-gcc

OS: FreeBSD11.2
	Kernel Version: 11.2-RELEASE
	CPU info: Intel(R) Xeon(R) CPU E5-2699 v3 @ 2.30GHz (2294.74-MHz K8-class CPU)
	GCC Version: gcc (FreeBSD Ports Collection) 6.4.0
	Clang Version: 6.0.0 (tags/RELEASE_600/final 326565) (based on LLVM 6.0.0)
	x86_64-native-bsdapp-gcc
	x86_64-native-bsdapp-clang

OS: UBT164-64
	Kernel Version: 4.4.0-47-generic
	CPU info: Intel(R) Xeon(R) CPU E5-2699 v3 @ 2.30GHz
	GCC Version: gcc (Ubuntu 5.4.0-6ubuntu1~16.04.10) 5.4.0 20160609
	Clang Version: 3.8.0-2ubuntu4 (tags/RELEASE_380/final)
	x86_64-native-linuxapp-gcc

OS: FC28
	Kernel Version: 4.16.3-301.fc28.x86_64
	CPU info: Intel(R) Xeon(R) CPU E5-2699 v4 @ 2.20GHz
	GCC Version: gcc (GCC) 8.1.1 20180712 (Red Hat 8.1.1-5)
	Clang Version: NA
	x86_64-native-linuxapp-gcc
	x86_64-native-linuxapp-clang
	x86_64-native-linuxapp-icc

OS: RHEL76
	Kernel Version: 3.10.0-957.el7.x86_64
	CPU info: Intel(R) Xeon(R) CPU E5-2699 v4 @ 2.20GHz
	GCC Version: gcc (GCC) 4.8.5 20150623 (Red Hat 4.8.5-36)
	Clang Version: NA
	x86_64-native-linuxapp-gcc

OS: FC29
	Kernel Version: 4.18.16-300.fc29.x86_64
	CPU info: Intel(R) Xeon(R) CPU E5-2699 v4 @ 2.20GHz
	GCC Version: gcc (GCC) 8.2.1 20181215 (Red Hat 8.2.1-6)
	Clang Version: NA
	x86_64-native-linuxapp-gcc
	x86_64-native-linuxapp-clang
	x86_64-native-linuxapp-icc

OS: RHEL75
	Kernel Version: 3.10.0-862.el7.x86_64
	CPU info: Intel(R) Xeon(R) CPU E5-2699 v4 @ 2.20GHz
	GCC Version: gcc (GCC) 4.8.5 20150623 (Red Hat 4.8.5-28)
	Clang Version: NA
	x86_64-native-linuxapp-gcc

*Failed Build #1:
OS: UBT144-64
Target: x86_64-native-linuxapp-gcc
  CC guest_channel.o
  CC rte_power_empty_poll.o
  CC power_pstate_cpufreq.o
  AR librte_mempool.a
  INSTALL-LIB librte_mempool.a
make[5]: warning:  Clock skew detected.  Your build may be incomplete.
== Build lib/librte_mbuf
  AR librte_acl.a
  INSTALL-LIB librte_acl.a
  AR librte_power.a
  INSTALL-LIB librte_power.a
--
  CC rte_mbuf.o
  CC rte_mbuf_ptype.o
  CC rte_mbuf_pool_ops.o
  AR librte_mbuf.a
  INSTALL-LIB librte_mbuf.a
make[5]: warning:  Clock skew detected.  Your build may be incomplete.
== Build lib/librte_cryptodev
== Build lib/librte_net
== Build lib/librte_compressdev
== Build lib/librte_bbdev
== Build lib/librte_reorder
--
  CC rte_table_action.o
  AR librte_flow_classify.a
  INSTALL-LIB librte_flow_classify.a
  AR librte_pipeline.a
  INSTALL-LIB librte_pipeline.a
make[4]: warning:  Clock skew detected.  Your build may be incomplete.
== Build buildtools
== Build kernel
== Build buildtools/pmdinfogen
== Build kernel/linux
  HOSTCC pmdinfogen.o
--
  CC scheduler_pmd.o
  CC scheduler_pmd_ops.o
  LD null_crypto_pmd.o
  PMDINFO otx_cryptodev.o.pmd.c
  CC otx_cryptodev.o.pmd.o
/tmp/UBT144-64_K4.2.0_GCC4.8.4/x86_64-native-linuxapp-gcc/cdbc108b51b74a01a9d20b6af8dba0b6/dpdk/drivers/net/af_xdp/rte_eth_af_xdp.c:14:26: fatal error: linux/if_xdp.h: No such file or directory
 #include <linux/if_xdp.h>
                          ^
compilation terminated.
  LD otx_cryptodev.o
  CC null_crypto_pmd_ops.o

*Failed Build #2:
OS: UBT164-64
Target: x86_64-native-linuxapp-gcc
  CC guest_channel.o
  CC rte_power_empty_poll.o
  CC power_pstate_cpufreq.o
  AR librte_mempool.a
  INSTALL-LIB librte_mempool.a
make[5]: warning:  Clock skew detected.  Your build may be incomplete.
== Build lib/librte_mbuf
make[5]: Warning: File 'rte_mbuf.h' has modification time 17552 s in the future
  SYMLINK-FILE include/rte_mbuf_ptype.h
  SYMLINK-FILE include/rte_mbuf_pool_ops.h
  SYMLINK-FILE include/rte_mbuf.h
--
  CC rte_mbuf_pool_ops.o
  AR librte_power.a
  INSTALL-LIB librte_power.a
  AR librte_mbuf.a
  INSTALL-LIB librte_mbuf.a
make[5]: warning:  Clock skew detected.  Your build may be incomplete.
== Build lib/librte_reorder
== Build lib/librte_compressdev
== Build lib/librte_cryptodev
== Build lib/librte_bbdev
== Build lib/librte_net
--
  CC rte_table_action.o
  AR librte_flow_classify.a
  INSTALL-LIB librte_flow_classify.a
  AR librte_pipeline.a
  INSTALL-LIB librte_pipeline.a
make[4]: warning:  Clock skew detected.  Your build may be incomplete.
== Build buildtools
== Build kernel
== Build kernel/linux
== Build buildtools/pmdinfogen
== Build kernel/linux/igb_uio
--
  CC avp_ethdev.o
  PMDINFO otx_cryptodev.o.pmd.c
  CC otx_cryptodev.o.pmd.o
  LD otx_cryptodev.o
  CC otx_cryptodev_capabilities.o
/tmp/UBT164-64_K4.4.0_GCC5.4.0/x86_64-native-linuxapp-gcc/cdbc108b51b74a01a9d20b6af8dba0b6/dpdk/drivers/net/af_xdp/rte_eth_af_xdp.c:14:26: fatal error: linux/if_xdp.h: No such file or directory
compilation terminated.
/tmp/UBT164-64_K4.4.0_GCC5.4.0/x86_64-native-linuxapp-gcc/cdbc108b51b74a01a9d20b6af8dba0b6/dpdk/mk/internal/rte.compile-pre.mk:114: recipe for target 'rte_eth_af_xdp.o' failed
make[6]: *** [rte_eth_af_xdp.o] Error 1
/tmp/UBT164-64_K4.4.0_GCC5.4.0/x86_64-native-linuxapp-gcc/cdbc108b51b74a01a9d20b6af8dba0b6/dpdk/mk/rte.subdir.mk:35: recipe for target 'af_xdp' failed
make[5]: *** [af_xdp] Error 2
make[5]: *** Waiting for unfinished jobs....
  CC otx_cryptodev_hw_access.o
  PMDINFO otx_zip_pmd.o.pmd.c
  CC otx_zip_pmd.o.pmd.o
--
  CC caam_jr_capabilities.o
  CC virtqueue.o
  CC virtio_pci.o
  AR librte_pmd_axgbe.a
  INSTALL-LIB librte_pmd_axgbe.a
/tmp/UBT164-64_K4.4.0_GCC5.4.0/x86_64-native-linuxapp-gcc/cdbc108b51b74a01a9d20b6af8dba0b6/dpdk/mk/rte.subdir.mk:35: recipe for target 'net' failed
make[4]: *** [net] Error 2
make[4]: *** Waiting for unfinished jobs....
  CC virtio_rxtx.o
  CC caam_jr_hw.o
  CC virtio_cryptodev.o
--
  PMDINFO dpaa2_sec_dpseci.o.pmd.c
  CC dpaa2_sec_dpseci.o.pmd.o
  LD dpaa2_sec_dpseci.o
  AR librte_pmd_dpaa2_sec.a
  INSTALL-LIB librte_pmd_dpaa2_sec.a
/tmp/UBT164-64_K4.4.0_GCC5.4.0/x86_64-native-linuxapp-gcc/cdbc108b51b74a01a9d20b6af8dba0b6/dpdk/mk/rte.sdkbuild.mk:46: recipe for target 'drivers' failed
make[3]: *** [drivers] Error 2
/tmp/UBT164-64_K4.4.0_GCC5.4.0/x86_64-native-linuxapp-gcc/cdbc108b51b74a01a9d20b6af8dba0b6/dpdk/mk/rte.sdkroot.mk:98: recipe for target 'all' failed
make[2]: *** [all] Error 2
/tmp/UBT164-64_K4.4.0_GCC5.4.0/x86_64-native-linuxapp-gcc/cdbc108b51b74a01a9d20b6af8dba0b6/dpdk/mk/rte.sdkinstall.mk:60: recipe for target 'pre_install' failed
make[1]: *** [pre_install] Error 2
/tmp/UBT164-64_K4.4.0_GCC5.4.0/x86_64-native-linuxapp-gcc/cdbc108b51b74a01a9d20b6af8dba0b6/dpdk/mk/rte.sdkroot.mk:77: recipe for target 'install' failed
make: *** [install] Error 2

*Failed Build #3:
OS: UBT164-32
Target: i686-native-linuxapp-gcc
  CC guest_channel.o
  CC rte_power_empty_poll.o
  CC power_pstate_cpufreq.o
  AR librte_mempool.a
  INSTALL-LIB librte_mempool.a
make[5]: warning:  Clock skew detected.  Your build may be incomplete.
== Build lib/librte_mbuf
make[5]: Warning: File 'rte_mbuf.h' has modification time 17553 s in the future
  SYMLINK-FILE include/rte_mbuf.h
  SYMLINK-FILE include/rte_mbuf_ptype.h
  SYMLINK-FILE include/rte_mbuf_pool_ops.h
--
  INSTALL-LIB librte_acl.a
  AR librte_power.a
  INSTALL-LIB librte_power.a
  AR librte_mbuf.a
  INSTALL-LIB librte_mbuf.a
make[5]: warning:  Clock skew detected.  Your build may be incomplete.
== Build lib/librte_bbdev
== Build lib/librte_compressdev
== Build lib/librte_reorder
== Build lib/librte_cryptodev
== Build lib/librte_net
--
  CC rte_flow_classify.o
  AR librte_flow_classify.a
  INSTALL-LIB librte_flow_classify.a
  AR librte_pipeline.a
  INSTALL-LIB librte_pipeline.a
make[4]: warning:  Clock skew detected.  Your build may be incomplete.
== Build buildtools
== Build kernel
== Build buildtools/pmdinfogen
== Build kernel/linux
  HOSTCC pmdinfogen.o
--
  CC rte_eth_af_xdp.o
  CC ark_ethdev.o
  CC scheduler_multicore.o
  CC ark_ethdev_rx.o
  CC virtio_pci.o
/tmp/UBT164-32_K4.4.0_GCC5.4.0/i686-native-linuxapp-gcc/cdbc108b51b74a01a9d20b6af8dba0b6/dpdk/drivers/net/af_xdp/rte_eth_af_xdp.c:14:26: fatal error: linux/if_xdp.h: No such file or directory
compilation terminated.
/tmp/UBT164-32_K4.4.0_GCC5.4.0/i686-native-linuxapp-gcc/cdbc108b51b74a01a9d20b6af8dba0b6/dpdk/mk/internal/rte.compile-pre.mk:114: recipe for target 'rte_eth_af_xdp.o' failed
make[6]: *** [rte_eth_af_xdp.o] Error 1
/tmp/UBT164-32_K4.4.0_GCC5.4.0/i686-native-linuxapp-gcc/cdbc108b51b74a01a9d20b6af8dba0b6/dpdk/mk/rte.subdir.mk:35: recipe for target 'af_xdp' failed
make[5]: *** [af_xdp] Error 2
make[5]: *** Waiting for unfinished jobs....
  CC virtio_rxtx.o
  PMDINFO caam_jr.o.pmd.c
  CC caam_jr.o.pmd.o
--
  LD dpaa_sec.o
  AR librte_pmd_dpaa_sec.a
  AR librte_pmd_virtio_crypto.a
  AR librte_pmd_ark.a
  INSTALL-LIB librte_pmd_ark.a
/tmp/UBT164-32_K4.4.0_GCC5.4.0/i686-native-linuxapp-gcc/cdbc108b51b74a01a9d20b6af8dba0b6/dpdk/mk/rte.subdir.mk:35: recipe for target 'net' failed
make[4]: *** [net] Error 2
make[4]: *** Waiting for unfinished jobs....
  INSTALL-LIB librte_pmd_dpaa_sec.a
  INSTALL-LIB librte_pmd_virtio_crypto.a
  PMDINFO dpaa2_sec_dpseci.o.pmd.c
--
  LD dpaa2_sec_dpseci.o
  AR librte_pmd_dpaa2_sec.a
  INSTALL-LIB librte_pmd_dpaa2_sec.a
  AR librte_pmd_octeontx_crypto.a
  INSTALL-LIB librte_pmd_octeontx_crypto.a
/tmp/UBT164-32_K4.4.0_GCC5.4.0/i686-native-linuxapp-gcc/cdbc108b51b74a01a9d20b6af8dba0b6/dpdk/mk/rte.sdkbuild.mk:46: recipe for target 'drivers' failed
make[3]: *** [drivers] Error 2
/tmp/UBT164-32_K4.4.0_GCC5.4.0/i686-native-linuxapp-gcc/cdbc108b51b74a01a9d20b6af8dba0b6/dpdk/mk/rte.sdkroot.mk:98: recipe for target 'all' failed
make[2]: *** [all] Error 2
/tmp/UBT164-32_K4.4.0_GCC5.4.0/i686-native-linuxapp-gcc/cdbc108b51b74a01a9d20b6af8dba0b6/dpdk/mk/rte.sdkinstall.mk:60: recipe for target 'pre_install' failed
make[1]: *** [pre_install] Error 2
/tmp/UBT164-32_K4.4.0_GCC5.4.0/i686-native-linuxapp-gcc/cdbc108b51b74a01a9d20b6af8dba0b6/dpdk/mk/rte.sdkroot.mk:77: recipe for target 'install' failed
make: *** [install] Error 2

*Failed Build #4:
OS: UBT1804
Target: x86_64-native-linuxapp-clang
  CC rte_power_empty_poll.o
  CC cmdline_socket.o
  CC cmdline_parse_portlist.o
  AR librte_mempool.a
  INSTALL-LIB librte_mempool.a
make[5]: warning:  Clock skew detected.  Your build may be incomplete.
== Build lib/librte_mbuf
  AR librte_cmdline.a
  INSTALL-LIB librte_cmdline.a
make[5]: Warning: File 'rte_mbuf.h' has modification time 17613 s in the future
  CC rte_mbuf.o
--
== Build lib/librte_efd
== Build lib/librte_lpm
== Build lib/librte_member
  AR librte_mbuf.a
  INSTALL-LIB librte_mbuf.a
make[5]: warning:  Clock skew detected.  Your build may be incomplete.
== Build lib/librte_bbdev
== Build lib/librte_net
== Build lib/librte_compressdev
== Build lib/librte_reorder
== Build lib/librte_cryptodev
--
  CC rte_table_action.o
  AR librte_flow_classify.a
  INSTALL-LIB librte_flow_classify.a
  AR librte_pipeline.a
  INSTALL-LIB librte_pipeline.a
make[4]: warning:  Clock skew detected.  Your build may be incomplete.
== Build buildtools
== Build kernel
== Build buildtools/pmdinfogen
== Build kernel/linux
  HOSTCC pmdinfogen.o
--
  CC caam_jr_hw.o
  INSTALL-LIB librte_pmd_octeontx_zip.a
  CC otx_cryptodev_ops.o
  CC caam_jr_uio.o
  CC virtqueue.o
/tmp/UBT1804_K4.15.0_Clang6.0.0/x86_64-native-linuxapp-clang/cdbc108b51b74a01a9d20b6af8dba0b6/dpdk/drivers/net/af_xdp/rte_eth_af_xdp.c:14:10: fatal error: 'linux/if_xdp.h' file not found
#include <linux/if_xdp.h>
         ^~~~~~~~~~~~~~~~
1 error generated.
/tmp/UBT1804_K4.15.0_Clang6.0.0/x86_64-native-linuxapp-clang/cdbc108b51b74a01a9d20b6af8dba0b6/dpdk/mk/internal/rte.compile-pre.mk:114: recipe for target 'rte_eth_af_xdp.o' failed
make[6]: *** [rte_eth_af_xdp.o] Error 1
/tmp/UBT1804_K4.15.0_Clang6.0.0/x86_64-native-linuxapp-clang/cdbc108b51b74a01a9d20b6af8dba0b6/dpdk/mk/rte.subdir.mk:35: recipe for target 'af_xdp' failed
make[5]: *** [af_xdp] Error 2
/tmp/UBT1804_K4.15.0_Clang6.0.0/x86_64-native-linuxapp-clang/cdbc108b51b74a01a9d20b6af8dba0b6/dpdk/mk/rte.subdir.mk:35: recipe for target 'net' failed
make[4]: *** [net] Error 2
make[4]: *** Waiting for unfinished jobs....
  CC virtio_pci.o
  CC qat_logs.o
  CC qat_qp.o
--
  PMDINFO dpaa2_sec_dpseci.o.pmd.c
  CC dpaa2_sec_dpseci.o.pmd.o
  LD dpaa2_sec_dpseci.o
  AR librte_pmd_dpaa2_sec.a
  INSTALL-LIB librte_pmd_dpaa2_sec.a
/tmp/UBT1804_K4.15.0_Clang6.0.0/x86_64-native-linuxapp-clang/cdbc108b51b74a01a9d20b6af8dba0b6/dpdk/mk/rte.sdkbuild.mk:46: recipe for target 'drivers' failed
make[3]: *** [drivers] Error 2
/tmp/UBT1804_K4.15.0_Clang6.0.0/x86_64-native-linuxapp-clang/cdbc108b51b74a01a9d20b6af8dba0b6/dpdk/mk/rte.sdkroot.mk:98: recipe for target 'all' failed
make[2]: *** [all] Error 2
/tmp/UBT1804_K4.15.0_Clang6.0.0/x86_64-native-linuxapp-clang/cdbc108b51b74a01a9d20b6af8dba0b6/dpdk/mk/rte.sdkinstall.mk:60: recipe for target 'pre_install' failed
make[1]: *** [pre_install] Error 2
/tmp/UBT1804_K4.15.0_Clang6.0.0/x86_64-native-linuxapp-clang/cdbc108b51b74a01a9d20b6af8dba0b6/dpdk/mk/rte.sdkroot.mk:77: recipe for target 'install' failed
make: *** [install] Error 2

*Failed Build #5:
OS: UBT1804
Target: x86_64-native-linuxapp-gcc
  CC power_pstate_cpufreq.o
  AR librte_acl.a
  INSTALL-LIB librte_acl.a
  AR librte_mempool.a
  INSTALL-LIB librte_mempool.a
make[5]: warning:  Clock skew detected.  Your build may be incomplete.
== Build lib/librte_mbuf
make[5]: Warning: File 'rte_mbuf.h' has modification time 17608 s in the future
  SYMLINK-FILE include/rte_mbuf.h
  SYMLINK-FILE include/rte_mbuf_pool_ops.h
  SYMLINK-FILE include/rte_mbuf_ptype.h
--
  CC rte_mbuf_ptype.o
  AR librte_power.a
  INSTALL-LIB librte_power.a
  AR librte_mbuf.a
  INSTALL-LIB librte_mbuf.a
make[5]: warning:  Clock skew detected.  Your build may be incomplete.
== Build lib/librte_net
== Build lib/librte_bbdev
== Build lib/librte_cryptodev
== Build lib/librte_compressdev
== Build lib/librte_reorder
--
  CC rte_table_action.o
  AR librte_flow_classify.a
  INSTALL-LIB librte_flow_classify.a
  AR librte_pipeline.a
  INSTALL-LIB librte_pipeline.a
make[4]: warning:  Clock skew detected.  Your build may be incomplete.
== Build buildtools
== Build kernel
== Build kernel/linux
== Build buildtools/pmdinfogen
  HOSTCC pmdinfogen.o
--
== Build drivers/net/ark
  AR librte_pmd_dpaa_sec.a
  INSTALL-LIB librte_pmd_dpaa_sec.a
== Build drivers/net/atlantic
== Build drivers/net/avp
/tmp/UBT1804_K4.15.0_GCC7.3.0/x86_64-native-linuxapp-gcc/cdbc108b51b74a01a9d20b6af8dba0b6/dpdk/drivers/net/af_xdp/rte_eth_af_xdp.c:14:10: fatal error: linux/if_xdp.h: No such file or directory
 #include <linux/if_xdp.h>
          ^~~~~~~~~~~~~~~~
compilation terminated.
/tmp/UBT1804_K4.15.0_GCC7.3.0/x86_64-native-linuxapp-gcc/cdbc108b51b74a01a9d20b6af8dba0b6/dpdk/mk/internal/rte.compile-pre.mk:114: recipe for target 'rte_eth_af_xdp.o' failed
make[6]: *** [rte_eth_af_xdp.o] Error 1
/tmp/UBT1804_K4.15.0_GCC7.3.0/x86_64-native-linuxapp-gcc/cdbc108b51b74a01a9d20b6af8dba0b6/dpdk/mk/rte.subdir.mk:35: recipe for target 'af_xdp' failed
make[5]: *** [af_xdp] Error 2
make[5]: *** Waiting for unfinished jobs....
  CC scheduler_multicore.o
  CC virtio_pci.o
  CC virtqueue.o
--
  PMDINFO avp_ethdev.o.pmd.c
  CC avp_ethdev.o.pmd.o
  LD avp_ethdev.o
  AR librte_pmd_avp.a
  INSTALL-LIB librte_pmd_avp.a
/tmp/UBT1804_K4.15.0_GCC7.3.0/x86_64-native-linuxapp-gcc/cdbc108b51b74a01a9d20b6af8dba0b6/dpdk/mk/rte.subdir.mk:35: recipe for target 'net' failed
make[4]: *** [net] Error 2
/tmp/UBT1804_K4.15.0_GCC7.3.0/x86_64-native-linuxapp-gcc/cdbc108b51b74a01a9d20b6af8dba0b6/dpdk/mk/rte.sdkbuild.mk:46: recipe for target 'drivers' failed
make[3]: *** [drivers] Error 2
/tmp/UBT1804_K4.15.0_GCC7.3.0/x86_64-native-linuxapp-gcc/cdbc108b51b74a01a9d20b6af8dba0b6/dpdk/mk/rte.sdkroot.mk:98: recipe for target 'all' failed
make[2]: *** [all] Error 2
/tmp/UBT1804_K4.15.0_GCC7.3.0/x86_64-native-linuxapp-gcc/cdbc108b51b74a01a9d20b6af8dba0b6/dpdk/mk/rte.sdkinstall.mk:60: recipe for target 'pre_install' failed
make[1]: *** [pre_install] Error 2
/tmp/UBT1804_K4.15.0_GCC7.3.0/x86_64-native-linuxapp-gcc/cdbc108b51b74a01a9d20b6af8dba0b6/dpdk/mk/rte.sdkroot.mk:77: recipe for target 'install' failed
make: *** [install] Error 2

*Failed Build #6:
OS: UBT1804
Target: x86_64-native-linuxapp-icc
  CC rte_fbk_hash.o
  AR librte_power.a
  INSTALL-LIB librte_power.a
  AR librte_mempool.a
  INSTALL-LIB librte_mempool.a
make[5]: warning:  Clock skew detected.  Your build may be incomplete.
== Build lib/librte_mbuf
make[5]: Warning: File 'rte_mbuf.h' has modification time 17601 s in the future
  SYMLINK-FILE include/rte_mbuf_ptype.h
  SYMLINK-FILE include/rte_mbuf.h
  SYMLINK-FILE include/rte_mbuf_pool_ops.h
  CC rte_mbuf_pool_ops.o
  CC rte_mbuf.o
  CC rte_mbuf_ptype.o
  AR librte_mbuf.a
  INSTALL-LIB librte_mbuf.a
make[5]: warning:  Clock skew detected.  Your build may be incomplete.
== Build lib/librte_net
== Build lib/librte_bbdev
== Build lib/librte_cryptodev
== Build lib/librte_reorder
== Build lib/librte_compressdev
--
  CC rte_table_action.o
  AR librte_flow_classify.a
  INSTALL-LIB librte_flow_classify.a
  AR librte_pipeline.a
  INSTALL-LIB librte_pipeline.a
make[4]: warning:  Clock skew detected.  Your build may be incomplete.
== Build kernel
== Build buildtools
== Build kernel/linux
== Build buildtools/pmdinfogen
== Build kernel/linux/kni
--
  CC rte_cryptodev_scheduler.o
  CC otx_zip.o
  LD otx_cryptodev.o
  AR librte_pmd_qat.a
  INSTALL-LIB librte_pmd_qat.a
/tmp/UBT1804_K4.15.0_ICC19.0.0/x86_64-native-linuxapp-icc/cdbc108b51b74a01a9d20b6af8dba0b6/dpdk/drivers/net/af_xdp/rte_eth_af_xdp.c(14): catastrophic error: cannot open source file "linux/if_xdp.h"
  #include <linux/if_xdp.h>
                           ^

compilation aborted for /tmp/UBT1804_K4.15.0_ICC19.0.0/x86_64-native-linuxapp-icc/cdbc108b51b74a01a9d20b6af8dba0b6/dpdk/drivers/net/af_xdp/rte_eth_af_xdp.c (code 4)
/tmp/UBT1804_K4.15.0_ICC19.0.0/x86_64-native-linuxapp-icc/cdbc108b51b74a01a9d20b6af8dba0b6/dpdk/mk/internal/rte.compile-pre.mk:114: recipe for target 'rte_eth_af_xdp.o' failed
make[6]: *** [rte_eth_af_xdp.o] Error 4
/tmp/UBT1804_K4.15.0_ICC19.0.0/x86_64-native-linuxapp-icc/cdbc108b51b74a01a9d20b6af8dba0b6/dpdk/mk/rte.subdir.mk:35: recipe for target 'af_xdp' failed
make[5]: *** [af_xdp] Error 2
make[5]: *** Waiting for unfinished jobs....
  CC otx_cryptodev_capabilities.o
  CC otx_cryptodev_hw_access.o
  CC otx_cryptodev_mbox.o
--
  AR librte_pmd_af_packet.a
  INSTALL-LIB librte_pmd_null_crypto.a
  INSTALL-LIB librte_pmd_af_packet.a
== Build drivers/crypto/caam_jr
  CC scheduler_pkt_size_distr.o
/tmp/UBT1804_K4.15.0_ICC19.0.0/x86_64-native-linuxapp-icc/cdbc108b51b74a01a9d20b6af8dba0b6/dpdk/mk/rte.subdir.mk:35: recipe for target 'net' failed
make[4]: *** [net] Error 2
make[4]: *** Waiting for unfinished jobs....
== Build drivers/crypto/virtio
  CC otx_cryptodev_ops.o
  CC scheduler_failover.o
--
  LD caam_jr.o
  AR librte_pmd_caam_jr.a
  INSTALL-LIB librte_pmd_caam_jr.a
  AR librte_pmd_octeontx_crypto.a
  INSTALL-LIB librte_pmd_octeontx_crypto.a
/tmp/UBT1804_K4.15.0_ICC19.0.0/x86_64-native-linuxapp-icc/cdbc108b51b74a01a9d20b6af8dba0b6/dpdk/mk/rte.sdkbuild.mk:46: recipe for target 'drivers' failed
make[3]: *** [drivers] Error 2
/tmp/UBT1804_K4.15.0_ICC19.0.0/x86_64-native-linuxapp-icc/cdbc108b51b74a01a9d20b6af8dba0b6/dpdk/mk/rte.sdkroot.mk:98: recipe for target 'all' failed
make[2]: *** [all] Error 2
/tmp/UBT1804_K4.15.0_ICC19.0.0/x86_64-native-linuxapp-icc/cdbc108b51b74a01a9d20b6af8dba0b6/dpdk/mk/rte.sdkinstall.mk:60: recipe for target 'pre_install' failed
make[1]: *** [pre_install] Error 2
/tmp/UBT1804_K4.15.0_ICC19.0.0/x86_64-native-linuxapp-icc/cdbc108b51b74a01a9d20b6af8dba0b6/dpdk/mk/rte.sdkroot.mk:77: recipe for target 'install' failed
make: *** [install] Error 2

*Failed Build #7:
OS: UBT1810
Target: x86_64-native-linuxapp-gcc
  CC rte_fbk_hash.o
  AR librte_power.a
  INSTALL-LIB librte_power.a
  AR librte_mempool.a
  INSTALL-LIB librte_mempool.a
make[5]: warning:  Clock skew detected.  Your build may be incomplete.
== Build lib/librte_mbuf
make[5]: Warning: File 'rte_mbuf.h' has modification time 17597 s in the future
  SYMLINK-FILE include/rte_mbuf_ptype.h
  SYMLINK-FILE include/rte_mbuf.h
  SYMLINK-FILE include/rte_mbuf_pool_ops.h
--
== Build lib/librte_efd
== Build lib/librte_lpm
== Build lib/librte_member
  AR librte_mbuf.a
  INSTALL-LIB librte_mbuf.a
make[5]: warning:  Clock skew detected.  Your build may be incomplete.
== Build lib/librte_net
== Build lib/librte_bbdev
== Build lib/librte_cryptodev
== Build lib/librte_compressdev
== Build lib/librte_reorder
--
  CC rte_table_action.o
  AR librte_flow_classify.a
  INSTALL-LIB librte_flow_classify.a
  AR librte_pipeline.a
  INSTALL-LIB librte_pipeline.a
make[4]: warning:  Clock skew detected.  Your build may be incomplete.
== Build kernel
== Build buildtools
== Build kernel/linux
== Build buildtools/pmdinfogen
== Build kernel/linux/kni
--
  CC qat_device.o
  CC null_crypto_pmd.o
  SYMLINK-FILE include/rte_cryptodev_scheduler.h
  CC scheduler_pmd.o
  CC ark_ethdev.o
/tmp/UBT1810_K4.18.0_GCC8.2.0/x86_64-native-linuxapp-gcc/cdbc108b51b74a01a9d20b6af8dba0b6/dpdk/drivers/net/af_xdp/rte_eth_af_xdp.c:16:10: fatal error: asm/barrier.h: No such file or directory
 #include <asm/barrier.h>
          ^~~~~~~~~~~~~~~
compilation terminated.
make[6]: *** [/tmp/UBT1810_K4.18.0_GCC8.2.0/x86_64-native-linuxapp-gcc/cdbc108b51b74a01a9d20b6af8dba0b6/dpdk/mk/internal/rte.compile-pre.mk:116: rte_eth_af_xdp.o] Error 1
make[5]: *** [/tmp/UBT1810_K4.18.0_GCC8.2.0/x86_64-native-linuxapp-gcc/cdbc108b51b74a01a9d20b6af8dba0b6/dpdk/mk/rte.subdir.mk:37: af_xdp] Error 2

*Failed Build #8:
OS: UBT144-32
Target: i686-native-linuxapp-gcc
  CC power_pstate_cpufreq.o
  AR librte_acl.a
  INSTALL-LIB librte_acl.a
  AR librte_mempool.a
  INSTALL-LIB librte_mempool.a
make[5]: warning:  Clock skew detected.  Your build may be incomplete.
== Build lib/librte_mbuf
  AR librte_power.a
  INSTALL-LIB librte_power.a
make[5]: Warning: File `rte_mbuf.h' has modification time 1.8e+04 s in the future
  SYMLINK-FILE include/rte_mbuf.h
--
  CC rte_mbuf.o
  CC rte_mbuf_ptype.o
  CC rte_mbuf_pool_ops.o
  AR librte_mbuf.a
  INSTALL-LIB librte_mbuf.a
make[5]: warning:  Clock skew detected.  Your build may be incomplete.
== Build lib/librte_net
== Build lib/librte_bbdev
== Build lib/librte_compressdev
== Build lib/librte_reorder
== Build lib/librte_cryptodev
--
  CC rte_table_action.o
  AR librte_flow_classify.a
  INSTALL-LIB librte_flow_classify.a
  AR librte_pipeline.a
  INSTALL-LIB librte_pipeline.a
make[4]: warning:  Clock skew detected.  Your build may be incomplete.
== Build buildtools
== Build kernel
== Build kernel/linux
== Build buildtools/pmdinfogen
== Build kernel/linux/igb_uio
--
  CC otx_zip_pmd.o
  CC rte_eth_bond_api.o
  CC otx_cryptodev.o
  CC bbdev_null.o
  CC atl_rxtx.o
/tmp/UBT144-32_K3.13.0_GCC4.8.4/i686-native-linuxapp-gcc/cdbc108b51b74a01a9d20b6af8dba0b6/dpdk/drivers/net/af_xdp/rte_eth_af_xdp.c:14:26: fatal error: linux/if_xdp.h: No such file or directory
 #include <linux/if_xdp.h>
                          ^
compilation terminated.
  CC qat_device.o
  CC ark_ethdev.o

*Failed Build #9:
OS: RHEL75
Target: x86_64-native-linuxapp-gcc
== Build drivers/net/axgbe
  INSTALL-LIB librte_pmd_crypto_scheduler.a
== Build drivers/net/bonding
  CC rte_eth_af_xdp.o
  CC virtqueue.o
/tmp/RHEL75_K3.10.0_GCC4.8.5/x86_64-native-linuxapp-gcc/cdbc108b51b74a01a9d20b6af8dba0b6/dpdk/drivers/net/af_xdp/rte_eth_af_xdp.c:14:26: fatal error: linux/if_xdp.h: No such file or directory
 #include <linux/if_xdp.h>
                          ^
compilation terminated.
  PMDINFO dpaa_sec.o.pmd.c
  CC dpaa_sec.o.pmd.o

*Failed Build #10:
OS: FC28
Target: x86_64-native-linuxapp-gcc
  LD otx_cryptodev.o
  CC atl_ethdev.o
  CC avp_ethdev.o
In file included from /lib/modules/4.18.13-200.fc28.x86_64/build/tools/include/asm/barrier.h:3,
                 from /tmp/FC28_K4.16.3_GCC8.0.1/x86_64-native-linuxapp-gcc/cdbc108b51b74a01a9d20b6af8dba0b6/dpdk/drivers/net/af_xdp/rte_eth_af_xdp.c:16:
/lib/modules/4.18.13-200.fc28.x86_64/build/tools/include/../../arch/x86/include/asm/barrier.h:5:10: fatal error: asm/alternative.h: No such file or directory
 #include <asm/alternative.h>
          ^~~~~~~~~~~~~~~~~~~
compilation terminated.
  AR librte_pmd_octeontx_zip.a
make[6]: *** [/tmp/FC28_K4.16.3_GCC8.0.1/x86_64-native-linuxapp-gcc/cdbc108b51b74a01a9d20b6af8dba0b6/dpdk/mk/internal/rte.compile-pre.mk:116: rte_eth_af_xdp.o] Error 1

*Failed Build #11:
OS: FC28
Target: x86_64-native-linuxapp-clang
== Build drivers/net/avp
  PMDINFO otx_cryptodev.o.pmd.c
  CC otx_cryptodev.o.pmd.o
In file included from /tmp/FC28_K4.16.3_Clang6.0.1/x86_64-native-linuxapp-clang/cdbc108b51b74a01a9d20b6af8dba0b6/dpdk/drivers/net/af_xdp/rte_eth_af_xdp.c:16:
In file included from /lib/modules/4.18.13-200.fc28.x86_64/build/tools/include/asm/barrier.h:3:
/lib/modules/4.18.13-200.fc28.x86_64/build/tools/include/../../arch/x86/include/asm/barrier.h:5:10: fatal error: 'asm/alternative.h' file not found
#include <asm/alternative.h>
         ^~~~~~~~~~~~~~~~~~~
1 error generated.
make[6]: *** [/tmp/FC28_K4.16.3_Clang6.0.1/x86_64-native-linuxapp-clang/cdbc108b51b74a01a9d20b6af8dba0b6/dpdk/mk/internal/rte.compile-pre.mk:116: rte_eth_af_xdp.o] Error 1
make[5]: *** [/tmp/FC28_K4.16.3_Clang6.0.1/x86_64-native-linuxapp-clang/cdbc108b51b74a01a9d20b6af8dba0b6/dpdk/mk/rte.subdir.mk:36: af_xdp] Error 2
make[5]: *** Waiting for unfinished jobs....
== Build drivers/net/axgbe
  CC otx_cryptodev_hw_access.o

*Failed Build #12:
OS: SUSE15
Target: x86_64-native-linuxapp-gcc
  CC rte_mempool_ops_default.o
  CC rte_power_empty_poll.o
  CC power_pstate_cpufreq.o
  AR librte_mempool.a
  INSTALL-LIB librte_mempool.a
make[5]: warning:  Clock skew detected.  Your build may be incomplete.
== Build lib/librte_mbuf
  AR librte_acl.a
  INSTALL-LIB librte_acl.a
  AR librte_power.a
  INSTALL-LIB librte_power.a
--
== Build lib/librte_efd
== Build lib/librte_lpm
== Build lib/librte_member
  AR librte_mbuf.a
  INSTALL-LIB librte_mbuf.a
make[5]: warning:  Clock skew detected.  Your build may be incomplete.
== Build lib/librte_net
== Build lib/librte_bbdev
== Build lib/librte_cryptodev
== Build lib/librte_compressdev
== Build lib/librte_reorder
--
  CC rte_table_action.o
  AR librte_flow_classify.a
  INSTALL-LIB librte_flow_classify.a
  AR librte_pipeline.a
  INSTALL-LIB librte_pipeline.a
make[4]: warning:  Clock skew detected.  Your build may be incomplete.
== Build buildtools
== Build kernel
== Build kernel/linux
== Build buildtools/pmdinfogen
== Build kernel/linux/igb_uio
--
  CC otx_zip_pmd.o
  LD otx_cryptodev.o
  CC otx_cryptodev_capabilities.o
  PMDINFO null_crypto_pmd.o.pmd.c
  CC null_crypto_pmd.o.pmd.o
/tmp/SUSE15_K4.12.14_GCC7.3.1/x86_64-native-linuxapp-gcc/cdbc108b51b74a01a9d20b6af8dba0b6/dpdk/drivers/net/af_xdp/rte_eth_af_xdp.c:14:10: fatal error: linux/if_xdp.h: No such file or directory
 #include <linux/if_xdp.h>
          ^~~~~~~~~~~~~~~~
compilation terminated.
make[6]: *** [/tmp/SUSE15_K4.12.14_GCC7.3.1/x86_64-native-linuxapp-gcc/cdbc108b51b74a01a9d20b6af8dba0b6/dpdk/mk/internal/rte.compile-pre.mk:116: rte_eth_af_xdp.o] Error 1
make[5]: *** [/tmp/SUSE15_K4.12.14_GCC7.3.1/x86_64-native-linuxapp-gcc/cdbc108b51b74a01a9d20b6af8dba0b6/dpdk/mk/rte.subdir.mk:35: af_xdp] Error 2

*Failed Build #13:
OS: RHEL76
Target: x86_64-native-linuxapp-gcc
  CC scheduler_pmd.o
  CC rte_eth_af_xdp.o
  CC dpaa2_sec_dpseci.o
  CC qat_common.o
  CC otx_cryptodev.o
/tmp/RHEL76_K3.10.0_GCC4.8.5/x86_64-native-linuxapp-gcc/cdbc108b51b74a01a9d20b6af8dba0b6/dpdk/drivers/net/af_xdp/rte_eth_af_xdp.c:14:26: fatal error: linux/if_xdp.h: No such file or directory
 #include <linux/if_xdp.h>
                          ^
compilation terminated.
  CC ark_ethdev.o
  PMDINFO otx_zip_pmd.o.pmd.c

*Failed Build #14:
OS: FC29
Target: x86_64-native-linuxapp-gcc
  CC caam_jr.o.pmd.o
  LD caam_jr.o
== Build drivers/net/atlantic
In file included from /lib/modules/4.20.13-200.fc29.x86_64/build/tools/include/asm/barrier.h:4,
                 from /tmp/FC29_K4.20_GCC8.0.1/x86_64-native-linuxapp-gcc/cdbc108b51b74a01a9d20b6af8dba0b6/dpdk/drivers/net/af_xdp/rte_eth_af_xdp.c:16:
/lib/modules/4.20.13-200.fc29.x86_64/build/tools/include/../../arch/x86/include/asm/barrier.h:5:10: fatal error: asm/alternative.h: No such file or directory
 #include <asm/alternative.h>
          ^~~~~~~~~~~~~~~~~~~
compilation terminated.
make[6]: *** [/tmp/FC29_K4.20_GCC8.0.1/x86_64-native-linuxapp-gcc/cdbc108b51b74a01a9d20b6af8dba0b6/dpdk/mk/internal/rte.compile-pre.mk:116: rte_eth_af_xdp.o] Error 1
make[5]: *** [/tmp/FC29_K4.20_GCC8.0.1/x86_64-native-linuxapp-gcc/cdbc108b51b74a01a9d20b6af8dba0b6/dpdk/mk/rte.subdir.mk:37: af_xdp] Error 2

*Failed Build #15:
OS: FC29
Target: x86_64-native-linuxapp-clang
  CC bbdev_null.o.pmd.o
  CC otx_zip_pmd.o.pmd.o
  LD otx_cryptodev.o
In file included from /tmp/FC29_K4.20_Clang6.0.1/x86_64-native-linuxapp-clang/cdbc108b51b74a01a9d20b6af8dba0b6/dpdk/drivers/net/af_xdp/rte_eth_af_xdp.c:16:
In file included from /lib/modules/4.20.13-200.fc29.x86_64/build/tools/include/asm/barrier.h:4:
/lib/modules/4.20.13-200.fc29.x86_64/build/tools/include/../../arch/x86/include/asm/barrier.h:5:10: fatal error: 'asm/alternative.h' file not found
#include <asm/alternative.h>
         ^~~~~~~~~~~~~~~~~~~
1 error generated.
make[6]: *** [/tmp/FC29_K4.20_Clang6.0.1/x86_64-native-linuxapp-clang/cdbc108b51b74a01a9d20b6af8dba0b6/dpdk/mk/internal/rte.compile-pre.mk:116: rte_eth_af_xdp.o] Error 1
make[5]: *** [/tmp/FC29_K4.20_Clang6.0.1/x86_64-native-linuxapp-clang/cdbc108b51b74a01a9d20b6af8dba0b6/dpdk/mk/rte.subdir.mk:35: af_xdp] Error 2
make[5]: *** Waiting for unfinished jobs....
  CC otx_cryptodev_capabilities.o
  CC mc/dpseci.o

*Failed Build #16:
OS: FC29
Target: x86_64-native-linuxapp-icc
  LD otx_zip_pmd.o
  CC dpaa2_sec_dpseci.o
  LD bbdev_null.o
In file included from /lib/modules/4.18.16-300.fc29.x86_64/build/tools/include/asm/barrier.h(3),
                 from /tmp/FC29_K4.20_ICC19.0.0/x86_64-native-linuxapp-icc/cdbc108b51b74a01a9d20b6af8dba0b6/dpdk/drivers/net/af_xdp/rte_eth_af_xdp.c(16):
/lib/modules/4.18.16-300.fc29.x86_64/build/tools/include/../../arch/x86/include/asm/barrier.h(5): catastrophic error: cannot open source file "asm/alternative.h"
  #include <asm/alternative.h>
                              ^

compilation aborted for /tmp/FC29_K4.20_ICC19.0.0/x86_64-native-linuxapp-icc/cdbc108b51b74a01a9d20b6af8dba0b6/dpdk/drivers/net/af_xdp/rte_eth_af_xdp.c (code 4)
make[6]: *** [/tmp/FC29_K4.20_ICC19.0.0/x86_64-native-linuxapp-icc/cdbc108b51b74a01a9d20b6af8dba0b6/dpdk/mk/internal/rte.compile-pre.mk:116: rte_eth_af_xdp.o] Error 4

*Failed Build #17:
OS: CENTOS75
Target: x86_64-native-linuxapp-gcc
== Build drivers/net/axgbe
  AR librte_pmd_crypto_scheduler.a
  INSTALL-LIB librte_pmd_crypto_scheduler.a
== Build drivers/net/bonding
  CC rte_eth_af_xdp.o
/tmp/CENTOS75_K3.10.0_GCC4.8.5/x86_64-native-linuxapp-gcc/cdbc108b51b74a01a9d20b6af8dba0b6/dpdk/drivers/net/af_xdp/rte_eth_af_xdp.c:14:26: fatal error: linux/if_xdp.h: No such file or directory
 #include <linux/if_xdp.h>
                          ^
compilation terminated.
  CC virtqueue.o
make[6]: *** [rte_eth_af_xdp.o] Error 1

*Failed Build #18:
OS: CENTOS74
Target: x86_64-native-linuxapp-gcc
  CC null_crypto_pmd.o
  PMDINFO otx_cryptodev.o.pmd.c
  CC otx_cryptodev.o.pmd.o
  LD otx_cryptodev.o
  CC otx_cryptodev_capabilities.o
/tmp/CENTOS74_K3.10.0_GCC4.8.5/x86_64-native-linuxapp-gcc/cdbc108b51b74a01a9d20b6af8dba0b6/dpdk/drivers/net/af_xdp/rte_eth_af_xdp.c:14:26: fatal error: linux/if_xdp.h: No such file or directory
 #include <linux/if_xdp.h>
                          ^
compilation terminated.
  CC otx_cryptodev_hw_access.o
  CC ark_ethdev.o

*Failed Build #19:
OS: RHEL74
Target: x86_64-native-linuxapp-gcc
  CC otx_cryptodev.o.pmd.o
  CC qat_common.o
  LD bbdev_null.o
  LD otx_cryptodev.o
  CC ark_ethdev.o
/tmp/RHEL74_K3.10.0_GCC4.8.5/x86_64-native-linuxapp-gcc/cdbc108b51b74a01a9d20b6af8dba0b6/dpdk/drivers/net/af_xdp/rte_eth_af_xdp.c:14:26: fatal error: linux/if_xdp.h: No such file or directory
 #include <linux/if_xdp.h>
                          ^
compilation terminated.
  PMDINFO null_crypto_pmd.o.pmd.c
  AR librte_pmd_bbdev_null.a

*Failed Build #20:
OS: FC28
Target: x86_64-native-linuxapp-icc
== Build drivers/bus/ifpga
== Build drivers/bus/pci
== Build drivers/bus/vdev
== Build drivers/bus/vmbus
  Building modules, stage 2.
/tmp/FC28_K4.16.3_ICC19.0.0/x86_64-native-linuxapp-icc/cdbc108b51b74a01a9d20b6af8dba0b6/dpdk/x86_64-native-linuxapp-icc/build/kernel/linux/kni/kni_misc.o: warning: objtool: kni_ioctl_release()+0x60: sibling call from callable instruction with modified stack frame
/tmp/FC28_K4.16.3_ICC19.0.0/x86_64-native-linuxapp-icc/cdbc108b51b74a01a9d20b6af8dba0b6/dpdk/x86_64-native-linuxapp-icc/build/kernel/linux/kni/kni_misc.o: warning: objtool: kni_ioctl()+0x2d: sibling call from callable instruction with modified stack frame
/tmp/FC28_K4.16.3_ICC19.0.0/x86_64-native-linuxapp-icc/cdbc108b51b74a01a9d20b6af8dba0b6/dpdk/x86_64-native-linuxapp-icc/build/kernel/linux/kni/kni_misc.o: warning: objtool: kni_ioctl.cold.6()+0xc: sibling call from callable instruction with modified stack frame
/tmp/FC28_K4.16.3_ICC19.0.0/x86_64-native-linuxapp-icc/cdbc108b51b74a01a9d20b6af8dba0b6/dpdk/x86_64-native-linuxapp-icc/build/kernel/linux/kni/kni_net.o: warning: objtool: kni_fifo_trans_pa2va()+0x167: sibling call from callable instruction with modified stack frame
/tmp/FC28_K4.16.3_ICC19.0.0/x86_64-native-linuxapp-icc/cdbc108b51b74a01a9d20b6af8dba0b6/dpdk/x86_64-native-linuxapp-icc/build/kernel/linux/kni/kni_net.o: warning: objtool: kni_net_rx_lo_fifo_skb()+0x326: sibling call from callable instruction with modified stack frame
/tmp/FC28_K4.16.3_ICC19.0.0/x86_64-native-linuxapp-icc/cdbc108b51b74a01a9d20b6af8dba0b6/dpdk/x86_64-native-linuxapp-icc/build/kernel/linux/kni/kni_net.o: warning: objtool: kni_net_process_request()+0x2d: sibling call from callable instruction with modified stack frame
/tmp/FC28_K4.16.3_ICC19.0.0/x86_64-native-linuxapp-icc/cdbc108b51b74a01a9d20b6af8dba0b6/dpdk/x86_64-native-linuxapp-icc/build/kernel/linux/kni/kni_net.o: warning: objtool: kni_net_set_mac()+0x1a6: sibling call from callable instruction with modified stack frame
/tmp/FC28_K4.16.3_ICC19.0.0/x86_64-native-linuxapp-icc/cdbc108b51b74a01a9d20b6af8dba0b6/dpdk/x86_64-native-linuxapp-icc/build/kernel/linux/kni/kni_net.o: warning: objtool: kni_net_rx_lo_fifo()+0x31c: sibling call from callable instruction with modified stack frame
/tmp/FC28_K4.16.3_ICC19.0.0/x86_64-native-linuxapp-icc/cdbc108b51b74a01a9d20b6af8dba0b6/dpdk/x86_64-native-linuxapp-icc/build/kernel/linux/kni/kni_net.o: warning: objtool: kni_net_rx_normal()+0x2f9: sibling call from callable instruction with modified stack frame
/tmp/FC28_K4.16.3_ICC19.0.0/x86_64-native-linuxapp-icc/cdbc108b51b74a01a9d20b6af8dba0b6/dpdk/x86_64-native-linuxapp-icc/build/kernel/linux/kni/kni_net.o: warning: objtool: kni_fifo_trans_pa2va.cold.6()+0x1d: sibling call from callable instruction with modified stack frame
/tmp/FC28_K4.16.3_ICC19.0.0/x86_64-native-linuxapp-icc/cdbc108b51b74a01a9d20b6af8dba0b6/dpdk/x86_64-native-linuxapp-icc/build/kernel/linux/kni/kni_net.o: warning: objtool: kni_net_rx_lo_fifo_skb.cold.7()+0x25: sibling call from callable instruction with modified stack frame
/tmp/FC28_K4.16.3_ICC19.0.0/x86_64-native-linuxapp-icc/cdbc108b51b74a01a9d20b6af8dba0b6/dpdk/x86_64-native-linuxapp-icc/build/kernel/linux/kni/kni_net.o: warning: objtool: kni_net_rx_normal.cold.11()+0x25: sibling call from callable instruction with modified stack frame
  LD [M]  /tmp/FC28_K4.16.3_ICC19.0.0/x86_64-native-linuxapp-icc/cdbc108b51b74a01a9d20b6af8dba0b6/dpdk/x86_64-native-linuxapp-icc/build/kernel/linux/kni/rte_kni.o
  Building modules, stage 2.
  MODPOST 1 modules
  CC      /tmp/FC28_K4.16.3_ICC19.0.0/x86_64-native-linuxapp-icc/cdbc108b51b74a01a9d20b6af8dba0b6/dpdk/x86_64-native-linuxapp-icc/build/kernel/linux/igb_uio/igb_uio.mod.o
  MODPOST 1 modules
--
  PMDINFO otx_cryptodev.o.pmd.c
  CC qat_qp.o
  CC otx_cryptodev.o.pmd.o
In file included from /lib/modules/4.16.3-301.fc28.x86_64/build/tools/include/asm/barrier.h(3),
                 from /tmp/FC28_K4.16.3_ICC19.0.0/x86_64-native-linuxapp-icc/cdbc108b51b74a01a9d20b6af8dba0b6/dpdk/drivers/net/af_xdp/rte_eth_af_xdp.c(16):
/lib/modules/4.16.3-301.fc28.x86_64/build/tools/include/../../arch/x86/include/asm/barrier.h(5): catastrophic error: cannot open source file "asm/alternative.h"
  #include <asm/alternative.h>
                              ^

compilation aborted for /tmp/FC28_K4.16.3_ICC19.0.0/x86_64-native-linuxapp-icc/cdbc108b51b74a01a9d20b6af8dba0b6/dpdk/drivers/net/af_xdp/rte_eth_af_xdp.c (code 4)
make[6]: *** [/tmp/FC28_K4.16.3_ICC19.0.0/x86_64-native-linuxapp-icc/cdbc108b51b74a01a9d20b6af8dba0b6/dpdk/mk/internal/rte.compile-pre.mk:116: rte_eth_af_xdp.o] Error 4

*Failed Build #21:
OS: SUSE12
Target: x86_64-native-linuxapp-gcc
  CC virtio_cryptodev.o
  CC scheduler_multicore.o
== Build drivers/net/ark
== Build drivers/net/atlantic
== Build drivers/net/avp
/tmp/SUSE12_K3.7.10_GCC4.7.2/x86_64-native-linuxapp-gcc/cdbc108b51b74a01a9d20b6af8dba0b6/dpdk/drivers/net/af_xdp/rte_eth_af_xdp.c:14:10: fatal error: linux/if_xdp.h: No such file or directory
 #include <linux/if_xdp.h>
          ^~~~~~~~~~~~~~~~
compilation terminated.
/tmp/SUSE12_K3.7.10_GCC4.7.2/x86_64-native-linuxapp-gcc/cdbc108b51b74a01a9d20b6af8dba0b6/dpdk/mk/internal/rte.compile-pre.mk:114: recipe for target 'rte_eth_af_xdp.o' failed
make[6]: *** [rte_eth_af_xdp.o] Error 1
/tmp/SUSE12_K3.7.10_GCC4.7.2/x86_64-native-linuxapp-gcc/cdbc108b51b74a01a9d20b6af8dba0b6/dpdk/mk/rte.subdir.mk:35: recipe for target 'af_xdp' failed
make[5]: *** [af_xdp] Error 2
make[5]: *** Waiting for unfinished jobs....
  PMDINFO virtio_cryptodev.o.pmd.c
  CC virtio_cryptodev.o.pmd.o
  CC avp_ethdev.o
--
  AR librte_pmd_ark.a
  LD avp_ethdev.o
  INSTALL-LIB librte_pmd_ark.a
  AR librte_pmd_avp.a
  INSTALL-LIB librte_pmd_avp.a
/tmp/SUSE12_K3.7.10_GCC4.7.2/x86_64-native-linuxapp-gcc/cdbc108b51b74a01a9d20b6af8dba0b6/dpdk/mk/rte.subdir.mk:35: recipe for target 'net' failed
make[4]: *** [net] Error 2
make[4]: *** Waiting for unfinished jobs....
  AR librte_pmd_octeontx_crypto.a
  INSTALL-LIB librte_pmd_octeontx_crypto.a
/tmp/SUSE12_K3.7.10_GCC4.7.2/x86_64-native-linuxapp-gcc/cdbc108b51b74a01a9d20b6af8dba0b6/dpdk/mk/rte.sdkbuild.mk:46: recipe for target 'drivers' failed
make[3]: *** [drivers] Error 2
/tmp/SUSE12_K3.7.10_GCC4.7.2/x86_64-native-linuxapp-gcc/cdbc108b51b74a01a9d20b6af8dba0b6/dpdk/mk/rte.sdkroot.mk:98: recipe for target 'all' failed
make[2]: *** [all] Error 2
/tmp/SUSE12_K3.7.10_GCC4.7.2/x86_64-native-linuxapp-gcc/cdbc108b51b74a01a9d20b6af8dba0b6/dpdk/mk/rte.sdkinstall.mk:60: recipe for target 'pre_install' failed
make[1]: *** [pre_install] Error 2
/tmp/SUSE12_K3.7.10_GCC4.7.2/x86_64-native-linuxapp-gcc/cdbc108b51b74a01a9d20b6af8dba0b6/dpdk/mk/rte.sdkroot.mk:77: recipe for target 'install' failed
make: *** [install] Error 2

*Failed Build #22:
OS: CENTOS76
Target: x86_64-native-linuxapp-gcc
  CC bbdev_null.o
  CC ark_ddm.o
  SYMLINK-FILE include/rte_cryptodev_scheduler_operations.h
  CC rte_eth_af_xdp.o
  SYMLINK-FILE include/rte_cryptodev_scheduler.h
/tmp/CENTOS76_K3.10.0_GCC4.8.5/x86_64-native-linuxapp-gcc/cdbc108b51b74a01a9d20b6af8dba0b6/dpdk/drivers/net/af_xdp/rte_eth_af_xdp.c:14:26: fatal error: linux/if_xdp.h: No such file or directory
 #include <linux/if_xdp.h>
                          ^
compilation terminated.
  CC otx_cryptodev.o
  CC scheduler_pmd.o

DPDK STV team


More information about the test-report mailing list