[dpdk-test-report] |FAILURE| pw51370[v2, 2/4] net/ice: add safe mode

sys_stv at intel.com sys_stv at intel.com
Wed Mar 20 09:38:39 CET 2019


Test-Label: Intel-compilation
Test-Status: FAILURE
http://dpdk.org/patch/51370

_Compilation issues_

Submitter: Qiming Yang <qiming.yang at intel.com>
Date: 2019-03-20 15:50:23
Reply_mail: 20190320155025.138173-3-qiming.yang at intel.com
DPDK git baseline: Repo:dpdk-master, CommitID: 239912fa798e6e671072ca7ff987afd74c1e506c

Build Summary: 26 Builds Done, 0 Successful, 26 Failures

Test environment and configuration as below:

OS: SUSE15
	Kernel Version: 4.12.14-lp150.12.22-default
	CPU info: Intel(R) Xeon(R) CPU E5-2699 v3 @ 2.30GHz
	GCC Version: gcc (SUSE Linux) 7.3.1 20180323 [gcc-7-branch revision 258812]
	Clang Version: 5.0.1 (tags/RELEASE_501/final 312548)
	x86_64-native-linuxapp-gcc

OS: CENTOS76
	Kernel Version: 3.10.0-957.5.1.el7.x86_64
	CPU info: Intel(R) Xeon(R) CPU E5-2699 v4 @ 2.20GHz
	GCC Version: gcc (GCC) 4.8.5 20150623 (Red Hat 4.8.5-36)
	Clang Version: 3.4.2 (tags/RELEASE_34/dot2-final)
	x86_64-native-linuxapp-gcc

OS: UBT144-32
	Kernel Version: 3.13.0-161-generic
	CPU info: Intel(R) Xeon(R) CPU E5-2699 v3 @ 2.30GHz
	GCC Version: gcc (Ubuntu 4.8.4-2ubuntu1~14.04.4) 4.8.4
	Clang Version: NA
	i686-native-linuxapp-gcc

OS: UBT164-32
	Kernel Version: 4.4.0-131-generic
	CPU info: Intel(R) Xeon(R) CPU E5-2699 v3 @ 2.30GHz
	GCC Version: gcc (Ubuntu 5.4.0-6ubuntu1~16.04.10) 5.4.0 20160609
	Clang Version: NA
	i686-native-linuxapp-gcc

OS: SUSE12
	Kernel Version: 4.4.73-5-default
	CPU info: Intel(R) Xeon(R) CPU E5-2699 v4 @ 2.20GHz
	GCC Version: gcc (SUSE Linux) 7.1.1 20170607 [gcc-7-branch revision 248970]
	Clang Version: NA
	x86_64-native-linuxapp-gcc

OS: FreeBSD12.0
	Kernel Version: 12.0-RC3
	CPU info: Intel(R) Xeon(R) CPU E5-2699 v3 @ 2.30GHz (2294.75-MHz K8-class CPU)
	GCC Version: gcc (FreeBSD Ports Collection) 7.3.0
	Clang Version: 6.0.1 (tags/RELEASE_601/final 335540) (based on LLVM 6.0.1)
	x86_64-native-bsdapp-clang
	x86_64-native-bsdapp-gcc

OS: UBT144-64
	Kernel Version: 4.2.0-27-generic
	CPU info: Intel(R) Xeon(R) CPU E5-2699 v3 @ 2.30GHz
	GCC Version: gcc (Ubuntu 4.8.4-2ubuntu1~14.04.4) 4.8.4
	Clang Version: NA
	x86_64-native-linuxapp-gcc

OS: CENTOS75
	Kernel Version: 3.10.0-957.5.1.el7.x86_64
	CPU info: Intel(R) Xeon(R) CPU E5-2699 v4 @ 2.20GHz
	GCC Version: gcc (GCC) 4.8.5 20150623 (Red Hat 4.8.5-36)
	Clang Version: 3.4.2 (tags/RELEASE_34/dot2-final)
	x86_64-native-linuxapp-gcc

OS: UBT1804
	Kernel Version: 4.15.0-20-generic
	CPU info: Intel(R) Xeon(R) CPU E5-2699 v3 @ 2.30GHz
	GCC Version: gcc (Ubuntu 7.3.0-27ubuntu1~18.04) 7.3.0
	Clang Version: NA
	x86_64-native-linuxapp-clang
	x86_64-native-linuxapp-gcc
	x86_64-native-linuxapp-icc

OS: UBT1810
	Kernel Version: 4.18.0-10-generic
	CPU info: Intel(R) Xeon(R) CPU E5-2699 v3 @ 2.30GHz
	GCC Version: gcc (Ubuntu 8.2.0-7ubuntu1) 8.2.0
	Clang Version: NA
	x86_64-native-linuxapp-gcc

OS: RHEL74
	Kernel Version: 3.10.0-693.el7.x86_64
	CPU info: Intel(R) Xeon(R) CPU E5-2699 v4 @ 2.20GHz
	GCC Version: gcc (GCC) 4.8.5 20150623 (Red Hat 4.8.5-16)
	Clang Version: NA
	x86_64-native-linuxapp-gcc

OS: CENTOS74
	Kernel Version: 3.10.0-862.14.4.el7.x86_64
	CPU info: Intel(R) Xeon(R) CPU E5-2699 v4 @ 2.20GHz
	GCC Version: gcc (GCC) 4.8.5 20150623 (Red Hat 4.8.5-28)
	Clang Version: 3.4.2 (tags/RELEASE_34/dot2-final)
	x86_64-native-linuxapp-gcc

OS: FreeBSD11.2
	Kernel Version: 11.2-RELEASE
	CPU info: Intel(R) Xeon(R) CPU E5-2699 v3 @ 2.30GHz (2294.74-MHz K8-class CPU)
	GCC Version: gcc (FreeBSD Ports Collection) 6.4.0
	Clang Version: 6.0.0 (tags/RELEASE_600/final 326565) (based on LLVM 6.0.0)
	x86_64-native-bsdapp-gcc
	x86_64-native-bsdapp-clang

OS: UBT164-64
	Kernel Version: 4.4.0-47-generic
	CPU info: Intel(R) Xeon(R) CPU E5-2699 v3 @ 2.30GHz
	GCC Version: gcc (Ubuntu 5.4.0-6ubuntu1~16.04.10) 5.4.0 20160609
	Clang Version: 3.8.0-2ubuntu4 (tags/RELEASE_380/final)
	x86_64-native-linuxapp-gcc

OS: FC28
	Kernel Version: 4.16.3-301.fc28.x86_64
	CPU info: Intel(R) Xeon(R) CPU E5-2699 v4 @ 2.20GHz
	GCC Version: gcc (GCC) 8.1.1 20180712 (Red Hat 8.1.1-5)
	Clang Version: NA
	x86_64-native-linuxapp-gcc
	x86_64-native-linuxapp-clang
	x86_64-native-linuxapp-icc

OS: RHEL76
	Kernel Version: 3.10.0-957.el7.x86_64
	CPU info: Intel(R) Xeon(R) CPU E5-2699 v4 @ 2.20GHz
	GCC Version: gcc (GCC) 4.8.5 20150623 (Red Hat 4.8.5-36)
	Clang Version: NA
	x86_64-native-linuxapp-gcc

OS: FC29
	Kernel Version: 4.18.16-300.fc29.x86_64
	CPU info: Intel(R) Xeon(R) CPU E5-2699 v4 @ 2.20GHz
	GCC Version: gcc (GCC) 8.2.1 20181215 (Red Hat 8.2.1-6)
	Clang Version: NA
	x86_64-native-linuxapp-gcc
	x86_64-native-linuxapp-clang
	x86_64-native-linuxapp-icc

OS: RHEL75
	Kernel Version: 3.10.0-862.el7.x86_64
	CPU info: Intel(R) Xeon(R) CPU E5-2699 v4 @ 2.20GHz
	GCC Version: gcc (GCC) 4.8.5 20150623 (Red Hat 4.8.5-28)
	Clang Version: NA
	x86_64-native-linuxapp-gcc

*Failed Build #1:
OS: UBT144-64
Target: x86_64-native-linuxapp-gcc
  SYMLINK-FILE include/generic/rte_cpuflags.h
  SYMLINK-FILE include/generic/rte_rwlock.h
  SYMLINK-FILE include/generic/rte_vect.h
  SYMLINK-FILE include/generic/rte_pause.h
  SYMLINK-FILE include/generic/rte_io.h
make[6]: warning:  Clock skew detected.  Your build may be incomplete.
== Build lib/librte_eal/linux
== Build lib/librte_eal/linux/eal
  SYMLINK-FILE include/exec-env/rte_kni_common.h
  CC eal.o
  CC eal_cpuflags.o
--
  CC ethdev_profile.o
  AR librte_sched.a
  INSTALL-LIB librte_sched.a
  AR librte_ethdev.a
  INSTALL-LIB librte_ethdev.a
make[5]: warning:  Clock skew detected.  Your build may be incomplete.
== Build lib/librte_security
== Build lib/librte_rawdev
== Build lib/librte_eventdev
== Build lib/librte_vhost
== Build lib/librte_ip_frag
--
  PMDINFO lio_ethdev.o.pmd.c
  CC lio_ethdev.o.pmd.o
  LD lio_ethdev.o
  CC lio_rxtx.o
/tmp/UBT144-64_K4.2.0_GCC4.8.4/x86_64-native-linuxapp-gcc/72cd20e70e0a4f79b24b3cfb924d409e/dpdk/drivers/net/ice/ice_ethdev.c: In function ‘ice_load_pkg’:
/tmp/UBT144-64_K4.2.0_GCC4.8.4/x86_64-native-linuxapp-gcc/72cd20e70e0a4f79b24b3cfb924d409e/dpdk/drivers/net/ice/ice_ethdev.c:1279:15: error: ‘pkg_path’ undeclared (first use in this function)
  file = fopen(pkg_path, "rb");
               ^
/tmp/UBT144-64_K4.2.0_GCC4.8.4/x86_64-native-linuxapp-gcc/72cd20e70e0a4f79b24b3cfb924d409e/dpdk/drivers/net/ice/ice_ethdev.c:1279:15: note: each undeclared identifier is reported only once for each function it appears in
make[6]: *** [ice_ethdev.o] Error 1
make[6]: *** Waiting for unfinished jobs....
--
  CC ixgbe_dcb_82598.o
  AR librte_pmd_netvsc.a
  CC ixgbe_mbx.o
  INSTALL-LIB librte_pmd_netvsc.a
  CC i40e_ethdev_vf.o
make[6]: warning:  Clock skew detected.  Your build may be incomplete.
  CC i40e_pf.o
make[6]: Warning: File `ixgbe_ethdev.c' has modification time 1e+04 s in the future
  CC ixgbe_rxtx.o
  CC ixgbe_ethdev.o
  CC ixgbe_fdir.o
--
  PMDINFO ixgbe_ethdev.o.pmd.c
  CC ixgbe_ethdev.o.pmd.o
  LD ixgbe_ethdev.o
  AR librte_pmd_ixgbe.a
  INSTALL-LIB librte_pmd_ixgbe.a
make[6]: warning:  Clock skew detected.  Your build may be incomplete.
  PMDINFO i40e_ethdev.o.pmd.c
  CC i40e_ethdev.o.pmd.o
  LD i40e_ethdev.o
  AR librte_pmd_i40e.a
  INSTALL-LIB librte_pmd_i40e.a
make[6]: warning:  Clock skew detected.  Your build may be incomplete.
make[4]: *** [net] Error 2
make[3]: *** [drivers] Error 2
make[2]: *** [all] Error 2
make[1]: *** [pre_install] Error 2
make: *** [install] Error 2

*Failed Build #2:
OS: UBT164-64
Target: x86_64-native-linuxapp-gcc
  SYMLINK-FILE include/generic/rte_cpuflags.h
  SYMLINK-FILE include/generic/rte_rwlock.h
  SYMLINK-FILE include/generic/rte_vect.h
  SYMLINK-FILE include/generic/rte_pause.h
  SYMLINK-FILE include/generic/rte_io.h
make[6]: warning:  Clock skew detected.  Your build may be incomplete.
== Build lib/librte_eal/linux
== Build lib/librte_eal/linux/eal
  SYMLINK-FILE include/exec-env/rte_kni_common.h
  CC eal.o
  CC eal_cpuflags.o
--
  INSTALL-LIB librte_compressdev.a
  AR librte_sched.a
  INSTALL-LIB librte_sched.a
  AR librte_ethdev.a
  INSTALL-LIB librte_ethdev.a
make[5]: warning:  Clock skew detected.  Your build may be incomplete.
== Build lib/librte_rawdev
== Build lib/librte_eventdev
== Build lib/librte_bitratestats
== Build lib/librte_security
== Build lib/librte_distributor
--
make[6]: Warning: File 'ice_ethdev.c' has modification time 17522 s in the future
  CC ice_flow.o
  CC ice_ethdev.o
  CC ixgbe_dcb_82599.o
/tmp/UBT164-64_K4.4.0_GCC5.4.0/x86_64-native-linuxapp-gcc/72cd20e70e0a4f79b24b3cfb924d409e/dpdk/drivers/net/ice/ice_ethdev.c: In function ‘ice_load_pkg’:
/tmp/UBT164-64_K4.4.0_GCC5.4.0/x86_64-native-linuxapp-gcc/72cd20e70e0a4f79b24b3cfb924d409e/dpdk/drivers/net/ice/ice_ethdev.c:1279:15: error: ‘pkg_path’ undeclared (first use in this function)
  file = fopen(pkg_path, "rb");
               ^
/tmp/UBT164-64_K4.4.0_GCC5.4.0/x86_64-native-linuxapp-gcc/72cd20e70e0a4f79b24b3cfb924d409e/dpdk/drivers/net/ice/ice_ethdev.c:1279:15: note: each undeclared identifier is reported only once for each function it appears in
  AR librte_pmd_netvsc.a
  PMDINFO i40e_ethdev.o.pmd.c
  CC i40e_ethdev.o.pmd.o
  INSTALL-LIB librte_pmd_netvsc.a
/tmp/UBT164-64_K4.4.0_GCC5.4.0/x86_64-native-linuxapp-gcc/72cd20e70e0a4f79b24b3cfb924d409e/dpdk/mk/internal/rte.compile-pre.mk:114: recipe for target 'ice_ethdev.o' failed
make[6]: *** [ice_ethdev.o] Error 1
make[6]: *** Waiting for unfinished jobs....
  CC ixgbe_dcb_82598.o
  PMDINFO rte_eth_null.o.pmd.c
  CC rte_eth_null.o.pmd.o
make[6]: warning:  Clock skew detected.  Your build may be incomplete.
== Build drivers/net/octeontx
  CC nfp_cpp_pcie_ops.o
  PMDINFO i40e_ethdev_vf.o.pmd.c
  CC i40e_ethdev_vf.o.pmd.o
  CC ixgbe_mbx.o
--
  PMDINFO dpaa2_sec_dpseci.o.pmd.c
  CC dpaa2_sec_dpseci.o.pmd.o
  CC i40e_fdir.o
  CC i40e_pf.o
  AR librte_pmd_null.a
/tmp/UBT164-64_K4.4.0_GCC5.4.0/x86_64-native-linuxapp-gcc/72cd20e70e0a4f79b24b3cfb924d409e/dpdk/mk/rte.subdir.mk:35: recipe for target 'ice' failed
make[5]: *** [ice] Error 2
make[5]: *** Waiting for unfinished jobs....
  CC i40e_flow.o
  INSTALL-LIB librte_pmd_null.a
  CC rte_pmd_i40e.o
--
  LD ixgbe_ethdev.o
  CC bnxt_rxq.o
  CC caam_jr_hw.o
  AR librte_pmd_i40e.a
  INSTALL-LIB librte_pmd_i40e.a
make[6]: warning:  Clock skew detected.  Your build may be incomplete.
  CC caam_jr_uio.o
  CC ixgbe_rxtx_vec_sse.o
  CC nfp_nsp.o
  CC virtio_cryptodev.o
  CC bnxt_rxr.o
--
  INSTALL-LIB librte_pmd_virtio_crypto.a
  AR librte_pmd_bnxt.a
  INSTALL-LIB librte_pmd_bnxt.a
  AR librte_pmd_ixgbe.a
  INSTALL-LIB librte_pmd_ixgbe.a
make[6]: warning:  Clock skew detected.  Your build may be incomplete.
  PMDINFO nfp_net.o.pmd.c
  CC nfp_net.o.pmd.o
  LD nfp_net.o
  AR librte_pmd_nfp.a
  INSTALL-LIB librte_pmd_nfp.a
/tmp/UBT164-64_K4.4.0_GCC5.4.0/x86_64-native-linuxapp-gcc/72cd20e70e0a4f79b24b3cfb924d409e/dpdk/mk/rte.subdir.mk:35: recipe for target 'net' failed
make[4]: *** [net] Error 2
/tmp/UBT164-64_K4.4.0_GCC5.4.0/x86_64-native-linuxapp-gcc/72cd20e70e0a4f79b24b3cfb924d409e/dpdk/mk/rte.sdkbuild.mk:46: recipe for target 'drivers' failed
make[3]: *** [drivers] Error 2
/tmp/UBT164-64_K4.4.0_GCC5.4.0/x86_64-native-linuxapp-gcc/72cd20e70e0a4f79b24b3cfb924d409e/dpdk/mk/rte.sdkroot.mk:98: recipe for target 'all' failed
make[2]: *** [all] Error 2
/tmp/UBT164-64_K4.4.0_GCC5.4.0/x86_64-native-linuxapp-gcc/72cd20e70e0a4f79b24b3cfb924d409e/dpdk/mk/rte.sdkinstall.mk:60: recipe for target 'pre_install' failed
make[1]: *** [pre_install] Error 2
/tmp/UBT164-64_K4.4.0_GCC5.4.0/x86_64-native-linuxapp-gcc/72cd20e70e0a4f79b24b3cfb924d409e/dpdk/mk/rte.sdkroot.mk:77: recipe for target 'install' failed
make: *** [install] Error 2

*Failed Build #3:
OS: UBT164-32
Target: i686-native-linuxapp-gcc
  SYMLINK-FILE include/generic/rte_cpuflags.h
  SYMLINK-FILE include/generic/rte_rwlock.h
  SYMLINK-FILE include/generic/rte_vect.h
  SYMLINK-FILE include/generic/rte_pause.h
  SYMLINK-FILE include/generic/rte_io.h
make[6]: warning:  Clock skew detected.  Your build may be incomplete.
== Build lib/librte_eal/linux
== Build lib/librte_eal/linux/eal
  CC eal_memory.o
  SYMLINK-FILE include/exec-env/rte_kni_common.h
  CC eal_hugepage_info.o
--
  INSTALL-LIB librte_member.a
  AR librte_sched.a
  INSTALL-LIB librte_sched.a
  AR librte_ethdev.a
  INSTALL-LIB librte_ethdev.a
make[5]: warning:  Clock skew detected.  Your build may be incomplete.
== Build lib/librte_security
== Build lib/librte_eventdev
== Build lib/librte_vhost
== Build lib/librte_ip_frag
== Build lib/librte_latencystats
--
  AR librte_pmd_octeontx.a
  INSTALL-LIB librte_pmd_octeontx.a
  AR librte_pmd_netvsc.a
== Build drivers/net/qede
  INSTALL-LIB librte_pmd_netvsc.a
make[6]: warning:  Clock skew detected.  Your build may be incomplete.
== Build drivers/net/ring
  CC ixgbe_dcb.o
  CC ixgbe_dcb_82599.o
  CC ice_switch.o
  PMDINFO bnxt_ethdev.o.pmd.c
--
  CC rte_eth_tap.o
  CC tap_flow.o
  CC bnxt_txq.o
  AR librte_pmd_i40e.a
  INSTALL-LIB librte_pmd_i40e.a
make[6]: warning:  Clock skew detected.  Your build may be incomplete.
== Build drivers/net/thunderx
  CC tap_netlink.o
  CC tap_tcmsgs.o
  CC ecore_sp_commands.o
  CC ice_ethdev.o
--
  CC bnxt_txr.o
  CC ice_rxtx.o
  CC tap_bpf_api.o
/tmp/UBT164-32_K4.4.0_GCC5.4.0/i686-native-linuxapp-gcc/72cd20e70e0a4f79b24b3cfb924d409e/dpdk/drivers/net/ice/ice_ethdev.c: In function ‘ice_load_pkg’:
  CC ecore_init_fw_funcs.o
/tmp/UBT164-32_K4.4.0_GCC5.4.0/i686-native-linuxapp-gcc/72cd20e70e0a4f79b24b3cfb924d409e/dpdk/drivers/net/ice/ice_ethdev.c:1279:15: error: ‘pkg_path’ undeclared (first use in this function)
  file = fopen(pkg_path, "rb");
               ^
/tmp/UBT164-32_K4.4.0_GCC5.4.0/i686-native-linuxapp-gcc/72cd20e70e0a4f79b24b3cfb924d409e/dpdk/drivers/net/ice/ice_ethdev.c:1279:15: note: each undeclared identifier is reported only once for each function it appears in
/tmp/UBT164-32_K4.4.0_GCC5.4.0/i686-native-linuxapp-gcc/72cd20e70e0a4f79b24b3cfb924d409e/dpdk/mk/internal/rte.compile-pre.mk:114: recipe for target 'ice_ethdev.o' failed
make[6]: *** [ice_ethdev.o] Error 1
make[6]: *** Waiting for unfinished jobs....
  CC ecore_spq.o
  CC tap_intr.o
  CC nicvf_rxtx.o
--
  AR librte_pmd_thunderx_nicvf.a
  CC ecore_mcp.o
  INSTALL-LIB librte_pmd_thunderx_nicvf.a
  CC ecore_int.o
  CC rte_pmd_bnxt.o
/tmp/UBT164-32_K4.4.0_GCC5.4.0/i686-native-linuxapp-gcc/72cd20e70e0a4f79b24b3cfb924d409e/dpdk/mk/rte.subdir.mk:35: recipe for target 'ice' failed
make[5]: *** [ice] Error 2
make[5]: *** Waiting for unfinished jobs....
  CC ecore_dcbx.o
  CC vdev_netvsc.o
  CC bcm_osal.o
  CC virtqueue.o
  CC ecore_sriov.o
  AR librte_pmd_ixgbe.a
  CC vmxnet3_rxtx.o
  INSTALL-LIB librte_pmd_ixgbe.a
make[6]: warning:  Clock skew detected.  Your build may be incomplete.
  CC vmxnet3_ethdev.o
  AR librte_pmd_bnxt.a
  INSTALL-LIB librte_pmd_bnxt.a
  CC virtio_pci.o
  CC virtio_rxtx.o
--
  LD virtio_user_ethdev.o
  AR librte_pmd_qede.a
  INSTALL-LIB librte_pmd_qede.a
  AR librte_pmd_virtio.a
  INSTALL-LIB librte_pmd_virtio.a
/tmp/UBT164-32_K4.4.0_GCC5.4.0/i686-native-linuxapp-gcc/72cd20e70e0a4f79b24b3cfb924d409e/dpdk/mk/rte.subdir.mk:35: recipe for target 'net' failed
make[4]: *** [net] Error 2
/tmp/UBT164-32_K4.4.0_GCC5.4.0/i686-native-linuxapp-gcc/72cd20e70e0a4f79b24b3cfb924d409e/dpdk/mk/rte.sdkbuild.mk:46: recipe for target 'drivers' failed
make[3]: *** [drivers] Error 2
/tmp/UBT164-32_K4.4.0_GCC5.4.0/i686-native-linuxapp-gcc/72cd20e70e0a4f79b24b3cfb924d409e/dpdk/mk/rte.sdkroot.mk:98: recipe for target 'all' failed
make[2]: *** [all] Error 2
/tmp/UBT164-32_K4.4.0_GCC5.4.0/i686-native-linuxapp-gcc/72cd20e70e0a4f79b24b3cfb924d409e/dpdk/mk/rte.sdkinstall.mk:60: recipe for target 'pre_install' failed
make[1]: *** [pre_install] Error 2
/tmp/UBT164-32_K4.4.0_GCC5.4.0/i686-native-linuxapp-gcc/72cd20e70e0a4f79b24b3cfb924d409e/dpdk/mk/rte.sdkroot.mk:77: recipe for target 'install' failed
make: *** [install] Error 2

*Failed Build #4:
OS: UBT1804
Target: x86_64-native-linuxapp-clang
  SYMLINK-FILE include/generic/rte_cpuflags.h
  SYMLINK-FILE include/generic/rte_rwlock.h
  SYMLINK-FILE include/generic/rte_vect.h
  SYMLINK-FILE include/generic/rte_io.h
  SYMLINK-FILE include/generic/rte_pause.h
make[6]: warning:  Clock skew detected.  Your build may be incomplete.
== Build lib/librte_eal/linux
== Build lib/librte_eal/linux/eal
  SYMLINK-FILE include/exec-env/rte_kni_common.h
  CC eal.o
  CC eal_cpuflags.o
--
  CC ethdev_profile.o
  AR librte_compressdev.a
  INSTALL-LIB librte_compressdev.a
  AR librte_ethdev.a
  INSTALL-LIB librte_ethdev.a
make[5]: warning:  Clock skew detected.  Your build may be incomplete.
== Build lib/librte_vhost
== Build lib/librte_security
== Build lib/librte_rawdev
== Build lib/librte_gro
== Build lib/librte_ip_frag
--
  CC i40e_ethdev.o.pmd.o
  LD i40e_ethdev.o
  CC rte_pmd_i40e.o
  CC ixgbe_dcb_82599.o
  CC i40e_tm.o
/tmp/UBT1804_K4.15.0_Clang6.0.0/x86_64-native-linuxapp-clang/72cd20e70e0a4f79b24b3cfb924d409e/dpdk/drivers/net/ice/ice_ethdev.c:1279:15: error: use of undeclared identifier 'pkg_path'
        file = fopen(pkg_path, "rb");
                     ^
/tmp/UBT1804_K4.15.0_Clang6.0.0/x86_64-native-linuxapp-clang/72cd20e70e0a4f79b24b3cfb924d409e/dpdk/drivers/net/ice/ice_ethdev.c:1285:13: error: use of undeclared identifier 'pkg_path'
        err = stat(pkg_path, &fstat);
                   ^
2 errors generated.
/tmp/UBT1804_K4.15.0_Clang6.0.0/x86_64-native-linuxapp-clang/72cd20e70e0a4f79b24b3cfb924d409e/dpdk/mk/internal/rte.compile-pre.mk:114: recipe for target 'ice_ethdev.o' failed
make[6]: *** [ice_ethdev.o] Error 1
make[6]: *** Waiting for unfinished jobs....
  CC i40e_vf_representor.o
  CC nfp_mutex.o
  CC ixgbe_dcb_82598.o
--
  CC ixgbe_rxtx.o
make[6]: Warning: File 'hn_vf.c' has modification time 10360 s in the future
  CC hn_nvs.o
  CC nfp_resource.o
  SYMLINK-FILE include/rte_pmd_bnxt.h
/tmp/UBT1804_K4.15.0_Clang6.0.0/x86_64-native-linuxapp-clang/72cd20e70e0a4f79b24b3cfb924d409e/dpdk/mk/rte.subdir.mk:35: recipe for target 'ice' failed
make[5]: *** [ice] Error 2
make[5]: *** Waiting for unfinished jobs....
  CC bnxt_cpr.o
  CC bnxt_ethdev.o
  CC bnxt_filter.o
--
  CC nfp_mip.o
  CC nfp_nffw.o
  CC ixgbe_fdir.o
  AR librte_pmd_i40e.a
  INSTALL-LIB librte_pmd_i40e.a
make[6]: warning:  Clock skew detected.  Your build may be incomplete.
  CC ixgbe_pf.o
  CC ixgbe_flow.o
  CC ixgbe_rxtx_vec_sse.o
  AR librte_pmd_netvsc.a
  INSTALL-LIB librte_pmd_netvsc.a
make[6]: warning:  Clock skew detected.  Your build may be incomplete.
  CC ixgbe_ipsec.o
  CC nfp_hwinfo.o
  CC nfp_rtsym.o
  PMDINFO bnxt_ethdev.o.pmd.c
  CC bnxt_ethdev.o.pmd.o
--
  CC bnxt_irq.o
  CC bnxt_util.o
  CC rte_pmd_bnxt.o
  AR librte_pmd_ixgbe.a
  INSTALL-LIB librte_pmd_ixgbe.a
make[6]: warning:  Clock skew detected.  Your build may be incomplete.
  AR librte_pmd_bnxt.a
  INSTALL-LIB librte_pmd_bnxt.a
  PMDINFO nfp_net.o.pmd.c
  CC nfp_net.o.pmd.o
  LD nfp_net.o
  AR librte_pmd_nfp.a
  INSTALL-LIB librte_pmd_nfp.a
/tmp/UBT1804_K4.15.0_Clang6.0.0/x86_64-native-linuxapp-clang/72cd20e70e0a4f79b24b3cfb924d409e/dpdk/mk/rte.subdir.mk:35: recipe for target 'net' failed
make[4]: *** [net] Error 2
/tmp/UBT1804_K4.15.0_Clang6.0.0/x86_64-native-linuxapp-clang/72cd20e70e0a4f79b24b3cfb924d409e/dpdk/mk/rte.sdkbuild.mk:46: recipe for target 'drivers' failed
make[3]: *** [drivers] Error 2
/tmp/UBT1804_K4.15.0_Clang6.0.0/x86_64-native-linuxapp-clang/72cd20e70e0a4f79b24b3cfb924d409e/dpdk/mk/rte.sdkroot.mk:98: recipe for target 'all' failed
make[2]: *** [all] Error 2
/tmp/UBT1804_K4.15.0_Clang6.0.0/x86_64-native-linuxapp-clang/72cd20e70e0a4f79b24b3cfb924d409e/dpdk/mk/rte.sdkinstall.mk:60: recipe for target 'pre_install' failed
make[1]: *** [pre_install] Error 2
/tmp/UBT1804_K4.15.0_Clang6.0.0/x86_64-native-linuxapp-clang/72cd20e70e0a4f79b24b3cfb924d409e/dpdk/mk/rte.sdkroot.mk:77: recipe for target 'install' failed
make: *** [install] Error 2

*Failed Build #5:
OS: UBT1804
Target: x86_64-native-linuxapp-gcc
  SYMLINK-FILE include/generic/rte_memcpy.h
  SYMLINK-FILE include/generic/rte_rwlock.h
  SYMLINK-FILE include/generic/rte_vect.h
  SYMLINK-FILE include/generic/rte_pause.h
  SYMLINK-FILE include/generic/rte_io.h
make[6]: warning:  Clock skew detected.  Your build may be incomplete.
== Build lib/librte_eal/linux
== Build lib/librte_eal/linux/eal
  SYMLINK-FILE include/exec-env/rte_kni_common.h
  CC eal.o
  CC eal_cpuflags.o
--
  INSTALL-LIB librte_member.a
  AR librte_sched.a
  INSTALL-LIB librte_sched.a
  AR librte_ethdev.a
  INSTALL-LIB librte_ethdev.a
make[5]: warning:  Clock skew detected.  Your build may be incomplete.
== Build lib/librte_security
== Build lib/librte_eventdev
== Build lib/librte_gro
== Build lib/librte_rawdev
== Build lib/librte_vhost
--
  CC ice_ethdev.o
  CC igb_pf.o
  CC lio_23xx_vf.o
  CC igb_flow.o
/tmp/UBT1804_K4.15.0_GCC7.3.0/x86_64-native-linuxapp-gcc/72cd20e70e0a4f79b24b3cfb924d409e/dpdk/drivers/net/ice/ice_ethdev.c: In function ‘ice_load_pkg’:
/tmp/UBT1804_K4.15.0_GCC7.3.0/x86_64-native-linuxapp-gcc/72cd20e70e0a4f79b24b3cfb924d409e/dpdk/drivers/net/ice/ice_ethdev.c:1279:15: error: ‘pkg_path’ undeclared (first use in this function); did you mean ‘pkg_file’?
  file = fopen(pkg_path, "rb");
               ^~~~~~~~
               pkg_file
/tmp/UBT1804_K4.15.0_GCC7.3.0/x86_64-native-linuxapp-gcc/72cd20e70e0a4f79b24b3cfb924d409e/dpdk/drivers/net/ice/ice_ethdev.c:1279:15: note: each undeclared identifier is reported only once for each function it appears in
/tmp/UBT1804_K4.15.0_GCC7.3.0/x86_64-native-linuxapp-gcc/72cd20e70e0a4f79b24b3cfb924d409e/dpdk/mk/internal/rte.compile-pre.mk:114: recipe for target 'ice_ethdev.o' failed
make[6]: *** [ice_ethdev.o] Error 1
make[6]: *** Waiting for unfinished jobs....
  CC em_ethdev.o
  CC ixgbe_hv_vf.o
/tmp/UBT1804_K4.15.0_GCC7.3.0/x86_64-native-linuxapp-gcc/72cd20e70e0a4f79b24b3cfb924d409e/dpdk/mk/rte.subdir.mk:35: recipe for target 'ice' failed
make[5]: *** [ice] Error 2
make[5]: *** Waiting for unfinished jobs....
  CC em_rxtx.o
make[6]: Warning: File 'hn_vf.c' has modification time 10344 s in the future
  CC hn_nvs.o
--
  INSTALL-LIB librte_pmd_lio.a
  CC bnxt_filter.o
  AR librte_pmd_netvsc.a
  INSTALL-LIB librte_pmd_netvsc.a
  CC ixgbe_dcb_82599.o
make[6]: warning:  Clock skew detected.  Your build may be incomplete.
  CC ixgbe_dcb_82598.o
  CC ixgbe_mbx.o
  AR librte_pmd_e1000.a
  INSTALL-LIB librte_pmd_e1000.a
  CC i40e_ethdev_vf.o
--
  CC ixgbe_ethdev.o.pmd.o
  CC bnxt_rxq.o
  LD ixgbe_ethdev.o
  AR librte_pmd_i40e.a
  INSTALL-LIB librte_pmd_i40e.a
make[6]: warning:  Clock skew detected.  Your build may be incomplete.
  CC bnxt_rxr.o
  CC bnxt_stats.o
  CC bnxt_txq.o
  CC bnxt_txr.o
  CC bnxt_vnic.o
--
  CC bnxt_util.o
  AR librte_pmd_nfp.a
  INSTALL-LIB librte_pmd_nfp.a
  AR librte_pmd_ixgbe.a
  INSTALL-LIB librte_pmd_ixgbe.a
make[6]: warning:  Clock skew detected.  Your build may be incomplete.
  CC rte_pmd_bnxt.o
  AR librte_pmd_bnxt.a
  INSTALL-LIB librte_pmd_bnxt.a
/tmp/UBT1804_K4.15.0_GCC7.3.0/x86_64-native-linuxapp-gcc/72cd20e70e0a4f79b24b3cfb924d409e/dpdk/mk/rte.subdir.mk:35: recipe for target 'net' failed
make[4]: *** [net] Error 2
/tmp/UBT1804_K4.15.0_GCC7.3.0/x86_64-native-linuxapp-gcc/72cd20e70e0a4f79b24b3cfb924d409e/dpdk/mk/rte.sdkbuild.mk:46: recipe for target 'drivers' failed
make[3]: *** [drivers] Error 2
/tmp/UBT1804_K4.15.0_GCC7.3.0/x86_64-native-linuxapp-gcc/72cd20e70e0a4f79b24b3cfb924d409e/dpdk/mk/rte.sdkroot.mk:98: recipe for target 'all' failed
make[2]: *** [all] Error 2
/tmp/UBT1804_K4.15.0_GCC7.3.0/x86_64-native-linuxapp-gcc/72cd20e70e0a4f79b24b3cfb924d409e/dpdk/mk/rte.sdkinstall.mk:60: recipe for target 'pre_install' failed
make[1]: *** [pre_install] Error 2
/tmp/UBT1804_K4.15.0_GCC7.3.0/x86_64-native-linuxapp-gcc/72cd20e70e0a4f79b24b3cfb924d409e/dpdk/mk/rte.sdkroot.mk:77: recipe for target 'install' failed
make: *** [install] Error 2

*Failed Build #6:
OS: UBT1804
Target: x86_64-native-linuxapp-icc
  SYMLINK-FILE include/generic/rte_cpuflags.h
  SYMLINK-FILE include/generic/rte_vect.h
  SYMLINK-FILE include/generic/rte_io.h
  SYMLINK-FILE include/generic/rte_rwlock.h
  SYMLINK-FILE include/generic/rte_pause.h
make[6]: warning:  Clock skew detected.  Your build may be incomplete.
== Build lib/librte_eal/linux
== Build lib/librte_eal/linux/eal
  SYMLINK-FILE include/exec-env/rte_kni_common.h
  CC eal_cpuflags.o
  CC eal.o
--
  CC ethdev_profile.o
  AR librte_sched.a
  INSTALL-LIB librte_sched.a
  AR librte_ethdev.a
  INSTALL-LIB librte_ethdev.a
make[5]: warning:  Clock skew detected.  Your build may be incomplete.
== Build lib/librte_eventdev
== Build lib/librte_rawdev
== Build lib/librte_vhost
== Build lib/librte_kni
== Build lib/librte_distributor
--
  AR librte_pmd_lio.a
  INSTALL-LIB librte_pmd_lio.a
  AR librte_pmd_netvsc.a
== Build drivers/net/octeontx
  INSTALL-LIB librte_pmd_netvsc.a
make[6]: warning:  Clock skew detected.  Your build may be incomplete.
== Build drivers/net/pcap
  LD bnxt_ethdev.o
  AR librte_pmd_fm10k.a
  INSTALL-LIB librte_pmd_fm10k.a
  CC bnxt_filter.o
--
  CC bnxt_irq.o
  LD rte_eth_pcap.o
  CC bnxt_util.o
  AR librte_pmd_pcap.a
  INSTALL-LIB librte_pmd_pcap.a
/tmp/UBT1804_K4.15.0_ICC19.0.0/x86_64-native-linuxapp-icc/72cd20e70e0a4f79b24b3cfb924d409e/dpdk/drivers/net/ice/ice_ethdev.c(1279): error: identifier "pkg_path" is undefined
  	file = fopen(pkg_path, "rb");
  	             ^

== Build drivers/net/ring
  CC nfp_net.o
compilation aborted for /tmp/UBT1804_K4.15.0_ICC19.0.0/x86_64-native-linuxapp-icc/72cd20e70e0a4f79b24b3cfb924d409e/dpdk/drivers/net/ice/ice_ethdev.c (code 2)
/tmp/UBT1804_K4.15.0_ICC19.0.0/x86_64-native-linuxapp-icc/72cd20e70e0a4f79b24b3cfb924d409e/dpdk/mk/internal/rte.compile-pre.mk:114: recipe for target 'ice_ethdev.o' failed
make[6]: *** [ice_ethdev.o] Error 2
/tmp/UBT1804_K4.15.0_ICC19.0.0/x86_64-native-linuxapp-icc/72cd20e70e0a4f79b24b3cfb924d409e/dpdk/mk/rte.subdir.mk:35: recipe for target 'ice' failed
make[5]: *** [ice] Error 2
make[5]: *** Waiting for unfinished jobs....
  CC rte_pmd_bnxt.o
  CC ixgbe_hv_vf.o
  CC i40e_rxtx.o
--
  LD ixgbe_ethdev.o
  CC ecore_sp_commands.o
  AR librte_pmd_ixgbe.a
  CC ecore_init_fw_funcs.o
  INSTALL-LIB librte_pmd_ixgbe.a
make[6]: warning:  Clock skew detected.  Your build may be incomplete.
  CC ecore_spq.o
  CC ecore_init_ops.o
  PMDINFO i40e_ethdev_vf.o.pmd.c
  CC i40e_ethdev_vf.o.pmd.o
  CC ecore_mcp.o
--
  CC qede_main.o
  CC qede_rxtx.o
  AR librte_pmd_i40e.a
  INSTALL-LIB librte_pmd_i40e.a
  CC qede_filter.o
make[6]: warning:  Clock skew detected.  Your build may be incomplete.
  PMDINFO qede_ethdev.o.pmd.c
  CC qede_ethdev.o.pmd.o
  LD qede_ethdev.o
  AR librte_pmd_qede.a
  INSTALL-LIB librte_pmd_qede.a
/tmp/UBT1804_K4.15.0_ICC19.0.0/x86_64-native-linuxapp-icc/72cd20e70e0a4f79b24b3cfb924d409e/dpdk/mk/rte.subdir.mk:35: recipe for target 'net' failed
make[4]: *** [net] Error 2
/tmp/UBT1804_K4.15.0_ICC19.0.0/x86_64-native-linuxapp-icc/72cd20e70e0a4f79b24b3cfb924d409e/dpdk/mk/rte.sdkbuild.mk:46: recipe for target 'drivers' failed
make[3]: *** [drivers] Error 2
/tmp/UBT1804_K4.15.0_ICC19.0.0/x86_64-native-linuxapp-icc/72cd20e70e0a4f79b24b3cfb924d409e/dpdk/mk/rte.sdkroot.mk:98: recipe for target 'all' failed
make[2]: *** [all] Error 2
/tmp/UBT1804_K4.15.0_ICC19.0.0/x86_64-native-linuxapp-icc/72cd20e70e0a4f79b24b3cfb924d409e/dpdk/mk/rte.sdkinstall.mk:60: recipe for target 'pre_install' failed
make[1]: *** [pre_install] Error 2
/tmp/UBT1804_K4.15.0_ICC19.0.0/x86_64-native-linuxapp-icc/72cd20e70e0a4f79b24b3cfb924d409e/dpdk/mk/rte.sdkroot.mk:77: recipe for target 'install' failed
make: *** [install] Error 2

*Failed Build #7:
OS: UBT144-32
Target: i686-native-linuxapp-gcc
  SYMLINK-FILE include/generic/rte_cpuflags.h
  SYMLINK-FILE include/generic/rte_rwlock.h
  SYMLINK-FILE include/generic/rte_vect.h
  SYMLINK-FILE include/generic/rte_pause.h
  SYMLINK-FILE include/generic/rte_io.h
make[6]: warning:  Clock skew detected.  Your build may be incomplete.
== Build lib/librte_eal/linux
== Build lib/librte_eal/linux/eal
  SYMLINK-FILE include/exec-env/rte_kni_common.h
  CC eal.o
  CC eal_cpuflags.o
--
  INSTALL-LIB librte_member.a
  AR librte_sched.a
  INSTALL-LIB librte_sched.a
  AR librte_ethdev.a
  INSTALL-LIB librte_ethdev.a
make[5]: warning:  Clock skew detected.  Your build may be incomplete.
== Build lib/librte_security
== Build lib/librte_eventdev
== Build lib/librte_rawdev
== Build lib/librte_vhost
== Build lib/librte_ip_frag
--
  CC ice_flow.o
  CC ice_ethdev.o
  CC ice_rxtx.o
  CC i40e_diag.o
/tmp/UBT144-32_K3.13.0_GCC4.8.4/i686-native-linuxapp-gcc/72cd20e70e0a4f79b24b3cfb924d409e/dpdk/drivers/net/ice/ice_ethdev.c: In function ‘ice_load_pkg’:
/tmp/UBT144-32_K3.13.0_GCC4.8.4/i686-native-linuxapp-gcc/72cd20e70e0a4f79b24b3cfb924d409e/dpdk/drivers/net/ice/ice_ethdev.c:1279:15: error: ‘pkg_path’ undeclared (first use in this function)
  file = fopen(pkg_path, "rb");
               ^
/tmp/UBT144-32_K3.13.0_GCC4.8.4/i686-native-linuxapp-gcc/72cd20e70e0a4f79b24b3cfb924d409e/dpdk/drivers/net/ice/ice_ethdev.c:1279:15: note: each undeclared identifier is reported only once for each function it appears in
  CC e1000_logs.o
  CC fm10k_rxtx_vec.o
--
  CC rte_pmd_ixgbe.o
  CC ixgbe_tm.o
  LD i40e_ethdev.o
  AR librte_pmd_i40e.a
  INSTALL-LIB librte_pmd_i40e.a
make[6]: warning:  Clock skew detected.  Your build may be incomplete.
  CC ixgbe_vf_representor.o
  PMDINFO ixgbe_ethdev.o.pmd.c
  CC ixgbe_ethdev.o.pmd.o
  LD ixgbe_ethdev.o
  AR librte_pmd_ixgbe.a
  INSTALL-LIB librte_pmd_ixgbe.a
make[6]: warning:  Clock skew detected.  Your build may be incomplete.
make[4]: *** [net] Error 2
make[3]: *** [drivers] Error 2
make[2]: *** [all] Error 2
make[1]: *** [pre_install] Error 2
make: *** [install] Error 2

*Failed Build #8:
OS: UBT1810
Target: x86_64-native-linuxapp-gcc
  SYMLINK-FILE include/generic/rte_cpuflags.h
  SYMLINK-FILE include/generic/rte_rwlock.h
  SYMLINK-FILE include/generic/rte_vect.h
  SYMLINK-FILE include/generic/rte_pause.h
  SYMLINK-FILE include/generic/rte_io.h
make[6]: warning:  Clock skew detected.  Your build may be incomplete.
== Build lib/librte_eal/linux
== Build lib/librte_eal/linux/eal
  SYMLINK-FILE include/exec-env/rte_kni_common.h
  CC eal_cpuflags.o
  CC eal_hugepage_info.o
--
  CC ethdev_profile.o
  AR librte_sched.a
  INSTALL-LIB librte_sched.a
  AR librte_ethdev.a
  INSTALL-LIB librte_ethdev.a
make[5]: warning:  Clock skew detected.  Your build may be incomplete.
== Build lib/librte_security
== Build lib/librte_eventdev
== Build lib/librte_rawdev
== Build lib/librte_vhost
== Build lib/librte_ip_frag
--
  CC lio_23xx_vf.o
  CC ixgbe_82599.o
  AR librte_pmd_netvsc.a
== Build drivers/net/nfp
  INSTALL-LIB librte_pmd_netvsc.a
make[6]: warning:  Clock skew detected.  Your build may be incomplete.
  CC lio_mbox.o
== Build drivers/net/bnxt
  CC ice_sched.o
  CC i40e_flow.o
  CC ixgbe_x540.o
--
  CC ixgbe_rxtx.o
  CC bnxt_hwrm.o
  CC bnxt_ring.o
  CC rte_eth_pcap.o
/tmp/UBT1810_K4.18.0_GCC8.2.0/x86_64-native-linuxapp-gcc/72cd20e70e0a4f79b24b3cfb924d409e/dpdk/drivers/net/ice/ice_ethdev.c: In function ‘ice_load_pkg’:
/tmp/UBT1810_K4.18.0_GCC8.2.0/x86_64-native-linuxapp-gcc/72cd20e70e0a4f79b24b3cfb924d409e/dpdk/drivers/net/ice/ice_ethdev.c:1279:15: error: ‘pkg_path’ undeclared (first use in this function); did you mean ‘pkg_file’?
  file = fopen(pkg_path, "rb");
               ^~~~~~~~
               pkg_file
/tmp/UBT1810_K4.18.0_GCC8.2.0/x86_64-native-linuxapp-gcc/72cd20e70e0a4f79b24b3cfb924d409e/dpdk/drivers/net/ice/ice_ethdev.c:1279:15: note: each undeclared identifier is reported only once for each function it appears in
  PMDINFO octeontx_ethdev.o.pmd.c
--
  AR librte_pmd_nfp.a
  INSTALL-LIB librte_pmd_nfp.a
  CC ecore_hw.o
  AR librte_pmd_i40e.a
  INSTALL-LIB librte_pmd_i40e.a
make[6]: warning:  Clock skew detected.  Your build may be incomplete.
  CC ixgbe_flow.o
  CC ecore_cxt.o
  PMDINFO rte_eth_pcap.o.pmd.c
  CC rte_eth_pcap.o.pmd.o
  LD rte_eth_pcap.o
--
  CC ecore_vf.o
  CC qede_ethdev.o
  AR librte_pmd_ixgbe.a
  INSTALL-LIB librte_pmd_ixgbe.a
  CC qede_main.o
make[6]: warning:  Clock skew detected.  Your build may be incomplete.
  CC qede_rxtx.o
  AR librte_pmd_bnxt.a
  INSTALL-LIB librte_pmd_bnxt.a
  CC qede_filter.o
  PMDINFO qede_ethdev.o.pmd.c

*Failed Build #9:
OS: RHEL75
Target: x86_64-native-linuxapp-gcc
  CC ice_flow.o
  CC e1000_phy.o
  CC ice_ethdev.o
  CC ice_rxtx.o
/tmp/RHEL75_K3.10.0_GCC4.8.5/x86_64-native-linuxapp-gcc/72cd20e70e0a4f79b24b3cfb924d409e/dpdk/drivers/net/ice/ice_ethdev.c: In function ‘ice_load_pkg’:
/tmp/RHEL75_K3.10.0_GCC4.8.5/x86_64-native-linuxapp-gcc/72cd20e70e0a4f79b24b3cfb924d409e/dpdk/drivers/net/ice/ice_ethdev.c:1279:15: error: ‘pkg_path’ undeclared (first use in this function)
  file = fopen(pkg_path, "rb");
               ^
/tmp/RHEL75_K3.10.0_GCC4.8.5/x86_64-native-linuxapp-gcc/72cd20e70e0a4f79b24b3cfb924d409e/dpdk/drivers/net/ice/ice_ethdev.c:1279:15: note: each undeclared identifier is reported only once for each function it appears in
make[6]: *** [ice_ethdev.o] Error 1
make[6]: *** Waiting for unfinished jobs....

*Failed Build #10:
OS: FC28
Target: x86_64-native-linuxapp-gcc
  CC hn_ethdev.o
== Build drivers/net/bnxt
  CC i40e_pf.o
  CC hn_rxtx.o
/tmp/FC28_K4.16.3_GCC8.0.1/x86_64-native-linuxapp-gcc/72cd20e70e0a4f79b24b3cfb924d409e/dpdk/drivers/net/ice/ice_ethdev.c: In function ‘ice_load_pkg’:
/tmp/FC28_K4.16.3_GCC8.0.1/x86_64-native-linuxapp-gcc/72cd20e70e0a4f79b24b3cfb924d409e/dpdk/drivers/net/ice/ice_ethdev.c:1279:15: error: ‘pkg_path’ undeclared (first use in this function); did you mean ‘pkg_file’?
  file = fopen(pkg_path, "rb");
               ^~~~~~~~
               pkg_file
/tmp/FC28_K4.16.3_GCC8.0.1/x86_64-native-linuxapp-gcc/72cd20e70e0a4f79b24b3cfb924d409e/dpdk/drivers/net/ice/ice_ethdev.c:1279:15: note: each undeclared identifier is reported only once for each function it appears in
make[6]: *** [/tmp/FC28_K4.16.3_GCC8.0.1/x86_64-native-linuxapp-gcc/72cd20e70e0a4f79b24b3cfb924d409e/dpdk/mk/internal/rte.compile-pre.mk:114: ice_ethdev.o] Error 1

*Failed Build #11:
OS: FC28
Target: x86_64-native-linuxapp-clang
  CC ice_ethdev.o
  CC rte_eth_null.o
  CC bnxt_cpr.o
  CC nfp_cpp_pcie_ops.o
  CC octeontx_rxtx.o
/tmp/FC28_K4.16.3_Clang6.0.1/x86_64-native-linuxapp-clang/72cd20e70e0a4f79b24b3cfb924d409e/dpdk/drivers/net/ice/ice_ethdev.c:1279:15: error: use of undeclared identifier 'pkg_path'
        file = fopen(pkg_path, "rb");
                     ^
/tmp/FC28_K4.16.3_Clang6.0.1/x86_64-native-linuxapp-clang/72cd20e70e0a4f79b24b3cfb924d409e/dpdk/drivers/net/ice/ice_ethdev.c:1285:13: error: use of undeclared identifier 'pkg_path'
        err = stat(pkg_path, &fstat);
                   ^
  CC bnxt_ethdev.o
2 errors generated.
make[6]: *** [/tmp/FC28_K4.16.3_Clang6.0.1/x86_64-native-linuxapp-clang/72cd20e70e0a4f79b24b3cfb924d409e/dpdk/mk/internal/rte.compile-pre.mk:116: ice_ethdev.o] Error 1
make[5]: *** [/tmp/FC28_K4.16.3_Clang6.0.1/x86_64-native-linuxapp-clang/72cd20e70e0a4f79b24b3cfb924d409e/dpdk/mk/rte.subdir.mk:37: ice] Error 2
make[5]: *** Waiting for unfinished jobs....
  CC bnxt_filter.o
  PMDINFO em_ethdev.o.pmd.c

*Failed Build #12:
OS: FreeBSD11.2
Target: x86_64-native-bsdapp-gcc
  SYMLINK-FILE include/generic/rte_cpuflags.h
  SYMLINK-FILE include/generic/rte_rwlock.h
  SYMLINK-FILE include/generic/rte_vect.h
  SYMLINK-FILE include/generic/rte_pause.h
  SYMLINK-FILE include/generic/rte_io.h
gmake[6]: warning:  Clock skew detected.  Your build may be incomplete.
== Build lib/librte_eal/freebsd
== Build lib/librte_eal/freebsd/eal
  CC eal.o
  CC eal_thread.o
  CC eal_cpuflags.o
--
  INSTALL-LIB librte_efd.a
  AR librte_sched.a
  INSTALL-LIB librte_sched.a
  AR librte_ethdev.a
  INSTALL-LIB librte_ethdev.a
gmake[5]: warning:  Clock skew detected.  Your build may be incomplete.
== Build lib/librte_ip_frag
== Build lib/librte_rawdev
== Build lib/librte_latencystats
== Build lib/librte_bitratestats
== Build lib/librte_gro
--
awk -f /usr/src/sys/tools/makeobjops.awk /usr/src/sys/kern/device_if.m -h
awk -f /usr/src/sys/tools/makeobjops.awk /usr/src/sys/kern/bus_if.m -h
awk -f /usr/src/sys/tools/makeobjops.awk /usr/src/sys/kern/bus_if.m -h
awk -f /usr/src/sys/tools/makeobjops.awk /usr/src/sys/dev/pci/pci_if.m -h
Warning: Object directory not changed from original /tmp/FreeBSD11.2_K11.2_GCC6.4.0/x86_64-native-bsdapp-gcc/72cd20e70e0a4f79b24b3cfb924d409e/dpdk/x86_64-native-bsdapp-gcc/build/kernel/freebsd/contigmem
cc -Winline -Wall -Werror -include /tmp/FreeBSD11.2_K11.2_GCC6.4.0/x86_64-native-bsdapp-gcc/72cd20e70e0a4f79b24b3cfb924d409e/dpdk/x86_64-native-bsdapp-gcc/include/rte_config.h  -Werror -D_KERNEL -DKLD_MODULE -nostdinc  -I/tmp/FreeBSD11.2_K11.2_GCC6.4.0/x86_64-native-bsdapp-gcc/72cd20e70e0a4f79b24b3cfb924d409e/dpdk/kernel/freebsd/contigmem -I/tmp/FreeBSD11.2_K11.2_GCC6.4.0/x86_64-native-bsdapp-gcc/72cd20e70e0a4f79b24b3cfb924d409e/dpdk/x86_64-native-bsdapp-gcc/include -I. -I/usr/src/sys -fno-common  -fno-omit-frame-pointer -mno-omit-leaf-frame-pointer   -MD  -MF.depend.contigmem.o -MTcontigmem.o -mcmodel=kernel -mno-red-zone -mno-mmx -mno-sse -msoft-float  -fno-asynchronous-unwind-tables -ffreestanding -fwrapv -fstack-protector -Wall -Wredundant-decls -Wnested-externs -Wstrict-prototypes -Wmissing-prototypes -Wpointer-arith -Winline -Wcast-qual -Wundef -Wno-pointer-sign -D__printf__=__freebsd_kprintf__ -Wmissing-include-dirs -fdiagnostics-show-option -Wno-unknown-pragmas -Wno-error-tautological-compare -Wno-error-empty-body -Wno-error-parentheses-equality -Wno-error-unused-function -Wno-error-pointer-sign -Wno-error-shift-negative-value -Wno-error-address-of-packed-member  -mno-aes -mno-avx  -std=iso9899:1999 -c contigmem.c -o contigmem.o
Warning: Object directory not changed from original /tmp/FreeBSD11.2_K11.2_GCC6.4.0/x86_64-native-bsdapp-gcc/72cd20e70e0a4f79b24b3cfb924d409e/dpdk/x86_64-native-bsdapp-gcc/build/kernel/freebsd/nic_uio
cc -Winline -Wall -Werror -include /tmp/FreeBSD11.2_K11.2_GCC6.4.0/x86_64-native-bsdapp-gcc/72cd20e70e0a4f79b24b3cfb924d409e/dpdk/x86_64-native-bsdapp-gcc/include/rte_config.h  -Werror -D_KERNEL -DKLD_MODULE -nostdinc  -I/tmp/FreeBSD11.2_K11.2_GCC6.4.0/x86_64-native-bsdapp-gcc/72cd20e70e0a4f79b24b3cfb924d409e/dpdk/kernel/freebsd/nic_uio -I/tmp/FreeBSD11.2_K11.2_GCC6.4.0/x86_64-native-bsdapp-gcc/72cd20e70e0a4f79b24b3cfb924d409e/dpdk/x86_64-native-bsdapp-gcc/include -I. -I/usr/src/sys -fno-common  -fno-omit-frame-pointer -mno-omit-leaf-frame-pointer   -MD  -MF.depend.nic_uio.o -MTnic_uio.o -mcmodel=kernel -mno-red-zone -mno-mmx -mno-sse -msoft-float  -fno-asynchronous-unwind-tables -ffreestanding -fwrapv -fstack-protector -Wall -Wredundant-decls -Wnested-externs -Wstrict-prototypes -Wmissing-prototypes -Wpointer-arith -Winline -Wcast-qual -Wundef -Wno-pointer-sign -D__printf__=__freebsd_kprintf__ -Wmissing-include-dirs -fdiagnostics-show-option -Wno-unknown-pragmas -Wno-error-tautological-compare -Wno-error-empty-body -Wno-error-parentheses-equality -Wno-error-unused-function -Wno-error-pointer-sign -Wno-error-shift-negative-value -Wno-error-address-of-packed-member  -mno-aes -mno-avx  -std=iso9899:1999 -c nic_uio.c -o nic_uio.o
== Build drivers/common
ld -L/tmp/FreeBSD11.2_K11.2_GCC6.4.0/x86_64-native-bsdapp-gcc/72cd20e70e0a4f79b24b3cfb924d409e/dpdk/x86_64-native-bsdapp-gcc/lib -d -warn-common -r -d -o contigmem.ko contigmem.o
:> export_syms
awk -f /usr/src/sys/conf/kmod_syms.awk contigmem.ko  export_syms | xargs -J% objcopy % contigmem.ko
ld -L/tmp/FreeBSD11.2_K11.2_GCC6.4.0/x86_64-native-bsdapp-gcc/72cd20e70e0a4f79b24b3cfb924d409e/dpdk/x86_64-native-bsdapp-gcc/lib -d -warn-common -r -d -o nic_uio.ko nic_uio.o
--
== Build drivers/net/sfc
  CC ixgbe_vf.o
  CC i40e_vf_representor.o
  CC bnxt_rxr.o
/tmp/FreeBSD11.2_K11.2_GCC6.4.0/x86_64-native-bsdapp-gcc/72cd20e70e0a4f79b24b3cfb924d409e/dpdk/drivers/net/ice/ice_ethdev.c: In function 'ice_load_pkg':
/tmp/FreeBSD11.2_K11.2_GCC6.4.0/x86_64-native-bsdapp-gcc/72cd20e70e0a4f79b24b3cfb924d409e/dpdk/drivers/net/ice/ice_ethdev.c:1279:15: error: 'pkg_path' undeclared (first use in this function)
  file = fopen(pkg_path, "rb");
               ^~~~~~~~
/tmp/FreeBSD11.2_K11.2_GCC6.4.0/x86_64-native-bsdapp-gcc/72cd20e70e0a4f79b24b3cfb924d409e/dpdk/drivers/net/ice/ice_ethdev.c:1279:15: note: each undeclared identifier is reported only once for each function it appears in
gmake[6]: *** [/tmp/FreeBSD11.2_K11.2_GCC6.4.0/x86_64-native-bsdapp-gcc/72cd20e70e0a4f79b24b3cfb924d409e/dpdk/mk/internal/rte.compile-pre.mk:116: ice_ethdev.o] Error 1
gmake[6]: *** Waiting for unfinished jobs....
--
  CC ecore_hw.o
  AR librte_pmd_i40e.a
  INSTALL-LIB librte_pmd_i40e.a
  CC ixgbe_dcb_82598.o
  AR librte_pmd_pcap.a
gmake[6]: warning:  Clock skew detected.  Your build may be incomplete.
  CC ecore_cxt.o
  INSTALL-LIB librte_pmd_pcap.a
  CC bnxt_irq.o
  CC sfc_ethdev.o
  CC ecore_l2.o
--
  CC efx_bootcfg.o
  CC efx_crc32.o
  AR librte_pmd_ixgbe.a
  INSTALL-LIB librte_pmd_ixgbe.a
  CC efx_ev.o
gmake[6]: warning:  Clock skew detected.  Your build may be incomplete.
  CC efx_filter.o
  CC efx_hash.o
  CC efx_intr.o
  CC efx_lic.o
  CC efx_mac.o

*Failed Build #13:
OS: FreeBSD12.0
Target: x86_64-native-bsdapp-clang
  SYMLINK-FILE include/generic/rte_rwlock.h
  SYMLINK-FILE include/generic/rte_cpuflags.h
  SYMLINK-FILE include/generic/rte_vect.h
  SYMLINK-FILE include/generic/rte_pause.h
  SYMLINK-FILE include/generic/rte_io.h
gmake[6]: warning:  Clock skew detected.  Your build may be incomplete.
== Build lib/librte_eal/freebsd
== Build lib/librte_eal/freebsd/eal
  CC eal.o
  CC eal_hugepage_info.o
  CC eal_memory.o
--
  CC rte_ethdev.o
  AR librte_sched.a
  INSTALL-LIB librte_sched.a
  AR librte_ethdev.a
  INSTALL-LIB librte_ethdev.a
gmake[5]: warning:  Clock skew detected.  Your build may be incomplete.
== Build lib/librte_security
== Build lib/librte_rawdev
== Build lib/librte_eventdev
== Build lib/librte_ip_frag
== Build lib/librte_latencystats
--
awk -f /usr/src/sys/tools/makeobjops.awk /usr/src/sys/kern/bus_if.m -h
awk -f /usr/src/sys/tools/makeobjops.awk /usr/src/sys/kern/bus_if.m -h
== Build drivers/common
awk -f /usr/src/sys/tools/makeobjops.awk /usr/src/sys/dev/pci/pci_if.m -h
Warning: Object directory not changed from original /tmp/FreeBSD12.0_K19.02_Clang6.0.1/x86_64-native-bsdapp-clang/72cd20e70e0a4f79b24b3cfb924d409e/dpdk/x86_64-native-bsdapp-clang/build/kernel/freebsd/contigmem
cc  -Winline -Wall -Werror -include /tmp/FreeBSD12.0_K19.02_Clang6.0.1/x86_64-native-bsdapp-clang/72cd20e70e0a4f79b24b3cfb924d409e/dpdk/x86_64-native-bsdapp-clang/include/rte_config.h  -Werror -D_KERNEL -DKLD_MODULE -nostdinc  -I/tmp/FreeBSD12.0_K19.02_Clang6.0.1/x86_64-native-bsdapp-clang/72cd20e70e0a4f79b24b3cfb924d409e/dpdk/kernel/freebsd/contigmem -I/tmp/FreeBSD12.0_K19.02_Clang6.0.1/x86_64-native-bsdapp-clang/72cd20e70e0a4f79b24b3cfb924d409e/dpdk/x86_64-native-bsdapp-clang/include -I. -I/usr/src/sys -I/usr/src/sys/contrib/ck/include -fno-common  -fno-omit-frame-pointer -mno-omit-leaf-frame-pointer   -MD  -MF.depend.contigmem.o -MTcontigmem.o -mcmodel=kernel -mno-red-zone -mno-mmx -mno-sse -msoft-float  -fno-asynchronous-unwind-tables -ffreestanding -fwrapv -fstack-protector -Wall -Wredundant-decls -Wnested-externs -Wstrict-prototypes -Wmissing-prototypes -Wpointer-arith -Wcast-qual -Wundef -Wno-pointer-sign -D__printf__=__freebsd_kprintf__ -Wmissing-include-dirs -fdiagnostics-show-option -Wno-unknown-pragmas -Wno-error-tautological-compare -Wno-error-empty-body -Wno-error-parentheses-equality -Wno-error-unused-function -Wno-error-pointer-sign -Wno-error-shift-negative-value -Wno-address-of-packed-member  -mno-aes -mno-avx  -std=iso9899:1999 -c contigmem.c -o contigmem.o
Warning: Object directory not changed from original /tmp/FreeBSD12.0_K19.02_Clang6.0.1/x86_64-native-bsdapp-clang/72cd20e70e0a4f79b24b3cfb924d409e/dpdk/x86_64-native-bsdapp-clang/build/kernel/freebsd/nic_uio
cc  -Winline -Wall -Werror -include /tmp/FreeBSD12.0_K19.02_Clang6.0.1/x86_64-native-bsdapp-clang/72cd20e70e0a4f79b24b3cfb924d409e/dpdk/x86_64-native-bsdapp-clang/include/rte_config.h  -Werror -D_KERNEL -DKLD_MODULE -nostdinc  -I/tmp/FreeBSD12.0_K19.02_Clang6.0.1/x86_64-native-bsdapp-clang/72cd20e70e0a4f79b24b3cfb924d409e/dpdk/kernel/freebsd/nic_uio -I/tmp/FreeBSD12.0_K19.02_Clang6.0.1/x86_64-native-bsdapp-clang/72cd20e70e0a4f79b24b3cfb924d409e/dpdk/x86_64-native-bsdapp-clang/include -I. -I/usr/src/sys -I/usr/src/sys/contrib/ck/include -fno-common  -fno-omit-frame-pointer -mno-omit-leaf-frame-pointer   -MD  -MF.depend.nic_uio.o -MTnic_uio.o -mcmodel=kernel -mno-red-zone -mno-mmx -mno-sse -msoft-float  -fno-asynchronous-unwind-tables -ffreestanding -fwrapv -fstack-protector -Wall -Wredundant-decls -Wnested-externs -Wstrict-prototypes -Wmissing-prototypes -Wpointer-arith -Wcast-qual -Wundef -Wno-pointer-sign -D__printf__=__freebsd_kprintf__ -Wmissing-include-dirs -fdiagnostics-show-option -Wno-unknown-pragmas -Wno-error-tautological-compare -Wno-error-empty-body -Wno-error-parentheses-equality -Wno-error-unused-function -Wno-error-pointer-sign -Wno-error-shift-negative-value -Wno-address-of-packed-member  -mno-aes -mno-avx  -std=iso9899:1999 -c nic_uio.c -o nic_uio.o
== Build drivers/common/octeontx
== Build drivers/common/cpt
  CC cpt_pmd_ops_helper.o
  CC octeontx_mbox.o
ld -m elf_x86_64_fbsd -L/tmp/FreeBSD12.0_K19.02_Clang6.0.1/x86_64-native-bsdapp-clang/72cd20e70e0a4f79b24b3cfb924d409e/dpdk/x86_64-native-bsdapp-clang/lib -d -warn-common --build-id=sha1 -r -d -o nic_uio.ko nic_uio.o
--
== Build drivers/net/pcap
  AR librte_pmd_null.a
  INSTALL-LIB librte_pmd_null.a
/tmp/FreeBSD12.0_K19.02_Clang6.0.1/x86_64-native-bsdapp-clang/72cd20e70e0a4f79b24b3cfb924d409e/dpdk/drivers/net/ice/ice_ethdev.c:1279:15  CC igb_pf.o
  CC octeontx_pkovf.o
: error: use of undeclared identifier 'pkg_path'
        file = fopen(pkg_path, "rb");
  CC octeontx_pkivf.o
                     ^
/tmp/FreeBSD12.0_K19.02_Clang6.0.1/x86_64-native-bsdapp-clang/72cd20e70e0a4f79b24b3cfb924d409e/dpdk/drivers/net/ice/ice_ethdev.c:1285:13: error: use of undeclared identifier 'pkg_path'
        err = stat(pkg_path, &fstat);
                   ^
  PMDINFO octeontx_pkovf.o.pmd.c
  CC octeontx_pkovf.o.pmd.o
2  LD octeontx_pkovf.o
  PMDINFO octeontx_pkivf.o.pmd.c
 errors generated  CC octeontx_pkivf.o.pmd.o
.
gmake[6]: *** [/tmp/FreeBSD12.0_K19.02_Clang6.0.1/x86_64-native-bsdapp-clang/72cd20e70e0a4f79b24b3cfb924d409e/dpdk/mk/internal/rte.compile-pre.mk:114: ice_ethdev.o] Error 1
gmake[6]: *** Waiting for unfinished jobs....
  CC ixgbe_vf.o
  CC i40e_ethdev.o
--
  CC ixgbe_tm.o
  CC ixgbe_vf_representor.o
  CC i40e_rxtx_vec_avx2.o
  AR librte_pmd_ixgbe.a
  INSTALL-LIB librte_pmd_ixgbe.a
gmake[6]: warning:  Clock skew detected.  Your build may be incomplete.
  AR librte_pmd_i40e.a
  INSTALL-LIB librte_pmd_i40e.a
gmake[6]: warning:  Clock skew detected.  Your build may be incomplete.
gmake[4]: *** [/tmp/FreeBSD12.0_K19.02_Clang6.0.1/x86_64-native-bsdapp-clang/72cd20e70e0a4f79b24b3cfb924d409e/dpdk/mk/rte.subdir.mk:35: net] Error 2
gmake[3]: *** [/tmp/FreeBSD12.0_K19.02_Clang6.0.1/x86_64-native-bsdapp-clang/72cd20e70e0a4f79b24b3cfb924d409e/dpdk/mk/rte.sdkbuild.mk:46: drivers] Error 2
gmake[2]: *** [/tmp/FreeBSD12.0_K19.02_Clang6.0.1/x86_64-native-bsdapp-clang/72cd20e70e0a4f79b24b3cfb924d409e/dpdk/mk/rte.sdkroot.mk:99: all] Error 2
gmake[1]: *** [/tmp/FreeBSD12.0_K19.02_Clang6.0.1/x86_64-native-bsdapp-clang/72cd20e70e0a4f79b24b3cfb924d409e/dpdk/mk/rte.sdkinstall.mk:61: pre_install] Error 2
gmake: *** [/tmp/FreeBSD12.0_K19.02_Clang6.0.1/x86_64-native-bsdapp-clang/72cd20e70e0a4f79b24b3cfb924d409e/dpdk/mk/rte.sdkroot.mk:77: install] Error 2

*Failed Build #14:
OS: FreeBSD11.2
Target: x86_64-native-bsdapp-clang
  SYMLINK-FILE include/generic/rte_cpuflags.h
  SYMLINK-FILE include/generic/rte_rwlock.h
  SYMLINK-FILE include/generic/rte_vect.h
  SYMLINK-FILE include/generic/rte_pause.h
  SYMLINK-FILE include/generic/rte_io.h
gmake[6]: warning:  Clock skew detected.  Your build may be incomplete.
== Build lib/librte_eal/freebsd
== Build lib/librte_eal/freebsd/eal
  CC eal.o
  CC eal_cpuflags.o
  CC eal_memory.o
--
  CC rte_mtr.o
  AR librte_sched.a
  INSTALL-LIB librte_sched.a
  AR librte_ethdev.a
  INSTALL-LIB librte_ethdev.a
gmake[5]: warning:  Clock skew detected.  Your build may be incomplete.
== Build lib/librte_gro
== Build lib/librte_ip_frag
== Build lib/librte_bitratestats
== Build lib/librte_rawdev
== Build lib/librte_distributor
--
awk -f /usr/src/sys/tools/makeobjops.awk /usr/src/sys/kern/device_if.m -h
awk -f /usr/src/sys/tools/makeobjops.awk /usr/src/sys/kern/bus_if.m -h
machine -> /usr/src/sys/amd64/include
awk -f /usr/src/sys/tools/makeobjops.awk /usr/src/sys/dev/pci/pci_if.m -h
Warning: Object directory not changed from original /tmp/FreeBSD11.2_K11.2_Clang6.0.0/x86_64-native-bsdapp-clang/72cd20e70e0a4f79b24b3cfb924d409e/dpdk/x86_64-native-bsdapp-clang/build/kernel/freebsd/nic_uio
cc -Winline -Wall -Werror -include /tmp/FreeBSD11.2_K11.2_Clang6.0.0/x86_64-native-bsdapp-clang/72cd20e70e0a4f79b24b3cfb924d409e/dpdk/x86_64-native-bsdapp-clang/include/rte_config.h  -Werror -D_KERNEL -DKLD_MODULE -nostdinc  -I/tmp/FreeBSD11.2_K11.2_Clang6.0.0/x86_64-native-bsdapp-clang/72cd20e70e0a4f79b24b3cfb924d409e/dpdk/kernel/freebsd/nic_uio -I/tmp/FreeBSD11.2_K11.2_Clang6.0.0/x86_64-native-bsdapp-clang/72cd20e70e0a4f79b24b3cfb924d409e/dpdk/x86_64-native-bsdapp-clang/include -I. -I/usr/src/sys -fno-common  -fno-omit-frame-pointer -mno-omit-leaf-frame-pointer   -MD  -MF.depend.nic_uio.o -MTnic_uio.o -mcmodel=kernel -mno-red-zone -mno-mmx -mno-sse -msoft-float  -fno-asynchronous-unwind-tables -ffreestanding -fwrapv -fstack-protector -Wall -Wredundant-decls -Wnested-externs -Wstrict-prototypes -Wmissing-prototypes -Wpointer-arith -Winline -Wcast-qual -Wundef -Wno-pointer-sign -D__printf__=__freebsd_kprintf__ -Wmissing-include-dirs -fdiagnostics-show-option -Wno-unknown-pragmas -Wno-error-tautological-compare -Wno-error-empty-body -Wno-error-parentheses-equality -Wno-error-unused-function -Wno-error-pointer-sign -Wno-error-shift-negative-value -Wno-error-address-of-packed-member  -mno-aes -mno-avx  -std=iso9899:1999 -c nic_uio.c -o nic_uio.o
== Build drivers/common
x86 -> /usr/src/sys/x86/include
awk -f /usr/src/sys/tools/makeobjops.awk /usr/src/sys/kern/device_if.m -h
awk -f /usr/src/sys/tools/makeobjops.awk /usr/src/sys/kern/bus_if.m -h
Warning: Object directory not changed from original /tmp/FreeBSD11.2_K11.2_Clang6.0.0/x86_64-native-bsdapp-clang/72cd20e70e0a4f79b24b3cfb924d409e/dpdk/x86_64-native-bsdapp-clang/build/kernel/freebsd/contigmem
cc -Winline -Wall -Werror -include /tmp/FreeBSD11.2_K11.2_Clang6.0.0/x86_64-native-bsdapp-clang/72cd20e70e0a4f79b24b3cfb924d409e/dpdk/x86_64-native-bsdapp-clang/include/rte_config.h  -Werror -D_KERNEL -DKLD_MODULE -nostdinc  -I/tmp/FreeBSD11.2_K11.2_Clang6.0.0/x86_64-native-bsdapp-clang/72cd20e70e0a4f79b24b3cfb924d409e/dpdk/kernel/freebsd/contigmem -I/tmp/FreeBSD11.2_K11.2_Clang6.0.0/x86_64-native-bsdapp-clang/72cd20e70e0a4f79b24b3cfb924d409e/dpdk/x86_64-native-bsdapp-clang/include -I. -I/usr/src/sys -fno-common  -fno-omit-frame-pointer -mno-omit-leaf-frame-pointer   -MD  -MF.depend.contigmem.o -MTcontigmem.o -mcmodel=kernel -mno-red-zone -mno-mmx -mno-sse -msoft-float  -fno-asynchronous-unwind-tables -ffreestanding -fwrapv -fstack-protector -Wall -Wredundant-decls -Wnested-externs -Wstrict-prototypes -Wmissing-prototypes -Wpointer-arith -Winline -Wcast-qual -Wundef -Wno-pointer-sign -D__printf__=__freebsd_kprintf__ -Wmissing-include-dirs -fdiagnostics-show-option -Wno-unknown-pragmas -Wno-error-tautological-compare -Wno-error-empty-body -Wno-error-parentheses-equality -Wno-error-unused-function -Wno-error-pointer-sign -Wno-error-shift-negative-value -Wno-error-address-of-packed-member  -mno-aes -mno-avx  -std=iso9899:1999 -c contigmem.c -o contigmem.o
ld -L/tmp/FreeBSD11.2_K11.2_Clang6.0.0/x86_64-native-bsdapp-clang/72cd20e70e0a4f79b24b3cfb924d409e/dpdk/x86_64-native-bsdapp-clang/lib -d -warn-common -r -d -o contigmem.ko contigmem.o
:> export_syms
awk -f /usr/src/sys/conf/kmod_syms.awk contigmem.ko  export_syms | xargs -J% objcopy % contigmem.ko
== Build drivers/common/cpt
== Build drivers/common/octeontx
--
  LD octeontx_pkivf.o
  INSTALL-LIB librte_pmd_e1000.a
  CC ixgbe_dcb.o
  CC octeontx_bgx.o
  CC ice_rxtx.o
/tmp/FreeBSD11.2_K11.2_Clang6.0.0/x86_64-native-bsdapp-clang/72cd20e70e0a4f79b24b3cfb924d409e/dpdk/drivers/net/ice/ice_ethdev.c:1279:15: error: use of undeclared identifier 'pkg_path'
        file = fopen(pkg_path, "rb");
                     ^
/tmp/FreeBSD11.2_K11.2_Clang6.0.0/x86_64-native-bsdapp-clang/72cd20e70e0a4f79b24b3cfb924d409e/dpdk/drivers/net/ice/ice_ethdev.c:1285:13: error: use of undeclared identifier 'pkg_path'
        err = stat(pkg_path, &fstat);
                   ^
2 errors generated.
  CC bnxt_hwrm.o
gmake[6]: *** [/tmp/FreeBSD11.2_K11.2_Clang6.0.0/x86_64-native-bsdapp-clang/72cd20e70e0a4f79b24b3cfb924d409e/dpdk/mk/internal/rte.compile-pre.mk:116: ice_ethdev.o] Error 1
gmake[6]: *** Waiting for unfinished jobs....
  CC octeontx_ethdev.o
== Build drivers/net/pcap
--
  CC ixgbe_ipsec.o
  CC rte_pmd_ixgbe.o
  AR librte_pmd_i40e.a
  CC bnxt_irq.o
  INSTALL-LIB librte_pmd_i40e.a
gmake[6]: warning:  Clock skew detected.  Your build may be incomplete.
  CC ixgbe_tm.o
  CC bnxt_util.o
  CC ecore_init_fw_funcs.o
  CC rte_pmd_bnxt.o
  CC ecore_spq.o
--
  CC ecore_vf.o
  AR librte_pmd_ixgbe.a
  INSTALL-LIB librte_pmd_ixgbe.a
  CC qede_ethdev.o
  CC qede_main.o
gmake[6]: warning:  Clock skew detected.  Your build may be incomplete.
  CC qede_rxtx.o
  CC qede_filter.o
  PMDINFO qede_ethdev.o.pmd.c
  CC qede_ethdev.o.pmd.o
  LD qede_ethdev.o

*Failed Build #15:
OS: FreeBSD12.0
Target: x86_64-native-bsdapp-gcc
  SYMLINK-FILE include/generic/rte_cpuflags.h
  SYMLINK-FILE include/generic/rte_rwlock.h
  SYMLINK-FILE include/generic/rte_vect.h
  SYMLINK-FILE include/generic/rte_pause.h
  SYMLINK-FILE include/generic/rte_io.h
gmake[6]: warning:  Clock skew detected.  Your build may be incomplete.
== Build lib/librte_eal/freebsd
== Build lib/librte_eal/freebsd/eal
  CC eal.o
  CC eal_cpuflags.o
  CC eal_hugepage_info.o
--
  INSTALL-LIB librte_member.a
  AR librte_sched.a
  INSTALL-LIB librte_sched.a
  AR librte_ethdev.a
  INSTALL-LIB librte_ethdev.a
gmake[5]: warning:  Clock skew detected.  Your build may be incomplete.
== Build lib/librte_security
== Build lib/librte_rawdev
== Build lib/librte_eventdev
== Build lib/librte_gro
== Build lib/librte_bitratestats
--
awk -f /usr/src/sys/tools/makeobjops.awk /usr/src/sys/kern/device_if.m -h
awk -f /usr/src/sys/tools/makeobjops.awk /usr/src/sys/kern/bus_if.m -h
awk -f /usr/src/sys/tools/makeobjops.awk /usr/src/sys/kern/bus_if.m -h
awk -f /usr/src/sys/tools/makeobjops.awk /usr/src/sys/dev/pci/pci_if.m -h
Warning: Object directory not changed from original /tmp/FreeBSD12.0_K19.02_GCC7.3.0/x86_64-native-bsdapp-gcc/72cd20e70e0a4f79b24b3cfb924d409e/dpdk/x86_64-native-bsdapp-gcc/build/kernel/freebsd/nic_uio
cc  -Winline -Wall -Werror -include /tmp/FreeBSD12.0_K19.02_GCC7.3.0/x86_64-native-bsdapp-gcc/72cd20e70e0a4f79b24b3cfb924d409e/dpdk/x86_64-native-bsdapp-gcc/include/rte_config.h  -Werror -D_KERNEL -DKLD_MODULE -nostdinc  -I/tmp/FreeBSD12.0_K19.02_GCC7.3.0/x86_64-native-bsdapp-gcc/72cd20e70e0a4f79b24b3cfb924d409e/dpdk/kernel/freebsd/nic_uio -I/tmp/FreeBSD12.0_K19.02_GCC7.3.0/x86_64-native-bsdapp-gcc/72cd20e70e0a4f79b24b3cfb924d409e/dpdk/x86_64-native-bsdapp-gcc/include -I. -I/usr/src/sys -I/usr/src/sys/contrib/ck/include -fno-common  -fno-omit-frame-pointer -mno-omit-leaf-frame-pointer   -MD  -MF.depend.nic_uio.o -MTnic_uio.o -mcmodel=kernel -mno-red-zone -mno-mmx -mno-sse -msoft-float  -fno-asynchronous-unwind-tables -ffreestanding -fwrapv -fstack-protector -Wall -Wredundant-decls -Wnested-externs -Wstrict-prototypes -Wmissing-prototypes -Wpointer-arith -Wcast-qual -Wundef -Wno-pointer-sign -D__printf__=__freebsd_kprintf__ -Wmissing-include-dirs -fdiagnostics-show-option -Wno-unknown-pragmas -Wno-error-tautological-compare -Wno-error-empty-body -Wno-error-parentheses-equality -Wno-error-unused-function -Wno-error-pointer-sign -Wno-error-shift-negative-value -Wno-address-of-packed-member  -mno-aes -mno-avx  -std=iso9899:1999 -c nic_uio.c -o nic_uio.o
Warning: Object directory not changed from original /tmp/FreeBSD12.0_K19.02_GCC7.3.0/x86_64-native-bsdapp-gcc/72cd20e70e0a4f79b24b3cfb924d409e/dpdk/x86_64-native-bsdapp-gcc/build/kernel/freebsd/contigmem
cc  -Winline -Wall -Werror -include /tmp/FreeBSD12.0_K19.02_GCC7.3.0/x86_64-native-bsdapp-gcc/72cd20e70e0a4f79b24b3cfb924d409e/dpdk/x86_64-native-bsdapp-gcc/include/rte_config.h  -Werror -D_KERNEL -DKLD_MODULE -nostdinc  -I/tmp/FreeBSD12.0_K19.02_GCC7.3.0/x86_64-native-bsdapp-gcc/72cd20e70e0a4f79b24b3cfb924d409e/dpdk/kernel/freebsd/contigmem -I/tmp/FreeBSD12.0_K19.02_GCC7.3.0/x86_64-native-bsdapp-gcc/72cd20e70e0a4f79b24b3cfb924d409e/dpdk/x86_64-native-bsdapp-gcc/include -I. -I/usr/src/sys -I/usr/src/sys/contrib/ck/include -fno-common  -fno-omit-frame-pointer -mno-omit-leaf-frame-pointer   -MD  -MF.depend.contigmem.o -MTcontigmem.o -mcmodel=kernel -mno-red-zone -mno-mmx -mno-sse -msoft-float  -fno-asynchronous-unwind-tables -ffreestanding -fwrapv -fstack-protector -Wall -Wredundant-decls -Wnested-externs -Wstrict-prototypes -Wmissing-prototypes -Wpointer-arith -Wcast-qual -Wundef -Wno-pointer-sign -D__printf__=__freebsd_kprintf__ -Wmissing-include-dirs -fdiagnostics-show-option -Wno-unknown-pragmas -Wno-error-tautological-compare -Wno-error-empty-body -Wno-error-parentheses-equality -Wno-error-unused-function -Wno-error-pointer-sign -Wno-error-shift-negative-value -Wno-address-of-packed-member  -mno-aes -mno-avx  -std=iso9899:1999 -c contigmem.c -o contigmem.o
ld -m elf_x86_64_fbsd -L/tmp/FreeBSD12.0_K19.02_GCC7.3.0/x86_64-native-bsdapp-gcc/72cd20e70e0a4f79b24b3cfb924d409e/dpdk/x86_64-native-bsdapp-gcc/lib -d -warn-common --build-id=sha1 -r -d -o contigmem.ko contigmem.o
ld -m elf_x86_64_fbsd -L/tmp/FreeBSD12.0_K19.02_GCC7.3.0/x86_64-native-bsdapp-gcc/72cd20e70e0a4f79b24b3cfb924d409e/dpdk/x86_64-native-bsdapp-gcc/lib -d -warn-common --build-id=sha1 -r -d -o nic_uio.ko nic_uio.o
:> export_syms
:> export_syms
awk -f /usr/src/sys/conf/kmod_syms.awk nic_uio.ko  export_syms | xargs -J% objcopy % nic_uio.ko
--
== Build drivers/net/sfc
  CC ice_ethdev.o
  CC i40e_rxtx.o
  CC ixgbe_x550.o
/tmp/FreeBSD12.0_K19.02_GCC7.3.0/x86_64-native-bsdapp-gcc/72cd20e70e0a4f79b24b3cfb924d409e/dpdk/drivers/net/ice/ice_ethdev.c: In function 'ice_load_pkg':
/tmp/FreeBSD12.0_K19.02_GCC7.3.0/x86_64-native-bsdapp-gcc/72cd20e70e0a4f79b24b3cfb924d409e/dpdk/drivers/net/ice/ice_ethdev.c:1279:15: error: 'pkg_path' undeclared (first use in this function); did you mean 'pkg_file'?
  file = fopen(pkg_path, "rb");
               ^~~~~~~~
               pkg_file
/tmp/FreeBSD12.0_K19.02_GCC7.3.0/x86_64-native-bsdapp-gcc/72cd20e70e0a4f79b24b3cfb924d409e/dpdk/drivers/net/ice/ice_ethdev.c:1279:15: note: each undeclared identifier is reported only once for each function it appears in
gmake[6]: *** [/tmp/FreeBSD12.0_K19.02_GCC7.3.0/x86_64-native-bsdapp-gcc/72cd20e70e0a4f79b24b3cfb924d409e/dpdk/mk/internal/rte.compile-pre.mk:116: ice_ethdev.o] Error 1
--
  CC ecore_dcbx.o
  CC ixgbe_flow.o
  CC ixgbe_pf.o
  AR librte_pmd_i40e.a
  INSTALL-LIB librte_pmd_i40e.a
gmake[6]: warning:  Clock skew detected.  Your build may be incomplete.
  CC bcm_osal.o
  PMDINFO ixgbe_ethdev.o.pmd.c
  CC ixgbe_ethdev.o.pmd.o
  CC sfc_dp.o
  LD ixgbe_ethdev.o
--
  AR librte_pmd_ixgbe.a
  CC mcdi_mon.o
  CC siena_mac.o
  INSTALL-LIB librte_pmd_ixgbe.a
  CC efx_tx.o
gmake[6]: warning:  Clock skew detected.  Your build may be incomplete.
  CC siena_mcdi.o
  CC siena_nvram.o
  CC siena_nic.o
  CC siena_vpd.o
  CC siena_phy.o

*Failed Build #16:
OS: SUSE15
Target: x86_64-native-linuxapp-gcc
  SYMLINK-FILE include/generic/rte_cpuflags.h
  SYMLINK-FILE include/generic/rte_rwlock.h
  SYMLINK-FILE include/generic/rte_vect.h
  SYMLINK-FILE include/generic/rte_pause.h
  SYMLINK-FILE include/generic/rte_io.h
make[6]: warning:  Clock skew detected.  Your build may be incomplete.
== Build lib/librte_eal/linux
== Build lib/librte_eal/linux/eal
  SYMLINK-FILE include/exec-env/rte_kni_common.h
  CC eal.o
  CC eal_cpuflags.o
--
  INSTALL-LIB librte_compressdev.a
  AR librte_sched.a
  INSTALL-LIB librte_sched.a
  AR librte_ethdev.a
  INSTALL-LIB librte_ethdev.a
make[5]: warning:  Clock skew detected.  Your build may be incomplete.
== Build lib/librte_security
== Build lib/librte_eventdev
== Build lib/librte_rawdev
== Build lib/librte_vhost
== Build lib/librte_ip_frag
--
  CC ice_common.o
  CC ice_sched.o
  CC i40e_nvm.o
  AR librte_pmd_netvsc.a
  INSTALL-LIB librte_pmd_netvsc.a
make[6]: warning:  Clock skew detected.  Your build may be incomplete.
== Build drivers/net/null
  CC ixgbe_x540.o
  AR librte_pmd_e1000.a
  CC nfp_cppcore.o
  INSTALL-LIB librte_pmd_e1000.a
--
  LD sfc_ethdev.o
  CC nfp_rtsym.o
  CC sfc_mcdi.o
  CC rte_eth_tap.o
/tmp/SUSE15_K4.12.14_GCC7.3.1/x86_64-native-linuxapp-gcc/72cd20e70e0a4f79b24b3cfb924d409e/dpdk/drivers/net/ice/ice_ethdev.c: In function ‘ice_load_pkg’:
/tmp/SUSE15_K4.12.14_GCC7.3.1/x86_64-native-linuxapp-gcc/72cd20e70e0a4f79b24b3cfb924d409e/dpdk/drivers/net/ice/ice_ethdev.c:1279:15: error: ‘pkg_path’ undeclared (first use in this function); did you mean ‘pkg_file’?
  file = fopen(pkg_path, "rb");
               ^~~~~~~~
               pkg_file
/tmp/SUSE15_K4.12.14_GCC7.3.1/x86_64-native-linuxapp-gcc/72cd20e70e0a4f79b24b3cfb924d409e/dpdk/drivers/net/ice/ice_ethdev.c:1279:15: note: each undeclared identifier is reported only once for each function it appears in
  CC sfc_intr.o
--
  CC efx_vpd.o
  CC ixgbe_rxtx_vec_sse.o
  AR librte_pmd_i40e.a
  INSTALL-LIB librte_pmd_i40e.a
  CC mcdi_mon.o
make[6]: warning:  Clock skew detected.  Your build may be incomplete.
  CC siena_mac.o
  CC ixgbe_ipsec.o
  CC siena_mcdi.o
  CC siena_nic.o
  CC siena_nvram.o
--
  CC hunt_nic.o
  CC medford_nic.o
  CC medford2_nic.o
  AR librte_pmd_ixgbe.a
  INSTALL-LIB librte_pmd_ixgbe.a
make[6]: warning:  Clock skew detected.  Your build may be incomplete.
  AR librte_pmd_sfc_efx.a
  INSTALL-LIB librte_pmd_sfc_efx.a
make[4]: *** [/tmp/SUSE15_K4.12.14_GCC7.3.1/x86_64-native-linuxapp-gcc/72cd20e70e0a4f79b24b3cfb924d409e/dpdk/mk/rte.subdir.mk:35: net] Error 2
make[3]: *** [/tmp/SUSE15_K4.12.14_GCC7.3.1/x86_64-native-linuxapp-gcc/72cd20e70e0a4f79b24b3cfb924d409e/dpdk/mk/rte.sdkbuild.mk:46: drivers] Error 2
make[2]: *** [/tmp/SUSE15_K4.12.14_GCC7.3.1/x86_64-native-linuxapp-gcc/72cd20e70e0a4f79b24b3cfb924d409e/dpdk/mk/rte.sdkroot.mk:99: all] Error 2

*Failed Build #17:
OS: RHEL76
Target: x86_64-native-linuxapp-gcc
  CC ixgbe_common.o
  CC i40e_tm.o
  CC ice_ethdev.o
  CC lio_ethdev.o
/tmp/RHEL76_K3.10.0_GCC4.8.5/x86_64-native-linuxapp-gcc/72cd20e70e0a4f79b24b3cfb924d409e/dpdk/drivers/net/ice/ice_ethdev.c: In function ‘ice_load_pkg’:
/tmp/RHEL76_K3.10.0_GCC4.8.5/x86_64-native-linuxapp-gcc/72cd20e70e0a4f79b24b3cfb924d409e/dpdk/drivers/net/ice/ice_ethdev.c:1279:15: error: ‘pkg_path’ undeclared (first use in this function)
  file = fopen(pkg_path, "rb");
               ^
/tmp/RHEL76_K3.10.0_GCC4.8.5/x86_64-native-linuxapp-gcc/72cd20e70e0a4f79b24b3cfb924d409e/dpdk/drivers/net/ice/ice_ethdev.c:1279:15: note: each undeclared identifier is reported only once for each function it appears in
make[6]: *** [ice_ethdev.o] Error 1
make[6]: *** Waiting for unfinished jobs....

*Failed Build #18:
OS: FC29
Target: x86_64-native-linuxapp-gcc
  CC sfc_mcdi.o
  CC nicvf_hw.o
  CC vdev_netvsc.o
  CC bnxt_txr.o
/tmp/FC29_K4.20_GCC8.0.1/x86_64-native-linuxapp-gcc/72cd20e70e0a4f79b24b3cfb924d409e/dpdk/drivers/net/ice/ice_ethdev.c: In function ‘ice_load_pkg’:
/tmp/FC29_K4.20_GCC8.0.1/x86_64-native-linuxapp-gcc/72cd20e70e0a4f79b24b3cfb924d409e/dpdk/drivers/net/ice/ice_ethdev.c:1279:15: error: ‘pkg_path’ undeclared (first use in this function); did you mean ‘pkg_file’?
  file = fopen(pkg_path, "rb");
               ^~~~~~~~
               pkg_file
/tmp/FC29_K4.20_GCC8.0.1/x86_64-native-linuxapp-gcc/72cd20e70e0a4f79b24b3cfb924d409e/dpdk/drivers/net/ice/ice_ethdev.c:1279:15: note: each undeclared identifier is reported only once for each function it appears in
  AR librte_pmd_i40e.a

*Failed Build #19:
OS: FC29
Target: x86_64-native-linuxapp-clang
  CC ixgbe_tm.o
  CC ecore_l2.o
  CC ice_ethdev.o
  CC ixgbe_vf_representor.o
  CC nfp_nsp_eth.o
/tmp/FC29_K4.20_Clang6.0.1/x86_64-native-linuxapp-clang/72cd20e70e0a4f79b24b3cfb924d409e/dpdk/drivers/net/ice/ice_ethdev.c:1279:15: error: use of undeclared identifier 'pkg_path'
        file = fopen(pkg_path, "rb");
                     ^
/tmp/FC29_K4.20_Clang6.0.1/x86_64-native-linuxapp-clang/72cd20e70e0a4f79b24b3cfb924d409e/dpdk/drivers/net/ice/ice_ethdev.c:1285:13: error: use of undeclared identifier 'pkg_path'
        err = stat(pkg_path, &fstat);
                   ^
  CC nfp_net.o
2 errors generated.
make[6]: *** [/tmp/FC29_K4.20_Clang6.0.1/x86_64-native-linuxapp-clang/72cd20e70e0a4f79b24b3cfb924d409e/dpdk/mk/internal/rte.compile-pre.mk:116: ice_ethdev.o] Error 1
make[5]: *** [/tmp/FC29_K4.20_Clang6.0.1/x86_64-native-linuxapp-clang/72cd20e70e0a4f79b24b3cfb924d409e/dpdk/mk/rte.subdir.mk:35: ice] Error 2
make[5]: *** Waiting for unfinished jobs....
  CC ecore_sp_commands.o
  CC bnxt_ring.o

*Failed Build #20:
OS: FC29
Target: x86_64-native-linuxapp-icc
  SYMLINK-FILE include/rte_pmd_bnxt.h
  CC bnxt_cpr.o
  CC base/vnic_dev.o
  PMDINFO igb_ethdev.o.pmd.c
  CC igb_ethdev.o.pmd.o
/tmp/FC29_K4.20_ICC19.0.0/x86_64-native-linuxapp-icc/72cd20e70e0a4f79b24b3cfb924d409e/dpdk/drivers/net/ice/ice_ethdev.c(1279): error: identifier "pkg_path" is undefined
  	file = fopen(pkg_path, "rb");
  	             ^

compilation aborted for /tmp/FC29_K4.20_ICC19.0.0/x86_64-native-linuxapp-icc/72cd20e70e0a4f79b24b3cfb924d409e/dpdk/drivers/net/ice/ice_ethdev.c (code 2)
make[6]: *** [/tmp/FC29_K4.20_ICC19.0.0/x86_64-native-linuxapp-icc/72cd20e70e0a4f79b24b3cfb924d409e/dpdk/mk/internal/rte.compile-pre.mk:116: ice_ethdev.o] Error 2

*Failed Build #21:
OS: CENTOS74
Target: x86_64-native-linuxapp-gcc
  AR librte_pmd_fm10k.a
  CC base/vnic_rq.o
  INSTALL-LIB librte_pmd_fm10k.a
== Build drivers/net/liquidio
/tmp/CENTOS74_K3.10.0_GCC4.8.5/x86_64-native-linuxapp-gcc/72cd20e70e0a4f79b24b3cfb924d409e/dpdk/drivers/net/ice/ice_ethdev.c: In function ‘ice_load_pkg’:
/tmp/CENTOS74_K3.10.0_GCC4.8.5/x86_64-native-linuxapp-gcc/72cd20e70e0a4f79b24b3cfb924d409e/dpdk/drivers/net/ice/ice_ethdev.c:1279:15: error: ‘pkg_path’ undeclared (first use in this function)
  file = fopen(pkg_path, "rb");
               ^
/tmp/CENTOS74_K3.10.0_GCC4.8.5/x86_64-native-linuxapp-gcc/72cd20e70e0a4f79b24b3cfb924d409e/dpdk/drivers/net/ice/ice_ethdev.c:1279:15: note: each undeclared identifier is reported only once for each function it appears in
  AR librte_pmd_iavf.a
  INSTALL-LIB librte_pmd_iavf.a

*Failed Build #22:
OS: RHEL74
Target: x86_64-native-linuxapp-gcc
  CC ice_ethdev.o
  CC octeontx_rxtx.o
  CC nfp_cpp_pcie_ops.o
  AR librte_pmd_netvsc.a
/tmp/RHEL74_K3.10.0_GCC4.8.5/x86_64-native-linuxapp-gcc/72cd20e70e0a4f79b24b3cfb924d409e/dpdk/drivers/net/ice/ice_ethdev.c: In function ‘ice_load_pkg’:
/tmp/RHEL74_K3.10.0_GCC4.8.5/x86_64-native-linuxapp-gcc/72cd20e70e0a4f79b24b3cfb924d409e/dpdk/drivers/net/ice/ice_ethdev.c:1279:15: error: ‘pkg_path’ undeclared (first use in this function)
  file = fopen(pkg_path, "rb");
               ^
/tmp/RHEL74_K3.10.0_GCC4.8.5/x86_64-native-linuxapp-gcc/72cd20e70e0a4f79b24b3cfb924d409e/dpdk/drivers/net/ice/ice_ethdev.c:1279:15: note: each undeclared identifier is reported only once for each function it appears in
  INSTALL-LIB librte_pmd_netvsc.a
make[6]: *** [ice_ethdev.o] Error 1

*Failed Build #23:
OS: CENTOS75
Target: x86_64-native-linuxapp-gcc
  CC nfp_rtsym.o
  CC i40e_ethdev_vf.o
  PMDINFO bnxt_ethdev.o.pmd.c
  CC bnxt_ethdev.o.pmd.o
/tmp/CENTOS75_K3.10.0_GCC4.8.5/x86_64-native-linuxapp-gcc/72cd20e70e0a4f79b24b3cfb924d409e/dpdk/drivers/net/ice/ice_ethdev.c: In function ‘ice_load_pkg’:
/tmp/CENTOS75_K3.10.0_GCC4.8.5/x86_64-native-linuxapp-gcc/72cd20e70e0a4f79b24b3cfb924d409e/dpdk/drivers/net/ice/ice_ethdev.c:1279:15: error: ‘pkg_path’ undeclared (first use in this function)
  file = fopen(pkg_path, "rb");
               ^
/tmp/CENTOS75_K3.10.0_GCC4.8.5/x86_64-native-linuxapp-gcc/72cd20e70e0a4f79b24b3cfb924d409e/dpdk/drivers/net/ice/ice_ethdev.c:1279:15: note: each undeclared identifier is reported only once for each function it appears in
  LD bnxt_ethdev.o
  CC em_ethdev.o

*Failed Build #24:
OS: FC28
Target: x86_64-native-linuxapp-icc
== Build drivers/bus/ifpga
== Build drivers/bus/pci
== Build drivers/bus/vdev
== Build drivers/bus/vmbus
  Building modules, stage 2.
/tmp/FC28_K4.16.3_ICC19.0.0/x86_64-native-linuxapp-icc/72cd20e70e0a4f79b24b3cfb924d409e/dpdk/x86_64-native-linuxapp-icc/build/kernel/linux/kni/kni_misc.o: warning: objtool: kni_ioctl_release()+0x60: sibling call from callable instruction with modified stack frame
/tmp/FC28_K4.16.3_ICC19.0.0/x86_64-native-linuxapp-icc/72cd20e70e0a4f79b24b3cfb924d409e/dpdk/x86_64-native-linuxapp-icc/build/kernel/linux/kni/kni_misc.o: warning: objtool: kni_ioctl()+0x2d: sibling call from callable instruction with modified stack frame
/tmp/FC28_K4.16.3_ICC19.0.0/x86_64-native-linuxapp-icc/72cd20e70e0a4f79b24b3cfb924d409e/dpdk/x86_64-native-linuxapp-icc/build/kernel/linux/kni/kni_misc.o: warning: objtool: kni_ioctl.cold.6()+0xc: sibling call from callable instruction with modified stack frame
/tmp/FC28_K4.16.3_ICC19.0.0/x86_64-native-linuxapp-icc/72cd20e70e0a4f79b24b3cfb924d409e/dpdk/x86_64-native-linuxapp-icc/build/kernel/linux/kni/kni_net.o: warning: objtool: kni_fifo_trans_pa2va()+0x167: sibling call from callable instruction with modified stack frame
/tmp/FC28_K4.16.3_ICC19.0.0/x86_64-native-linuxapp-icc/72cd20e70e0a4f79b24b3cfb924d409e/dpdk/x86_64-native-linuxapp-icc/build/kernel/linux/kni/kni_net.o: warning: objtool: kni_net_rx_lo_fifo_skb()+0x326: sibling call from callable instruction with modified stack frame
/tmp/FC28_K4.16.3_ICC19.0.0/x86_64-native-linuxapp-icc/72cd20e70e0a4f79b24b3cfb924d409e/dpdk/x86_64-native-linuxapp-icc/build/kernel/linux/kni/kni_net.o: warning: objtool: kni_net_process_request()+0x2d: sibling call from callable instruction with modified stack frame
/tmp/FC28_K4.16.3_ICC19.0.0/x86_64-native-linuxapp-icc/72cd20e70e0a4f79b24b3cfb924d409e/dpdk/x86_64-native-linuxapp-icc/build/kernel/linux/kni/kni_net.o: warning: objtool: kni_net_set_mac()+0x1a6: sibling call from callable instruction with modified stack frame
/tmp/FC28_K4.16.3_ICC19.0.0/x86_64-native-linuxapp-icc/72cd20e70e0a4f79b24b3cfb924d409e/dpdk/x86_64-native-linuxapp-icc/build/kernel/linux/kni/kni_net.o: warning: objtool: kni_net_rx_lo_fifo()+0x31c: sibling call from callable instruction with modified stack frame
/tmp/FC28_K4.16.3_ICC19.0.0/x86_64-native-linuxapp-icc/72cd20e70e0a4f79b24b3cfb924d409e/dpdk/x86_64-native-linuxapp-icc/build/kernel/linux/kni/kni_net.o: warning: objtool: kni_net_rx_normal()+0x2f9: sibling call from callable instruction with modified stack frame
/tmp/FC28_K4.16.3_ICC19.0.0/x86_64-native-linuxapp-icc/72cd20e70e0a4f79b24b3cfb924d409e/dpdk/x86_64-native-linuxapp-icc/build/kernel/linux/kni/kni_net.o: warning: objtool: kni_fifo_trans_pa2va.cold.6()+0x1d: sibling call from callable instruction with modified stack frame
/tmp/FC28_K4.16.3_ICC19.0.0/x86_64-native-linuxapp-icc/72cd20e70e0a4f79b24b3cfb924d409e/dpdk/x86_64-native-linuxapp-icc/build/kernel/linux/kni/kni_net.o: warning: objtool: kni_net_rx_lo_fifo_skb.cold.7()+0x25: sibling call from callable instruction with modified stack frame
/tmp/FC28_K4.16.3_ICC19.0.0/x86_64-native-linuxapp-icc/72cd20e70e0a4f79b24b3cfb924d409e/dpdk/x86_64-native-linuxapp-icc/build/kernel/linux/kni/kni_net.o: warning: objtool: kni_net_rx_normal.cold.11()+0x25: sibling call from callable instruction with modified stack frame
  LD [M]  /tmp/FC28_K4.16.3_ICC19.0.0/x86_64-native-linuxapp-icc/72cd20e70e0a4f79b24b3cfb924d409e/dpdk/x86_64-native-linuxapp-icc/build/kernel/linux/kni/rte_kni.o
  Building modules, stage 2.
  CC qbman/qbman_portal.o
  CC qbman/qbman_debug.o
  MODPOST 1 modules
--
  PMDINFO lio_ethdev.o.pmd.c
  CC lio_ethdev.o.pmd.o
  CC rte_pmd_i40e.o
  LD lio_ethdev.o
  CC ixgbe_82598.o
/tmp/FC28_K4.16.3_ICC19.0.0/x86_64-native-linuxapp-icc/72cd20e70e0a4f79b24b3cfb924d409e/dpdk/drivers/net/ice/ice_ethdev.c(1279): error: identifier "pkg_path" is undefined
  	file = fopen(pkg_path, "rb");
  	             ^

compilation aborted for /tmp/FC28_K4.16.3_ICC19.0.0/x86_64-native-linuxapp-icc/72cd20e70e0a4f79b24b3cfb924d409e/dpdk/drivers/net/ice/ice_ethdev.c (code 2)
make[6]: *** [/tmp/FC28_K4.16.3_ICC19.0.0/x86_64-native-linuxapp-icc/72cd20e70e0a4f79b24b3cfb924d409e/dpdk/mk/internal/rte.compile-pre.mk:116: ice_ethdev.o] Error 2

*Failed Build #25:
OS: SUSE12
Target: x86_64-native-linuxapp-gcc
  CC bnxt_stats.o
  CC bnxt_txq.o
  CC ixgbe_ethdev.o
  CC ecore_dev.o
/tmp/SUSE12_K3.7.10_GCC4.7.2/x86_64-native-linuxapp-gcc/72cd20e70e0a4f79b24b3cfb924d409e/dpdk/drivers/net/ice/ice_ethdev.c: In function ‘ice_load_pkg’:
/tmp/SUSE12_K3.7.10_GCC4.7.2/x86_64-native-linuxapp-gcc/72cd20e70e0a4f79b24b3cfb924d409e/dpdk/drivers/net/ice/ice_ethdev.c:1279:15: error: ‘pkg_path’ undeclared (first use in this function); did you mean ‘pkg_file’?
  file = fopen(pkg_path, "rb");
               ^~~~~~~~
               pkg_file
/tmp/SUSE12_K3.7.10_GCC4.7.2/x86_64-native-linuxapp-gcc/72cd20e70e0a4f79b24b3cfb924d409e/dpdk/drivers/net/ice/ice_ethdev.c:1279:15: note: each undeclared identifier is reported only once for each function it appears in
  CC ecore_hw.o
  CC i40e_rxtx_vec_avx2.o
/tmp/SUSE12_K3.7.10_GCC4.7.2/x86_64-native-linuxapp-gcc/72cd20e70e0a4f79b24b3cfb924d409e/dpdk/mk/internal/rte.compile-pre.mk:114: recipe for target 'ice_ethdev.o' failed
make[6]: *** [ice_ethdev.o] Error 1
/tmp/SUSE12_K3.7.10_GCC4.7.2/x86_64-native-linuxapp-gcc/72cd20e70e0a4f79b24b3cfb924d409e/dpdk/mk/rte.subdir.mk:35: recipe for target 'ice' failed
make[5]: *** [ice] Error 2
make[5]: *** Waiting for unfinished jobs....
  CC ixgbe_fdir.o
  CC ecore_cxt.o
  CC ixgbe_pf.o
--
  CC hunt_nic.o
  CC medford_nic.o
  CC medford2_nic.o
  AR librte_pmd_sfc_efx.a
  INSTALL-LIB librte_pmd_sfc_efx.a
/tmp/SUSE12_K3.7.10_GCC4.7.2/x86_64-native-linuxapp-gcc/72cd20e70e0a4f79b24b3cfb924d409e/dpdk/mk/rte.subdir.mk:35: recipe for target 'net' failed
make[4]: *** [net] Error 2
/tmp/SUSE12_K3.7.10_GCC4.7.2/x86_64-native-linuxapp-gcc/72cd20e70e0a4f79b24b3cfb924d409e/dpdk/mk/rte.sdkbuild.mk:46: recipe for target 'drivers' failed
make[3]: *** [drivers] Error 2
/tmp/SUSE12_K3.7.10_GCC4.7.2/x86_64-native-linuxapp-gcc/72cd20e70e0a4f79b24b3cfb924d409e/dpdk/mk/rte.sdkroot.mk:98: recipe for target 'all' failed
make[2]: *** [all] Error 2
/tmp/SUSE12_K3.7.10_GCC4.7.2/x86_64-native-linuxapp-gcc/72cd20e70e0a4f79b24b3cfb924d409e/dpdk/mk/rte.sdkinstall.mk:60: recipe for target 'pre_install' failed
make[1]: *** [pre_install] Error 2
/tmp/SUSE12_K3.7.10_GCC4.7.2/x86_64-native-linuxapp-gcc/72cd20e70e0a4f79b24b3cfb924d409e/dpdk/mk/rte.sdkroot.mk:77: recipe for target 'install' failed
make: *** [install] Error 2

*Failed Build #26:
OS: CENTOS76
Target: x86_64-native-linuxapp-gcc
  CC ice_ethdev.o
  PMDINFO i40e_ethdev.o.pmd.c
  CC i40e_ethdev.o.pmd.o
  CC ixgbe_x550.o
/tmp/CENTOS76_K3.10.0_GCC4.8.5/x86_64-native-linuxapp-gcc/72cd20e70e0a4f79b24b3cfb924d409e/dpdk/drivers/net/ice/ice_ethdev.c: In function ‘ice_load_pkg’:
/tmp/CENTOS76_K3.10.0_GCC4.8.5/x86_64-native-linuxapp-gcc/72cd20e70e0a4f79b24b3cfb924d409e/dpdk/drivers/net/ice/ice_ethdev.c:1279:15: error: ‘pkg_path’ undeclared (first use in this function)
  file = fopen(pkg_path, "rb");
               ^
/tmp/CENTOS76_K3.10.0_GCC4.8.5/x86_64-native-linuxapp-gcc/72cd20e70e0a4f79b24b3cfb924d409e/dpdk/drivers/net/ice/ice_ethdev.c:1279:15: note: each undeclared identifier is reported only once for each function it appears in
  LD i40e_ethdev.o
make[6]: *** [ice_ethdev.o] Error 1

DPDK STV team


More information about the test-report mailing list