[dpdk-test-report] |FAILURE| pw51756[v2, 1/3] rcu: add RCU library supporting QSBR mechanism

sys_stv at intel.com sys_stv at intel.com
Wed Mar 27 07:03:06 CET 2019


Test-Label: Intel-compilation
Test-Status: FAILURE
http://dpdk.org/patch/51756

_Compilation issues_

Submitter: Honnappa Nagarahalli <honnappa.nagarahalli at arm.com>
Date: 2019-03-27 05:52:25
Reply_mail: 20190327055227.4950-2-honnappa.nagarahalli at arm.com
DPDK git baseline: Repo:dpdk-master, CommitID: 0bcc66441d1ed8c2759ac05cfcfc3144de288b85

Build Summary: 26 Builds Done, 2 Successful, 24 Failures

Test environment and configuration as below:

OS: SUSE15
	Kernel Version: 4.12.14-lp150.12.22-default
	CPU info: Intel(R) Xeon(R) CPU E5-2699 v3 @ 2.30GHz
	GCC Version: gcc (SUSE Linux) 7.3.1 20180323 [gcc-7-branch revision 258812]
	Clang Version: 5.0.1 (tags/RELEASE_501/final 312548)
	x86_64-native-linuxapp-gcc

OS: CENTOS76
	Kernel Version: 3.10.0-957.5.1.el7.x86_64
	CPU info: Intel(R) Xeon(R) CPU E5-2699 v4 @ 2.20GHz
	GCC Version: gcc (GCC) 4.8.5 20150623 (Red Hat 4.8.5-36)
	Clang Version: 3.4.2 (tags/RELEASE_34/dot2-final)
	x86_64-native-linuxapp-gcc

OS: UBT144-32
	Kernel Version: 3.13.0-161-generic
	CPU info: Intel(R) Xeon(R) CPU E5-2699 v3 @ 2.30GHz
	GCC Version: gcc (Ubuntu 4.8.4-2ubuntu1~14.04.4) 4.8.4
	Clang Version: NA
	i686-native-linuxapp-gcc

OS: UBT164-32
	Kernel Version: 4.4.0-131-generic
	CPU info: Intel(R) Xeon(R) CPU E5-2699 v3 @ 2.30GHz
	GCC Version: gcc (Ubuntu 5.4.0-6ubuntu1~16.04.10) 5.4.0 20160609
	Clang Version: NA
	i686-native-linuxapp-gcc

OS: SUSE12
	Kernel Version: 4.4.73-5-default
	CPU info: Intel(R) Xeon(R) CPU E5-2699 v4 @ 2.20GHz
	GCC Version: gcc (SUSE Linux) 7.1.1 20170607 [gcc-7-branch revision 248970]
	Clang Version: 3.8.0 (tags/RELEASE_380/final 262553)
	x86_64-native-linuxapp-gcc

OS: FreeBSD12.0
	Kernel Version: 12.0-RC3
	CPU info: Intel(R) Xeon(R) CPU E5-2699 v3 @ 2.30GHz (2294.75-MHz K8-class CPU)
	GCC Version: gcc (FreeBSD Ports Collection) 7.3.0
	Clang Version: 6.0.1 (tags/RELEASE_601/final 335540) (based on LLVM 6.0.1)
	x86_64-native-bsdapp-clang
	x86_64-native-bsdapp-gcc

OS: UBT144-64
	Kernel Version: 4.2.0-27-generic
	CPU info: Intel(R) Xeon(R) CPU E5-2699 v3 @ 2.30GHz
	GCC Version: gcc (Ubuntu 4.8.4-2ubuntu1~14.04.4) 4.8.4
	Clang Version: 3.4-1ubuntu3 (tags/RELEASE_34/final) (based on LLVM 3.4)
	x86_64-native-linuxapp-gcc

OS: CENTOS75
	Kernel Version: 3.10.0-957.5.1.el7.x86_64
	CPU info: Intel(R) Xeon(R) CPU E5-2699 v4 @ 2.20GHz
	GCC Version: gcc (GCC) 4.8.5 20150623 (Red Hat 4.8.5-36)
	Clang Version: 3.4.2 (tags/RELEASE_34/dot2-final)
	x86_64-native-linuxapp-gcc

OS: UBT1804
	Kernel Version: 4.15.0-20-generic
	CPU info: Intel(R) Xeon(R) CPU E5-2699 v3 @ 2.30GHz
	GCC Version: gcc (Ubuntu 7.3.0-27ubuntu1~18.04) 7.3.0
	Clang Version: 6.0.0-1ubuntu2 (tags/RELEASE_600/final)
	x86_64-native-linuxapp-clang
	x86_64-native-linuxapp-gcc
	x86_64-native-linuxapp-icc

OS: UBT1810
	Kernel Version: 4.18.0-10-generic
	CPU info: Intel(R) Xeon(R) CPU E5-2699 v3 @ 2.30GHz
	GCC Version: gcc (Ubuntu 8.2.0-7ubuntu1) 8.2.0
	Clang Version: 7.0.0-3 (tags/RELEASE_700/final)
	x86_64-native-linuxapp-gcc

OS: RHEL74
	Kernel Version: 3.10.0-693.el7.x86_64
	CPU info: Intel(R) Xeon(R) CPU E5-2699 v4 @ 2.20GHz
	GCC Version: gcc (GCC) 4.8.5 20150623 (Red Hat 4.8.5-16)
	Clang Version: NA
	x86_64-native-linuxapp-gcc

OS: CENTOS74
	Kernel Version: 3.10.0-862.14.4.el7.x86_64
	CPU info: Intel(R) Xeon(R) CPU E5-2699 v4 @ 2.20GHz
	GCC Version: gcc (GCC) 4.8.5 20150623 (Red Hat 4.8.5-28)
	Clang Version: 3.4.2 (tags/RELEASE_34/dot2-final)
	x86_64-native-linuxapp-gcc

OS: FreeBSD11.2
	Kernel Version: 11.2-RELEASE
	CPU info: Intel(R) Xeon(R) CPU E5-2699 v3 @ 2.30GHz (2294.74-MHz K8-class CPU)
	GCC Version: gcc (FreeBSD Ports Collection) 6.4.0
	Clang Version: 6.0.0 (tags/RELEASE_600/final 326565) (based on LLVM 6.0.0)
	x86_64-native-bsdapp-gcc
	x86_64-native-bsdapp-clang

OS: UBT164-64
	Kernel Version: 4.4.0-47-generic
	CPU info: Intel(R) Xeon(R) CPU E5-2699 v3 @ 2.30GHz
	GCC Version: gcc (Ubuntu 5.4.0-6ubuntu1~16.04.10) 5.4.0 20160609
	Clang Version: 3.8.0-2ubuntu4 (tags/RELEASE_380/final)
	x86_64-native-linuxapp-gcc

OS: FC28
	Kernel Version: 4.16.3-301.fc28.x86_64
	CPU info: Intel(R) Xeon(R) CPU E5-2699 v4 @ 2.20GHz
	GCC Version: gcc (GCC) 8.1.1 20180712 (Red Hat 8.1.1-5)
	Clang Version: 6.0.1 (tags/RELEASE_601/final)
	x86_64-native-linuxapp-gcc
	x86_64-native-linuxapp-clang
	x86_64-native-linuxapp-icc

OS: RHEL76
	Kernel Version: 3.10.0-957.el7.x86_64
	CPU info: Intel(R) Xeon(R) CPU E5-2699 v4 @ 2.20GHz
	GCC Version: gcc (GCC) 4.8.5 20150623 (Red Hat 4.8.5-36)
	Clang Version: NA
	x86_64-native-linuxapp-gcc

OS: FC29
	Kernel Version: 4.18.16-300.fc29.x86_64
	CPU info: Intel(R) Xeon(R) CPU E5-2699 v4 @ 2.20GHz
	GCC Version: gcc (GCC) 8.2.1 20181215 (Red Hat 8.2.1-6)
	Clang Version: NA
	x86_64-native-linuxapp-gcc
	x86_64-native-linuxapp-clang
	x86_64-native-linuxapp-icc

OS: RHEL75
	Kernel Version: 3.10.0-862.el7.x86_64
	CPU info: Intel(R) Xeon(R) CPU E5-2699 v4 @ 2.20GHz
	GCC Version: gcc (GCC) 4.8.5 20150623 (Red Hat 4.8.5-28)
	Clang Version: NA
	x86_64-native-linuxapp-gcc

*Failed Build #1:
OS: UBT144-64
Target: x86_64-native-linuxapp-gcc
  CC acl_gen.o
  AR librte_rcu.a
  SYMLINK-FILE include/cmdline_vt100.h
  INSTALL-LIB librte_rcu.a
  SYMLINK-FILE include/cmdline_socket.h
make[5]: warning:  Clock skew detected.  Your build may be incomplete.
  SYMLINK-FILE include/cmdline_cirbuf.h
  SYMLINK-FILE include/cmdline_parse_portlist.h
  CC cmdline.o
  CC cmdline_cirbuf.o
  CC acl_run_scalar.o
--
  CC rte_table_action.o
  AR librte_flow_classify.a
  INSTALL-LIB librte_flow_classify.a
  AR librte_pipeline.a
  INSTALL-LIB librte_pipeline.a
make[4]: warning:  Clock skew detected.  Your build may be incomplete.
== Build buildtools
== Build kernel
== Build buildtools/pmdinfogen
== Build kernel/linux
  HOSTCC pmdinfogen.o
--
  CC lio_ethdev.o.pmd.o
  LD lio_ethdev.o
  CC ice_switch.o
  AR librte_pmd_fm10k.a
  INSTALL-LIB librte_pmd_fm10k.a
make[6]: warning:  Clock skew detected.  Your build may be incomplete.
  CC lio_rxtx.o
  CC lio_23xx_vf.o
  CC hn_nvs.o
  CC rte_eth_null.o
  CC hn_vf.o
--
  CC ifpga_fme.o
  CC ifpga_fme_iperf.o
  CC ifpga_fme_dperf.o
  PMDINFO dpaa2_cmdif.o.pmd.c
  CC dpaa2_cmdif.o.pmd.o
  CC ifpga_fme_error.o
  CC ifpga_port.o
  LD dpaa2_cmdif.o
  CC ifpga_port_error.o
  AR librte_pmd_dpaa2_cmdif.a
  CC opae_hw_api.o
  INSTALL-LIB librte_pmd_dpaa2_cmdif.a
  CC opae_ifpga_hw_api.o
  CC opae_debug.o
--
  CC comp_perf_test_verify.o
  INSTALL-APP cmdline_test
  INSTALL-MAP dpdk-procinfo.map
  CC runtime.o
  INSTALL-MAP cmdline_test.map
make[5]: warning:  Clock skew detected.  Your build may be incomplete.
make[5]: warning:  Clock skew detected.  Your build may be incomplete.
== Build app/test-eventdev
  INSTALL-APP testacl
  CC test_bbdev_perf.o
  CC test_byteorder.o
  INSTALL-MAP testacl.map
make[5]: warning:  Clock skew detected.  Your build may be incomplete.
  CC test_per_lcore.o
  INSTALL-APP dpdk-pdump
  INSTALL-MAP dpdk-pdump.map
  CC test_atomic.o
make[5]: warning:  Clock skew detected.  Your build may be incomplete.
  CC test_barrier.o
  CC test_bbdev_vector.o
  CC test_malloc.o
  CC cperf_test_vectors.o
  CC test_cycles.o
--
  CC test_external_mem.o
  CC test_ring.o
  INSTALL-APP dpdk-test-compress-perf
  CC evt_test.o
  INSTALL-MAP dpdk-test-compress-perf.map
make[5]: warning:  Clock skew detected.  Your build may be incomplete.
  CC parser.o
  CC test_order_common.o
  CC test_order_queue.o
  CC test_ring_perf.o
  CC test_pmd_perf.o
--
  CC test_perf_common.o
  CC cperf_test_verify.o
  CC test_perf_queue.o
  INSTALL-APP testpipeline
  INSTALL-MAP testpipeline.map
make[5]: warning:  Clock skew detected.  Your build may be incomplete.
  CC test_perf_atq.o
  CC cperf_test_vector_parsing.o
  CC test_table.o
  CC test_pipeline_common.o
  CC test_pipeline_queue.o
--
  CC test_flow_classify.o
  CC test_rwlock.o
  LD dpdk-test-eventdev
  INSTALL-APP dpdk-test-crypto-perf
  INSTALL-MAP dpdk-test-crypto-perf.map
make[5]: warning:  Clock skew detected.  Your build may be incomplete.
  CC test_timer.o
  CC test_timer_perf.o
  CC test_timer_racecond.o
  CC test_mempool.o
  CC test_mempool_perf.o
--
  CC test_member.o
  INSTALL-APP dpdk-test-eventdev
  CC test_member_perf.o
  INSTALL-MAP dpdk-test-eventdev.map
  CC test_efd.o
make[5]: warning:  Clock skew detected.  Your build may be incomplete.
  CC test_efd_perf.o
  CC test_hash.o
  CC cmdline_flow.o
  CC test_thash.o
  INSTALL-APP testbbdev
  INSTALL-MAP testbbdev.map
make[5]: warning:  Clock skew detected.  Your build may be incomplete.
  CC test_hash_perf.o
  CC test_hash_functions.o
  CC test_hash_multiwriter.o
  CC test_hash_readwrite.o
  CC test_hash_readwrite_lf.o
--
  CC test_eventdev.o
  CC test_event_ring.o
  CC test_event_eth_rx_adapter.o
  INSTALL-APP testpmd
  INSTALL-MAP testpmd.map
make[5]: warning:  Clock skew detected.  Your build may be incomplete.
  CC test_event_eth_tx_adapter.o
  CC test_event_timer_adapter.o
  CC test_event_crypto_adapter.o
  CC test_rawdev.o
  CC test_kvargs.o
  CC test_bpf.o
  CC test_rcu_qsbr.o
  CC test_rcu_qsbr_perf.o
In file included from /tmp/UBT144-64_K4.2.0_GCC4.8.4/x86_64-native-linuxapp-gcc/6b1bb5ec45cb44ee9745952c5d8836da/dpdk/app/test/test_rcu_qsbr_perf.c:8:0:
/tmp/UBT144-64_K4.2.0_GCC4.8.4/x86_64-native-linuxapp-gcc/6b1bb5ec45cb44ee9745952c5d8836da/dpdk/x86_64-native-linuxapp-gcc/include/rte_rcu_qsbr.h: In function ‘rte_rcu_qsbr_thread_online’:
/tmp/UBT144-64_K4.2.0_GCC4.8.4/x86_64-native-linuxapp-gcc/6b1bb5ec45cb44ee9745952c5d8836da/dpdk/x86_64-native-linuxapp-gcc/include/rte_rcu_qsbr.h:227:2: warning: implicit declaration of function ‘rte_smp_mb’ [-Wimplicit-function-declaration]
  rte_smp_mb();
  ^
/tmp/UBT144-64_K4.2.0_GCC4.8.4/x86_64-native-linuxapp-gcc/6b1bb5ec45cb44ee9745952c5d8836da/dpdk/x86_64-native-linuxapp-gcc/include/rte_rcu_qsbr.h:227:2: warning: nested extern declaration of ‘rte_smp_mb’ [-Wnested-externs]
In file included from /tmp/UBT144-64_K4.2.0_GCC4.8.4/x86_64-native-linuxapp-gcc/6b1bb5ec45cb44ee9745952c5d8836da/dpdk/x86_64-native-linuxapp-gcc/include/generic/rte_cycles.h:18:0,
                 from /tmp/UBT144-64_K4.2.0_GCC4.8.4/x86_64-native-linuxapp-gcc/6b1bb5ec45cb44ee9745952c5d8836da/dpdk/x86_64-native-linuxapp-gcc/include/rte_cycles.h:13,
                 from /tmp/UBT144-64_K4.2.0_GCC4.8.4/x86_64-native-linuxapp-gcc/6b1bb5ec45cb44ee9745952c5d8836da/dpdk/app/test/test_rcu_qsbr_perf.c:12:
/tmp/UBT144-64_K4.2.0_GCC4.8.4/x86_64-native-linuxapp-gcc/6b1bb5ec45cb44ee9745952c5d8836da/dpdk/x86_64-native-linuxapp-gcc/include/rte_atomic.h: At top level:
/tmp/UBT144-64_K4.2.0_GCC4.8.4/x86_64-native-linuxapp-gcc/6b1bb5ec45cb44ee9745952c5d8836da/dpdk/x86_64-native-linuxapp-gcc/include/rte_atomic.h:67:1: warning: conflicting types for ‘rte_smp_mb’ [enabled by default]
 rte_smp_mb(void)
 ^
/tmp/UBT144-64_K4.2.0_GCC4.8.4/x86_64-native-linuxapp-gcc/6b1bb5ec45cb44ee9745952c5d8836da/dpdk/x86_64-native-linuxapp-gcc/include/rte_atomic.h:67:1: error: static declaration of ‘rte_smp_mb’ follows non-static declaration
In file included from /tmp/UBT144-64_K4.2.0_GCC4.8.4/x86_64-native-linuxapp-gcc/6b1bb5ec45cb44ee9745952c5d8836da/dpdk/app/test/test_rcu_qsbr_perf.c:8:0:
/tmp/UBT144-64_K4.2.0_GCC4.8.4/x86_64-native-linuxapp-gcc/6b1bb5ec45cb44ee9745952c5d8836da/dpdk/x86_64-native-linuxapp-gcc/include/rte_rcu_qsbr.h:227:2: note: previous implicit declaration of ‘rte_smp_mb’ was here
  rte_smp_mb();
  ^
In file included from /tmp/UBT144-64_K4.2.0_GCC4.8.4/x86_64-native-linuxapp-gcc/6b1bb5ec45cb44ee9745952c5d8836da/dpdk/app/test/test_rcu_qsbr.c:8:0:
/tmp/UBT144-64_K4.2.0_GCC4.8.4/x86_64-native-linuxapp-gcc/6b1bb5ec45cb44ee9745952c5d8836da/dpdk/x86_64-native-linuxapp-gcc/include/rte_rcu_qsbr.h: In function ‘rte_rcu_qsbr_thread_online’:
make[5]: *** [test_rcu_qsbr_perf.o] Error 1
make[5]: *** Waiting for unfinished jobs....
/tmp/UBT144-64_K4.2.0_GCC4.8.4/x86_64-native-linuxapp-gcc/6b1bb5ec45cb44ee9745952c5d8836da/dpdk/x86_64-native-linuxapp-gcc/include/rte_rcu_qsbr.h:227:2: warning: implicit declaration of function ‘rte_smp_mb’ [-Wimplicit-function-declaration]
  rte_smp_mb();
  ^
/tmp/UBT144-64_K4.2.0_GCC4.8.4/x86_64-native-linuxapp-gcc/6b1bb5ec45cb44ee9745952c5d8836da/dpdk/x86_64-native-linuxapp-gcc/include/rte_rcu_qsbr.h:227:2: warning: nested extern declaration of ‘rte_smp_mb’ [-Wnested-externs]
In file included from /tmp/UBT144-64_K4.2.0_GCC4.8.4/x86_64-native-linuxapp-gcc/6b1bb5ec45cb44ee9745952c5d8836da/dpdk/x86_64-native-linuxapp-gcc/include/generic/rte_cycles.h:18:0,
                 from /tmp/UBT144-64_K4.2.0_GCC4.8.4/x86_64-native-linuxapp-gcc/6b1bb5ec45cb44ee9745952c5d8836da/dpdk/x86_64-native-linuxapp-gcc/include/rte_cycles.h:13,
                 from /tmp/UBT144-64_K4.2.0_GCC4.8.4/x86_64-native-linuxapp-gcc/6b1bb5ec45cb44ee9745952c5d8836da/dpdk/app/test/test_rcu_qsbr.c:12:
/tmp/UBT144-64_K4.2.0_GCC4.8.4/x86_64-native-linuxapp-gcc/6b1bb5ec45cb44ee9745952c5d8836da/dpdk/x86_64-native-linuxapp-gcc/include/rte_atomic.h: At top level:
/tmp/UBT144-64_K4.2.0_GCC4.8.4/x86_64-native-linuxapp-gcc/6b1bb5ec45cb44ee9745952c5d8836da/dpdk/x86_64-native-linuxapp-gcc/include/rte_atomic.h:67:1: warning: conflicting types for ‘rte_smp_mb’ [enabled by default]
 rte_smp_mb(void)
 ^
/tmp/UBT144-64_K4.2.0_GCC4.8.4/x86_64-native-linuxapp-gcc/6b1bb5ec45cb44ee9745952c5d8836da/dpdk/x86_64-native-linuxapp-gcc/include/rte_atomic.h:67:1: error: static declaration of ‘rte_smp_mb’ follows non-static declaration
In file included from /tmp/UBT144-64_K4.2.0_GCC4.8.4/x86_64-native-linuxapp-gcc/6b1bb5ec45cb44ee9745952c5d8836da/dpdk/app/test/test_rcu_qsbr.c:8:0:
/tmp/UBT144-64_K4.2.0_GCC4.8.4/x86_64-native-linuxapp-gcc/6b1bb5ec45cb44ee9745952c5d8836da/dpdk/x86_64-native-linuxapp-gcc/include/rte_rcu_qsbr.h:227:2: note: previous implicit declaration of ‘rte_smp_mb’ was here
  rte_smp_mb();
  ^
make[5]: *** [test_rcu_qsbr.o] Error 1

*Failed Build #2:
OS: UBT164-64
Target: x86_64-native-linuxapp-gcc
  INSTALL-LIB librte_meter.a
  INSTALL-LIB librte_jobstats.a
  INSTALL-LIB librte_rcu.a
  CC acl_gen.o
  CC cmdline_parse.o
make[5]: warning:  Clock skew detected.  Your build may be incomplete.
  CC acl_run_scalar.o
  CC cmdline_parse_etheraddr.o
  CC acl_run_sse.o
  CC cmdline_parse_ipaddr.o
  CC cmdline_parse_num.o
--
  CC rte_port_in_action.o
  AR librte_flow_classify.a
  INSTALL-LIB librte_flow_classify.a
  AR librte_pipeline.a
  INSTALL-LIB librte_pipeline.a
make[4]: warning:  Clock skew detected.  Your build may be incomplete.
== Build buildtools
== Build kernel
== Build kernel/linux
== Build buildtools/pmdinfogen
== Build kernel/linux/igb_uio
--
  CC scheduler_pmd_ops.o
  CC ice_common.o
  CC failsafe_flow.o
  AR librte_pmd_fm10k.a
  INSTALL-LIB librte_pmd_fm10k.a
make[6]: warning:  Clock skew detected.  Your build may be incomplete.
  CC base/vnic_intr.o
  CC i40e_dcb.o
  CC rte_cryptodev_scheduler.o
  CC base/vnic_rq.o
  CC enic_rxtx_vec_avx2.o
--
  PMDINFO dpaa2_cmdif.o.pmd.c
  CC dpaa2_cmdif.o.pmd.o
  LD dpaa2_cmdif.o
  CC dpaa2_qdma.o
  AR librte_pmd_dpaa2_cmdif.a
  CC ifpga_fme_error.o
  INSTALL-LIB librte_pmd_dpaa2_cmdif.a
  CC ifpga_port.o
  CC ifpga_port_error.o
  CC opae_hw_api.o
  CC opae_ifpga_hw_api.o
  CC opae_debug.o
  CC ifpga_fme_pr.o
  CC ifpga_rawdev.o
--
  CC cperf_ops.o
  INSTALL-APP cmdline_test
  CC init.o
  INSTALL-MAP cmdline_test.map
  CC test_resource.o
make[5]: warning:  Clock skew detected.  Your build may be incomplete.
  INSTALL-APP dpdk-pdump
== Build app/test-eventdev
  INSTALL-APP dpdk-procinfo
  INSTALL-MAP dpdk-procinfo.map
  INSTALL-MAP dpdk-pdump.map
  CC test_bbdev_perf.o
make[5]: warning:  Clock skew detected.  Your build may be incomplete.
make[5]: warning:  Clock skew detected.  Your build may be incomplete.
  CC test_bbdev_vector.o
  CC test_prefetch.o
  CC test_byteorder.o
  CC test_per_lcore.o
  INSTALL-APP testacl
  CC test_atomic.o
  INSTALL-MAP testacl.map
make[5]: warning:  Clock skew detected.  Your build may be incomplete.
  CC test_barrier.o
  CC comp_perf_test_verify.o
  CC test_malloc.o
  CC test_cycles.o
make[5]: Warning: File '/tmp/UBT164-64_K4.4.0_GCC5.4.0/x86_64-native-linuxapp-gcc/6b1bb5ec45cb44ee9745952c5d8836da/dpdk/mk/rte.app.mk' has modification time 17426 s in the future
--
  LD testbbdev
  CC test_order_queue.o
  CC cperf_test_verify.o
  INSTALL-APP dpdk-test-compress-perf
  INSTALL-MAP dpdk-test-compress-perf.map
make[5]: warning:  Clock skew detected.  Your build may be incomplete.
  CC cperf_test_vector_parsing.o
  CC pipeline_lpm_ipv6.o
  CC test_pmd_perf.o
  CC cperf_test_common.o
  CC test_table.o
  INSTALL-APP testbbdev
  INSTALL-MAP testbbdev.map
make[5]: warning:  Clock skew detected.  Your build may be incomplete.
  CC pipeline_acl.o
  CC test_table_pipeline.o
  CC test_table_tables.o
  LD dpdk-test-crypto-perf
  CC test_order_atq.o
--
  CC test_table_ports.o
  CC test_table_combined.o
  INSTALL-APP dpdk-test-crypto-perf
  INSTALL-MAP dpdk-test-crypto-perf.map
  CC test_perf_atq.o
make[5]: warning:  Clock skew detected.  Your build may be incomplete.
  CC test_pipeline_common.o
  CC test_pipeline_queue.o
  INSTALL-APP testpipeline
  INSTALL-MAP testpipeline.map
  CC test_table_acl.o
  CC test_pipeline_atq.o
make[5]: warning:  Clock skew detected.  Your build may be incomplete.
  CC cmdline_flow.o
  CC test_flow_classify.o
  CC test_rwlock.o
  CC test_timer.o
  CC test_timer_perf.o
--
  CC test_member_perf.o
  INSTALL-APP dpdk-test-eventdev
  CC cmdline_mtr.o
  INSTALL-MAP dpdk-test-eventdev.map
  CC test_efd.o
make[5]: warning:  Clock skew detected.  Your build may be incomplete.
  CC test_efd_perf.o
  CC test_hash.o
  CC test_thash.o
  CC test_hash_perf.o
  CC test_hash_multiwriter.o
--
  LD testpmd
  CC test_acl.o
  CC test_link_bonding.o
  INSTALL-APP testpmd
  INSTALL-MAP testpmd.map
make[5]: warning:  Clock skew detected.  Your build may be incomplete.
  CC test_link_bonding_mode4.o
  CC test_link_bonding_rssconf.o
  CC test_pmd_ring.o
  CC test_pmd_ring_perf.o
  CC test_cryptodev.o
--
  CC test_bpf.o
  CC test_rcu_qsbr.o
  CC test_rcu_qsbr_perf.o
In file included from /tmp/UBT164-64_K4.4.0_GCC5.4.0/x86_64-native-linuxapp-gcc/6b1bb5ec45cb44ee9745952c5d8836da/dpdk/app/test/test_rcu_qsbr.c:8:0:
/tmp/UBT164-64_K4.4.0_GCC5.4.0/x86_64-native-linuxapp-gcc/6b1bb5ec45cb44ee9745952c5d8836da/dpdk/x86_64-native-linuxapp-gcc/include/rte_rcu_qsbr.h: In function ‘rte_rcu_qsbr_thread_online’:
/tmp/UBT164-64_K4.4.0_GCC5.4.0/x86_64-native-linuxapp-gcc/6b1bb5ec45cb44ee9745952c5d8836da/dpdk/x86_64-native-linuxapp-gcc/include/rte_rcu_qsbr.h:227:2: warning: implicit declaration of function ‘rte_smp_mb’ [-Wimplicit-function-declaration]
  rte_smp_mb();
  ^
/tmp/UBT164-64_K4.4.0_GCC5.4.0/x86_64-native-linuxapp-gcc/6b1bb5ec45cb44ee9745952c5d8836da/dpdk/x86_64-native-linuxapp-gcc/include/rte_rcu_qsbr.h:227:2: warning: nested extern declaration of ‘rte_smp_mb’ [-Wnested-externs]
In file included from /tmp/UBT164-64_K4.4.0_GCC5.4.0/x86_64-native-linuxapp-gcc/6b1bb5ec45cb44ee9745952c5d8836da/dpdk/x86_64-native-linuxapp-gcc/include/generic/rte_cycles.h:18:0,
                 from /tmp/UBT164-64_K4.4.0_GCC5.4.0/x86_64-native-linuxapp-gcc/6b1bb5ec45cb44ee9745952c5d8836da/dpdk/x86_64-native-linuxapp-gcc/include/rte_cycles.h:13,
                 from /tmp/UBT164-64_K4.4.0_GCC5.4.0/x86_64-native-linuxapp-gcc/6b1bb5ec45cb44ee9745952c5d8836da/dpdk/app/test/test_rcu_qsbr.c:12:
/tmp/UBT164-64_K4.4.0_GCC5.4.0/x86_64-native-linuxapp-gcc/6b1bb5ec45cb44ee9745952c5d8836da/dpdk/x86_64-native-linuxapp-gcc/include/rte_atomic.h: At top level:
/tmp/UBT164-64_K4.4.0_GCC5.4.0/x86_64-native-linuxapp-gcc/6b1bb5ec45cb44ee9745952c5d8836da/dpdk/x86_64-native-linuxapp-gcc/include/rte_atomic.h:67:1: warning: conflicting types for ‘rte_smp_mb’
 rte_smp_mb(void)
 ^
/tmp/UBT164-64_K4.4.0_GCC5.4.0/x86_64-native-linuxapp-gcc/6b1bb5ec45cb44ee9745952c5d8836da/dpdk/x86_64-native-linuxapp-gcc/include/rte_atomic.h:67:1: error: static declaration of ‘rte_smp_mb’ follows non-static declaration
In file included from /tmp/UBT164-64_K4.4.0_GCC5.4.0/x86_64-native-linuxapp-gcc/6b1bb5ec45cb44ee9745952c5d8836da/dpdk/app/test/test_rcu_qsbr.c:8:0:
/tmp/UBT164-64_K4.4.0_GCC5.4.0/x86_64-native-linuxapp-gcc/6b1bb5ec45cb44ee9745952c5d8836da/dpdk/x86_64-native-linuxapp-gcc/include/rte_rcu_qsbr.h:227:2: note: previous implicit declaration of ‘rte_smp_mb’ was here
  rte_smp_mb();
  ^
/tmp/UBT164-64_K4.4.0_GCC5.4.0/x86_64-native-linuxapp-gcc/6b1bb5ec45cb44ee9745952c5d8836da/dpdk/mk/internal/rte.compile-pre.mk:114: recipe for target 'test_rcu_qsbr.o' failed
make[5]: *** [test_rcu_qsbr.o] Error 1
make[5]: *** Waiting for unfinished jobs....
In file included from /tmp/UBT164-64_K4.4.0_GCC5.4.0/x86_64-native-linuxapp-gcc/6b1bb5ec45cb44ee9745952c5d8836da/dpdk/app/test/test_rcu_qsbr_perf.c:8:0:
/tmp/UBT164-64_K4.4.0_GCC5.4.0/x86_64-native-linuxapp-gcc/6b1bb5ec45cb44ee9745952c5d8836da/dpdk/x86_64-native-linuxapp-gcc/include/rte_rcu_qsbr.h: In function ‘rte_rcu_qsbr_thread_online’:
/tmp/UBT164-64_K4.4.0_GCC5.4.0/x86_64-native-linuxapp-gcc/6b1bb5ec45cb44ee9745952c5d8836da/dpdk/x86_64-native-linuxapp-gcc/include/rte_rcu_qsbr.h:227:2: warning: implicit declaration of function ‘rte_smp_mb’ [-Wimplicit-function-declaration]
  rte_smp_mb();
  ^
/tmp/UBT164-64_K4.4.0_GCC5.4.0/x86_64-native-linuxapp-gcc/6b1bb5ec45cb44ee9745952c5d8836da/dpdk/x86_64-native-linuxapp-gcc/include/rte_rcu_qsbr.h:227:2: warning: nested extern declaration of ‘rte_smp_mb’ [-Wnested-externs]
In file included from /tmp/UBT164-64_K4.4.0_GCC5.4.0/x86_64-native-linuxapp-gcc/6b1bb5ec45cb44ee9745952c5d8836da/dpdk/x86_64-native-linuxapp-gcc/include/generic/rte_cycles.h:18:0,
                 from /tmp/UBT164-64_K4.4.0_GCC5.4.0/x86_64-native-linuxapp-gcc/6b1bb5ec45cb44ee9745952c5d8836da/dpdk/x86_64-native-linuxapp-gcc/include/rte_cycles.h:13,
                 from /tmp/UBT164-64_K4.4.0_GCC5.4.0/x86_64-native-linuxapp-gcc/6b1bb5ec45cb44ee9745952c5d8836da/dpdk/app/test/test_rcu_qsbr_perf.c:12:
/tmp/UBT164-64_K4.4.0_GCC5.4.0/x86_64-native-linuxapp-gcc/6b1bb5ec45cb44ee9745952c5d8836da/dpdk/x86_64-native-linuxapp-gcc/include/rte_atomic.h: At top level:
/tmp/UBT164-64_K4.4.0_GCC5.4.0/x86_64-native-linuxapp-gcc/6b1bb5ec45cb44ee9745952c5d8836da/dpdk/x86_64-native-linuxapp-gcc/include/rte_atomic.h:67:1: warning: conflicting types for ‘rte_smp_mb’
 rte_smp_mb(void)
 ^
/tmp/UBT164-64_K4.4.0_GCC5.4.0/x86_64-native-linuxapp-gcc/6b1bb5ec45cb44ee9745952c5d8836da/dpdk/x86_64-native-linuxapp-gcc/include/rte_atomic.h:67:1: error: static declaration of ‘rte_smp_mb’ follows non-static declaration
In file included from /tmp/UBT164-64_K4.4.0_GCC5.4.0/x86_64-native-linuxapp-gcc/6b1bb5ec45cb44ee9745952c5d8836da/dpdk/app/test/test_rcu_qsbr_perf.c:8:0:
/tmp/UBT164-64_K4.4.0_GCC5.4.0/x86_64-native-linuxapp-gcc/6b1bb5ec45cb44ee9745952c5d8836da/dpdk/x86_64-native-linuxapp-gcc/include/rte_rcu_qsbr.h:227:2: note: previous implicit declaration of ‘rte_smp_mb’ was here
  rte_smp_mb();
  ^
/tmp/UBT164-64_K4.4.0_GCC5.4.0/x86_64-native-linuxapp-gcc/6b1bb5ec45cb44ee9745952c5d8836da/dpdk/mk/internal/rte.compile-pre.mk:114: recipe for target 'test_rcu_qsbr_perf.o' failed
make[5]: *** [test_rcu_qsbr_perf.o] Error 1
/tmp/UBT164-64_K4.4.0_GCC5.4.0/x86_64-native-linuxapp-gcc/6b1bb5ec45cb44ee9745952c5d8836da/dpdk/mk/rte.subdir.mk:35: recipe for target 'test' failed
make[4]: *** [test] Error 2
/tmp/UBT164-64_K4.4.0_GCC5.4.0/x86_64-native-linuxapp-gcc/6b1bb5ec45cb44ee9745952c5d8836da/dpdk/mk/rte.sdkbuild.mk:46: recipe for target 'app' failed
make[3]: *** [app] Error 2
/tmp/UBT164-64_K4.4.0_GCC5.4.0/x86_64-native-linuxapp-gcc/6b1bb5ec45cb44ee9745952c5d8836da/dpdk/mk/rte.sdkroot.mk:98: recipe for target 'all' failed
make[2]: *** [all] Error 2
/tmp/UBT164-64_K4.4.0_GCC5.4.0/x86_64-native-linuxapp-gcc/6b1bb5ec45cb44ee9745952c5d8836da/dpdk/mk/rte.sdkinstall.mk:60: recipe for target 'pre_install' failed
make[1]: *** [pre_install] Error 2
/tmp/UBT164-64_K4.4.0_GCC5.4.0/x86_64-native-linuxapp-gcc/6b1bb5ec45cb44ee9745952c5d8836da/dpdk/mk/rte.sdkroot.mk:77: recipe for target 'install' failed
make: *** [install] Error 2

*Failed Build #3:
OS: UBT1804
Target: x86_64-native-linuxapp-clang
  SYMLINK-FILE include/rte_power.h
  SYMLINK-FILE include/rte_power_empty_poll.h
  AR librte_rcu.a
  CC cmdline_cirbuf.o
  INSTALL-LIB librte_rcu.a
make[5]: warning:  Clock skew detected.  Your build may be incomplete.
  CC rte_power.o
== Build lib/librte_hash
  SYMLINK-FILE include/rte_mempool.h
  CC power_acpi_cpufreq.o
  CC cmdline_parse.o
--
  CC rte_flow_classify_parse.o
  AR librte_flow_classify.a
  INSTALL-LIB librte_flow_classify.a
  AR librte_pipeline.a
  INSTALL-LIB librte_pipeline.a
make[4]: warning:  Clock skew detected.  Your build may be incomplete.
== Build buildtools
== Build kernel
== Build buildtools/pmdinfogen
== Build kernel/linux
  HOSTCC pmdinfogen.o
--
  CC i40e_nvm.o
  AR librte_pmd_fm10k.a
  CC ice_controlq.o
  CC failsafe_rxtx.o
  INSTALL-LIB librte_pmd_fm10k.a
make[6]: warning:  Clock skew detected.  Your build may be incomplete.
  CC failsafe_ether.o
  CC base/vnic_wq.o
  CC base/vnic_dev.o
  CC base/vnic_intr.o
  CC ice_common.o
--
  CC skeleton_rawdev_test.o
  CC dpaa2_qdma.o
  PMDINFO dpaa2_cmdif.o.pmd.c
  CC dpaa2_cmdif.o.pmd.o
  LD dpaa2_cmdif.o
  CC ifpga_fme_error.o
  AR librte_pmd_dpaa2_cmdif.a
  INSTALL-LIB librte_pmd_dpaa2_cmdif.a
  CC ifpga_port.o
  CC ifpga_port_error.o
  CC opae_hw_api.o
  CC opae_ifpga_hw_api.o
  CC opae_debug.o
  CC ifpga_fme_pr.o
  CC ifpga_rawdev.o
--
  CC test_resource.o
  INSTALL-APP testacl
  INSTALL-APP cmdline_test
  INSTALL-MAP testacl.map
  INSTALL-MAP cmdline_test.map
make[5]: warning:  Clock skew detected.  Your build may be incomplete.
  CC parameters.o
  CC test_prefetch.o
make[5]: warning:  Clock skew detected.  Your build may be incomplete.
== Build app/test-eventdev
  CC test_bbdev_perf.o
  CC test_byteorder.o
  INSTALL-APP dpdk-pdump
  INSTALL-MAP dpdk-pdump.map
make[5]: Warning: File '/tmp/UBT1804_K4.15.0_Clang6.0.0/x86_64-native-linuxapp-clang/6b1bb5ec45cb44ee9745952c5d8836da/dpdk/mk/rte.app.mk' has modification time 17487 s in the future
make[5]: warning:  Clock skew detected.  Your build may be incomplete.
  CC test_per_lcore.o
  CC test_atomic.o
  CC evt_main.o
  INSTALL-APP dpdk-procinfo
  CC cperf_options_parsing.o
  INSTALL-MAP dpdk-procinfo.map
  CC test_barrier.o
make[5]: warning:  Clock skew detected.  Your build may be incomplete.
  CC test_malloc.o
  CC runtime.o
  CC cmdline.o
  CC test_cycles.o
  CC comp_perf_test_verify.o
--
  CC pipeline_lpm_ipv6.o
  CC pipeline_lpm.o
  CC test_ring_perf.o
  INSTALL-APP dpdk-test-compress-perf
  INSTALL-MAP dpdk-test-compress-perf.map
make[5]: warning:  Clock skew detected.  Your build may be incomplete.
  CC test_order_atq.o
  CC test_order_queue.o
  CC test_perf_common.o
  CC cperf_test_pmd_cyclecount.o
  INSTALL-APP testbbdev
  INSTALL-MAP testbbdev.map
  CC cmdline_mtr.o
make[5]: warning:  Clock skew detected.  Your build may be incomplete.
  CC cmdline_tm.o
  CC cperf_test_verify.o
  CC pipeline_acl.o
  CC test_pmd_perf.o
  CC test_perf_queue.o
--
  CC cperf_test_common.o
  INSTALL-APP testpipeline
  INSTALL-MAP testpipeline.map
  CC test_table.o
  CC macswap.o
make[5]: warning:  Clock skew detected.  Your build may be incomplete.
  CC flowgen.o
  CC test_table_pipeline.o
  CC test_table_tables.o
  CC test_pipeline_common.o
  CC test_table_ports.o
--
  CC test_pipeline_atq.o
  CC rxonly.o
  INSTALL-APP dpdk-test-crypto-perf
  CC txonly.o
  INSTALL-MAP dpdk-test-crypto-perf.map
make[5]: warning:  Clock skew detected.  Your build may be incomplete.
  CC csumonly.o
  CC test_table_combined.o
  CC icmpecho.o
  CC test_table_acl.o
  CC test_flow_classify.o
--
  CC test_timer_racecond.o
  CC test_mempool.o
  INSTALL-APP dpdk-test-eventdev
  INSTALL-MAP dpdk-test-eventdev.map
  CC softnicfwd.o
make[5]: warning:  Clock skew detected.  Your build may be incomplete.
  CC test_mempool_perf.o
  CC test_mbuf.o
  CC test_memcpy.o
  CC test_logs.o
  CC test_memcpy_perf.o
--
  CC test_lpm_perf.o
  CC test_lpm6.o
  CC test_lpm6_perf.o
  INSTALL-APP testpmd
  INSTALL-MAP testpmd.map
make[5]: warning:  Clock skew detected.  Your build may be incomplete.
  CC test_debug.o
  CC test_errno.o
  CC test_tailq.o
  CC test_string_fns.o
  CC test_cpuflags.o
--
  CC test_kvargs.o
  CC test_bpf.o
  CC test_rcu_qsbr.o
  CC test_rcu_qsbr_perf.o
In file included from /tmp/UBT1804_K4.15.0_Clang6.0.0/x86_64-native-linuxapp-clang/6b1bb5ec45cb44ee9745952c5d8836da/dpdk/app/test/test_rcu_qsbr.c:8:
/tmp/UBT1804_K4.15.0_Clang6.0.0/x86_64-native-linuxapp-clang/6b1bb5ec45cb44ee9745952c5d8836da/dpdk/x86_64-native-linuxapp-clang/include/rte_rcu_qsbr.h:227:2: warning: implicit declaration of function 'rte_smp_mb' is invalid in C99 [-Wimplicit-function-declaration]
        rte_smp_mb();
        ^
/tmp/UBT1804_K4.15.0_Clang6.0.0/x86_64-native-linuxapp-clang/6b1bb5ec45cb44ee9745952c5d8836da/dpdk/x86_64-native-linuxapp-clang/include/rte_rcu_qsbr.h:227:2: warning: this function declaration is not a prototype [-Wstrict-prototypes]
In file included from /tmp/UBT1804_K4.15.0_Clang6.0.0/x86_64-native-linuxapp-clang/6b1bb5ec45cb44ee9745952c5d8836da/dpdk/app/test/test_rcu_qsbr.c:12:
In file included from /tmp/UBT1804_K4.15.0_Clang6.0.0/x86_64-native-linuxapp-clang/6b1bb5ec45cb44ee9745952c5d8836da/dpdk/x86_64-native-linuxapp-clang/include/rte_cycles.h:13:
In file included from /tmp/UBT1804_K4.15.0_Clang6.0.0/x86_64-native-linuxapp-clang/6b1bb5ec45cb44ee9745952c5d8836da/dpdk/x86_64-native-linuxapp-clang/include/generic/rte_cycles.h:18:
/tmp/UBT1804_K4.15.0_Clang6.0.0/x86_64-native-linuxapp-clang/6b1bb5ec45cb44ee9745952c5d8836da/dpdk/x86_64-native-linuxapp-clang/include/rte_atomic.h:67:1: error: static declaration of 'rte_smp_mb' follows non-static declaration
rte_smp_mb(void)
^
/tmp/UBT1804_K4.15.0_Clang6.0.0/x86_64-native-linuxapp-clang/6b1bb5ec45cb44ee9745952c5d8836da/dpdk/x86_64-native-linuxapp-clang/include/rte_rcu_qsbr.h:227:2: note: previous implicit declaration is here
        rte_smp_mb();
        ^
2 warnings and 1 error generated.
/tmp/UBT1804_K4.15.0_Clang6.0.0/x86_64-native-linuxapp-clang/6b1bb5ec45cb44ee9745952c5d8836da/dpdk/mk/internal/rte.compile-pre.mk:114: recipe for target 'test_rcu_qsbr.o' failed
make[5]: *** [test_rcu_qsbr.o] Error 1
make[5]: *** Waiting for unfinished jobs....
In file included from /tmp/UBT1804_K4.15.0_Clang6.0.0/x86_64-native-linuxapp-clang/6b1bb5ec45cb44ee9745952c5d8836da/dpdk/app/test/test_rcu_qsbr_perf.c:8:
/tmp/UBT1804_K4.15.0_Clang6.0.0/x86_64-native-linuxapp-clang/6b1bb5ec45cb44ee9745952c5d8836da/dpdk/x86_64-native-linuxapp-clang/include/rte_rcu_qsbr.h:227:2: warning: implicit declaration of function 'rte_smp_mb' is invalid in C99 [-Wimplicit-function-declaration]
        rte_smp_mb();
        ^
/tmp/UBT1804_K4.15.0_Clang6.0.0/x86_64-native-linuxapp-clang/6b1bb5ec45cb44ee9745952c5d8836da/dpdk/x86_64-native-linuxapp-clang/include/rte_rcu_qsbr.h:227:2: warning: this function declaration is not a prototype [-Wstrict-prototypes]
In file included from /tmp/UBT1804_K4.15.0_Clang6.0.0/x86_64-native-linuxapp-clang/6b1bb5ec45cb44ee9745952c5d8836da/dpdk/app/test/test_rcu_qsbr_perf.c:12:
In file included from /tmp/UBT1804_K4.15.0_Clang6.0.0/x86_64-native-linuxapp-clang/6b1bb5ec45cb44ee9745952c5d8836da/dpdk/x86_64-native-linuxapp-clang/include/rte_cycles.h:13:
In file included from /tmp/UBT1804_K4.15.0_Clang6.0.0/x86_64-native-linuxapp-clang/6b1bb5ec45cb44ee9745952c5d8836da/dpdk/x86_64-native-linuxapp-clang/include/generic/rte_cycles.h:18:
/tmp/UBT1804_K4.15.0_Clang6.0.0/x86_64-native-linuxapp-clang/6b1bb5ec45cb44ee9745952c5d8836da/dpdk/x86_64-native-linuxapp-clang/include/rte_atomic.h:67:1: error: static declaration of 'rte_smp_mb' follows non-static declaration
rte_smp_mb(void)
^
/tmp/UBT1804_K4.15.0_Clang6.0.0/x86_64-native-linuxapp-clang/6b1bb5ec45cb44ee9745952c5d8836da/dpdk/x86_64-native-linuxapp-clang/include/rte_rcu_qsbr.h:227:2: note: previous implicit declaration is here
        rte_smp_mb();
        ^
2 warnings and 1 error generated.
/tmp/UBT1804_K4.15.0_Clang6.0.0/x86_64-native-linuxapp-clang/6b1bb5ec45cb44ee9745952c5d8836da/dpdk/mk/internal/rte.compile-pre.mk:114: recipe for target 'test_rcu_qsbr_perf.o' failed
make[5]: *** [test_rcu_qsbr_perf.o] Error 1
/tmp/UBT1804_K4.15.0_Clang6.0.0/x86_64-native-linuxapp-clang/6b1bb5ec45cb44ee9745952c5d8836da/dpdk/mk/rte.subdir.mk:35: recipe for target 'test' failed
make[4]: *** [test] Error 2
/tmp/UBT1804_K4.15.0_Clang6.0.0/x86_64-native-linuxapp-clang/6b1bb5ec45cb44ee9745952c5d8836da/dpdk/mk/rte.sdkbuild.mk:46: recipe for target 'app' failed
make[3]: *** [app] Error 2
/tmp/UBT1804_K4.15.0_Clang6.0.0/x86_64-native-linuxapp-clang/6b1bb5ec45cb44ee9745952c5d8836da/dpdk/mk/rte.sdkroot.mk:98: recipe for target 'all' failed
make[2]: *** [all] Error 2
/tmp/UBT1804_K4.15.0_Clang6.0.0/x86_64-native-linuxapp-clang/6b1bb5ec45cb44ee9745952c5d8836da/dpdk/mk/rte.sdkinstall.mk:60: recipe for target 'pre_install' failed
make[1]: *** [pre_install] Error 2
/tmp/UBT1804_K4.15.0_Clang6.0.0/x86_64-native-linuxapp-clang/6b1bb5ec45cb44ee9745952c5d8836da/dpdk/mk/rte.sdkroot.mk:77: recipe for target 'install' failed
make: *** [install] Error 2

*Failed Build #4:
OS: UBT1804
Target: x86_64-native-linuxapp-gcc
  INSTALL-LIB librte_ring.a
  AR librte_rcu.a
== Build lib/librte_mempool
  SYMLINK-FILE include/cmdline_parse_portlist.h
  INSTALL-LIB librte_rcu.a
make[5]: warning:  Clock skew detected.  Your build may be incomplete.
== Build lib/librte_hash
  CC cmdline.o
  CC cmdline_cirbuf.o
  CC acl_gen.o
  AR librte_meter.a
--
  CC rte_port_in_action.o
  AR librte_flow_classify.a
  INSTALL-LIB librte_flow_classify.a
  AR librte_pipeline.a
  INSTALL-LIB librte_pipeline.a
make[4]: warning:  Clock skew detected.  Your build may be incomplete.
== Build kernel
== Build buildtools
== Build kernel/linux
== Build buildtools/pmdinfogen
== Build kernel/linux/igb_uio
--
  PMDINFO lio_ethdev.o.pmd.c
  CC lio_ethdev.o.pmd.o
  CC ice_switch.o
  INSTALL-LIB librte_pmd_fm10k.a
  LD lio_ethdev.o
make[6]: warning:  Clock skew detected.  Your build may be incomplete.
  CC lio_rxtx.o
  CC iavf_rxtx.o
  CC base/vnic_cq.o
  CC i40e_diag.o
  CC ixgbe_x550.o
--
  CC ifpga_enumerate.o
  CC ifpga_fme.o
  CC ifpga_fme_iperf.o
  CC ifpga_fme_dperf.o
  CC dpaa2_cmdif.o
  CC ifpga_fme_error.o
  PMDINFO dpaa2_cmdif.o.pmd.c
  CC dpaa2_cmdif.o.pmd.o
  CC ifpga_port.o
  LD dpaa2_cmdif.o
  AR librte_pmd_dpaa2_cmdif.a
  INSTALL-LIB librte_pmd_dpaa2_cmdif.a
  CC ifpga_port_error.o
  CC opae_hw_api.o
  CC opae_ifpga_hw_api.o
  CC opae_debug.o
  CC ifpga_rawdev.o
  CC ifpga_fme_pr.o
--
  CC comp_perf_options_parse.o
  INSTALL-APP testacl
  CC resource.o
  INSTALL-MAP testacl.map
  INSTALL-APP cmdline_test
make[5]: warning:  Clock skew detected.  Your build may be incomplete.
  CC cperf_options_parsing.o
  INSTALL-APP dpdk-procinfo
  INSTALL-APP dpdk-pdump
  INSTALL-MAP cmdline_test.map
  INSTALL-MAP dpdk-procinfo.map
make[5]: warning:  Clock skew detected.  Your build may be incomplete.
  INSTALL-MAP dpdk-pdump.map
  CC test_resource.o
  CC parameters.o
make[5]: warning:  Clock skew detected.  Your build may be incomplete.
make[5]: warning:  Clock skew detected.  Your build may be incomplete.
  CC test_prefetch.o
== Build app/test-eventdev
  CC init.o
  CC comp_perf_test_verify.o
  CC test_byteorder.o
--
  CC test_external_mem.o
  CC pipeline_lpm_ipv6.o
  INSTALL-APP dpdk-test-compress-perf
  INSTALL-MAP dpdk-test-compress-perf.map
  CC cmdline_mtr.o
make[5]: warning:  Clock skew detected.  Your build may be incomplete.
  CC cmdline_tm.o
  CC cperf_test_verify.o
  CC cperf_test_vector_parsing.o
  CC test_ring.o
  CC evt_test.o
--
  LD dpdk-test-crypto-perf
  CC test_perf_queue.o
  INSTALL-APP testbbdev
  INSTALL-MAP testbbdev.map
  CC iofwd.o
make[5]: warning:  Clock skew detected.  Your build may be incomplete.
  CC macfwd.o
  INSTALL-APP testpipeline
  INSTALL-MAP testpipeline.map
  CC macswap.o
make[5]: warning:  Clock skew detected.  Your build may be incomplete.
  CC flowgen.o
  INSTALL-APP dpdk-test-crypto-perf
  INSTALL-MAP dpdk-test-crypto-perf.map
  CC test_ring_perf.o
make[5]: warning:  Clock skew detected.  Your build may be incomplete.
  CC test_perf_atq.o
  CC rxonly.o
  CC test_pipeline_common.o
  CC txonly.o
  CC csumonly.o
--
  CC test_timer.o
  CC test_timer_perf.o
  INSTALL-APP dpdk-test-eventdev
  INSTALL-MAP dpdk-test-eventdev.map
  CC test_timer_racecond.o
make[5]: warning:  Clock skew detected.  Your build may be incomplete.
  CC test_mempool.o
  CC test_mempool_perf.o
  LD testpmd
  CC test_mbuf.o
  CC test_logs.o
--
  CC test_hash.o
  CC test_thash.o
  CC test_hash_perf.o
  INSTALL-APP testpmd
  INSTALL-MAP testpmd.map
make[5]: warning:  Clock skew detected.  Your build may be incomplete.
  CC test_hash_functions.o
  CC test_hash_readwrite.o
  CC test_hash_multiwriter.o
  CC test_hash_readwrite_lf.o
  CC test_lpm.o
--
  CC test_bpf.o
  CC test_rcu_qsbr.o
  CC test_rcu_qsbr_perf.o
In file included from /tmp/UBT1804_K4.15.0_GCC7.3.0/x86_64-native-linuxapp-gcc/6b1bb5ec45cb44ee9745952c5d8836da/dpdk/app/test/test_rcu_qsbr.c:8:0:
/tmp/UBT1804_K4.15.0_GCC7.3.0/x86_64-native-linuxapp-gcc/6b1bb5ec45cb44ee9745952c5d8836da/dpdk/x86_64-native-linuxapp-gcc/include/rte_rcu_qsbr.h: In function ‘rte_rcu_qsbr_thread_online’:
/tmp/UBT1804_K4.15.0_GCC7.3.0/x86_64-native-linuxapp-gcc/6b1bb5ec45cb44ee9745952c5d8836da/dpdk/x86_64-native-linuxapp-gcc/include/rte_rcu_qsbr.h:227:2: warning: implicit declaration of function ‘rte_smp_mb’ [-Wimplicit-function-declaration]
  rte_smp_mb();
  ^~~~~~~~~~
/tmp/UBT1804_K4.15.0_GCC7.3.0/x86_64-native-linuxapp-gcc/6b1bb5ec45cb44ee9745952c5d8836da/dpdk/x86_64-native-linuxapp-gcc/include/rte_rcu_qsbr.h:227:2: warning: nested extern declaration of ‘rte_smp_mb’ [-Wnested-externs]
In file included from /tmp/UBT1804_K4.15.0_GCC7.3.0/x86_64-native-linuxapp-gcc/6b1bb5ec45cb44ee9745952c5d8836da/dpdk/x86_64-native-linuxapp-gcc/include/generic/rte_cycles.h:18:0,
                 from /tmp/UBT1804_K4.15.0_GCC7.3.0/x86_64-native-linuxapp-gcc/6b1bb5ec45cb44ee9745952c5d8836da/dpdk/x86_64-native-linuxapp-gcc/include/rte_cycles.h:13,
                 from /tmp/UBT1804_K4.15.0_GCC7.3.0/x86_64-native-linuxapp-gcc/6b1bb5ec45cb44ee9745952c5d8836da/dpdk/app/test/test_rcu_qsbr.c:12:
/tmp/UBT1804_K4.15.0_GCC7.3.0/x86_64-native-linuxapp-gcc/6b1bb5ec45cb44ee9745952c5d8836da/dpdk/x86_64-native-linuxapp-gcc/include/rte_atomic.h: At top level:
/tmp/UBT1804_K4.15.0_GCC7.3.0/x86_64-native-linuxapp-gcc/6b1bb5ec45cb44ee9745952c5d8836da/dpdk/x86_64-native-linuxapp-gcc/include/rte_atomic.h:67:1: warning: conflicting types for ‘rte_smp_mb’
 rte_smp_mb(void)
 ^~~~~~~~~~
/tmp/UBT1804_K4.15.0_GCC7.3.0/x86_64-native-linuxapp-gcc/6b1bb5ec45cb44ee9745952c5d8836da/dpdk/x86_64-native-linuxapp-gcc/include/rte_atomic.h:67:1: error: static declaration of ‘rte_smp_mb’ follows non-static declaration
In file included from /tmp/UBT1804_K4.15.0_GCC7.3.0/x86_64-native-linuxapp-gcc/6b1bb5ec45cb44ee9745952c5d8836da/dpdk/app/test/test_rcu_qsbr.c:8:0:
/tmp/UBT1804_K4.15.0_GCC7.3.0/x86_64-native-linuxapp-gcc/6b1bb5ec45cb44ee9745952c5d8836da/dpdk/x86_64-native-linuxapp-gcc/include/rte_rcu_qsbr.h:227:2: note: previous implicit declaration of ‘rte_smp_mb’ was here
  rte_smp_mb();
  ^~~~~~~~~~
/tmp/UBT1804_K4.15.0_GCC7.3.0/x86_64-native-linuxapp-gcc/6b1bb5ec45cb44ee9745952c5d8836da/dpdk/mk/internal/rte.compile-pre.mk:114: recipe for target 'test_rcu_qsbr.o' failed
make[5]: *** [test_rcu_qsbr.o] Error 1
make[5]: *** Waiting for unfinished jobs....
In file included from /tmp/UBT1804_K4.15.0_GCC7.3.0/x86_64-native-linuxapp-gcc/6b1bb5ec45cb44ee9745952c5d8836da/dpdk/app/test/test_rcu_qsbr_perf.c:8:0:
/tmp/UBT1804_K4.15.0_GCC7.3.0/x86_64-native-linuxapp-gcc/6b1bb5ec45cb44ee9745952c5d8836da/dpdk/x86_64-native-linuxapp-gcc/include/rte_rcu_qsbr.h: In function ‘rte_rcu_qsbr_thread_online’:
/tmp/UBT1804_K4.15.0_GCC7.3.0/x86_64-native-linuxapp-gcc/6b1bb5ec45cb44ee9745952c5d8836da/dpdk/x86_64-native-linuxapp-gcc/include/rte_rcu_qsbr.h:227:2: warning: implicit declaration of function ‘rte_smp_mb’ [-Wimplicit-function-declaration]
  rte_smp_mb();
  ^~~~~~~~~~
/tmp/UBT1804_K4.15.0_GCC7.3.0/x86_64-native-linuxapp-gcc/6b1bb5ec45cb44ee9745952c5d8836da/dpdk/x86_64-native-linuxapp-gcc/include/rte_rcu_qsbr.h:227:2: warning: nested extern declaration of ‘rte_smp_mb’ [-Wnested-externs]
In file included from /tmp/UBT1804_K4.15.0_GCC7.3.0/x86_64-native-linuxapp-gcc/6b1bb5ec45cb44ee9745952c5d8836da/dpdk/x86_64-native-linuxapp-gcc/include/generic/rte_cycles.h:18:0,
                 from /tmp/UBT1804_K4.15.0_GCC7.3.0/x86_64-native-linuxapp-gcc/6b1bb5ec45cb44ee9745952c5d8836da/dpdk/x86_64-native-linuxapp-gcc/include/rte_cycles.h:13,
                 from /tmp/UBT1804_K4.15.0_GCC7.3.0/x86_64-native-linuxapp-gcc/6b1bb5ec45cb44ee9745952c5d8836da/dpdk/app/test/test_rcu_qsbr_perf.c:12:
/tmp/UBT1804_K4.15.0_GCC7.3.0/x86_64-native-linuxapp-gcc/6b1bb5ec45cb44ee9745952c5d8836da/dpdk/x86_64-native-linuxapp-gcc/include/rte_atomic.h: At top level:
/tmp/UBT1804_K4.15.0_GCC7.3.0/x86_64-native-linuxapp-gcc/6b1bb5ec45cb44ee9745952c5d8836da/dpdk/x86_64-native-linuxapp-gcc/include/rte_atomic.h:67:1: warning: conflicting types for ‘rte_smp_mb’
 rte_smp_mb(void)
 ^~~~~~~~~~
/tmp/UBT1804_K4.15.0_GCC7.3.0/x86_64-native-linuxapp-gcc/6b1bb5ec45cb44ee9745952c5d8836da/dpdk/x86_64-native-linuxapp-gcc/include/rte_atomic.h:67:1: error: static declaration of ‘rte_smp_mb’ follows non-static declaration
In file included from /tmp/UBT1804_K4.15.0_GCC7.3.0/x86_64-native-linuxapp-gcc/6b1bb5ec45cb44ee9745952c5d8836da/dpdk/app/test/test_rcu_qsbr_perf.c:8:0:
/tmp/UBT1804_K4.15.0_GCC7.3.0/x86_64-native-linuxapp-gcc/6b1bb5ec45cb44ee9745952c5d8836da/dpdk/x86_64-native-linuxapp-gcc/include/rte_rcu_qsbr.h:227:2: note: previous implicit declaration of ‘rte_smp_mb’ was here
  rte_smp_mb();
  ^~~~~~~~~~
/tmp/UBT1804_K4.15.0_GCC7.3.0/x86_64-native-linuxapp-gcc/6b1bb5ec45cb44ee9745952c5d8836da/dpdk/mk/internal/rte.compile-pre.mk:114: recipe for target 'test_rcu_qsbr_perf.o' failed
make[5]: *** [test_rcu_qsbr_perf.o] Error 1
/tmp/UBT1804_K4.15.0_GCC7.3.0/x86_64-native-linuxapp-gcc/6b1bb5ec45cb44ee9745952c5d8836da/dpdk/mk/rte.subdir.mk:35: recipe for target 'test' failed
make[4]: *** [test] Error 2
/tmp/UBT1804_K4.15.0_GCC7.3.0/x86_64-native-linuxapp-gcc/6b1bb5ec45cb44ee9745952c5d8836da/dpdk/mk/rte.sdkbuild.mk:46: recipe for target 'app' failed
make[3]: *** [app] Error 2
/tmp/UBT1804_K4.15.0_GCC7.3.0/x86_64-native-linuxapp-gcc/6b1bb5ec45cb44ee9745952c5d8836da/dpdk/mk/rte.sdkroot.mk:98: recipe for target 'all' failed
make[2]: *** [all] Error 2
/tmp/UBT1804_K4.15.0_GCC7.3.0/x86_64-native-linuxapp-gcc/6b1bb5ec45cb44ee9745952c5d8836da/dpdk/mk/rte.sdkinstall.mk:60: recipe for target 'pre_install' failed
make[1]: *** [pre_install] Error 2
/tmp/UBT1804_K4.15.0_GCC7.3.0/x86_64-native-linuxapp-gcc/6b1bb5ec45cb44ee9745952c5d8836da/dpdk/mk/rte.sdkroot.mk:77: recipe for target 'install' failed
make: *** [install] Error 2

*Failed Build #5:
OS: UBT1804
Target: x86_64-native-linuxapp-icc
  INSTALL-LIB librte_meter.a
  AR librte_rcu.a
  INSTALL-LIB librte_rcu.a
  CC acl_run_avx2.o
  CC cmdline_cirbuf.o
make[5]: warning:  Clock skew detected.  Your build may be incomplete.
  CC cmdline_parse.o
  CC cmdline_parse_etheraddr.o
  CC cmdline_parse_ipaddr.o
  CC cmdline_parse_num.o
  CC cmdline_parse_string.o
--
  CC rte_table_action.o
  AR librte_flow_classify.a
  INSTALL-LIB librte_flow_classify.a
  AR librte_pipeline.a
  INSTALL-LIB librte_pipeline.a
make[4]: warning:  Clock skew detected.  Your build may be incomplete.
== Build kernel
== Build buildtools
== Build buildtools/pmdinfogen
== Build kernel/linux
  HOSTCC pmdinfogen.o
--
  CC hn_rxtx.o
  PMDINFO lio_ethdev.o.pmd.c
  CC lio_ethdev.o.pmd.o
  AR librte_pmd_fm10k.a
  INSTALL-LIB librte_pmd_fm10k.a
make[6]: warning:  Clock skew detected.  Your build may be incomplete.
  CC lio_23xx_vf.o
  LD lio_ethdev.o
== Build drivers/crypto/virtio
  CC lio_mbox.o
  CC base/vnic_intr.o
--
  CC ifpga_fme_iperf.o
  PMDINFO dpaa2_cmdif.o.pmd.c
  CC dpaa2_cmdif.o.pmd.o
  PMDINFO skeleton_rawdev.o.pmd.c
  CC skeleton_rawdev.o.pmd.o
  CC ifpga_fme_error.o
  LD dpaa2_cmdif.o
  CC ifpga_port.o
  CC ifpga_port_error.o
  CC opae_hw_api.o
  AR librte_pmd_dpaa2_cmdif.a
  INSTALL-LIB librte_pmd_dpaa2_cmdif.a
  LD skeleton_rawdev.o
  CC opae_ifpga_hw_api.o
--
  CC comp_perf_options_parse.o
  CC cperf_options_parsing.o
  CC test_resource.o
  INSTALL-APP testacl
  INSTALL-MAP testacl.map
make[5]: warning:  Clock skew detected.  Your build may be incomplete.
  INSTALL-APP dpdk-procinfo
  INSTALL-APP cmdline_test
== Build app/test-eventdev
  INSTALL-MAP cmdline_test.map
  INSTALL-MAP dpdk-procinfo.map
make[5]: warning:  Clock skew detected.  Your build may be incomplete.
make[5]: warning:  Clock skew detected.  Your build may be incomplete.
  CC cmdline.o
  CC parameters.o
  CC runtime.o
  CC test_prefetch.o
  CC comp_perf_test_verify.o
  INSTALL-APP dpdk-pdump
  INSTALL-MAP dpdk-pdump.map
  CC cperf_test_vectors.o
make[5]: warning:  Clock skew detected.  Your build may be incomplete.
  CC comp_perf_test_benchmark.o
  CC test_bbdev_vector.o
  CC test_byteorder.o
  CC pipeline_stub.o
  CC test_per_lcore.o
--
  CC pipeline_acl.o
  CC cperf_test_latency.o
  INSTALL-APP dpdk-test-compress-perf
  INSTALL-MAP dpdk-test-compress-perf.map
  CC test_memzone.o
make[5]: warning:  Clock skew detected.  Your build may be incomplete.
  CC test_bitmap.o
  CC evt_options.o
  CC test_reciprocal_division.o
  CC test_reciprocal_division_perf.o
  LD testpipeline
--
  CC test_order_queue.o
  INSTALL-APP testbbdev
  INSTALL-APP testpipeline
  INSTALL-MAP testbbdev.map
  INSTALL-MAP testpipeline.map
make[5]: warning:  Clock skew detected.  Your build may be incomplete.
  CC test_order_atq.o
make[5]: warning:  Clock skew detected.  Your build may be incomplete.
  CC test_perf_common.o
  CC test_perf_queue.o
  CC cmdline_tm.o
  CC test_pmd_perf.o
  LD dpdk-test-crypto-perf
--
  CC test_table_combined.o
  CC test_table_acl.o
  INSTALL-APP dpdk-test-crypto-perf
  INSTALL-MAP dpdk-test-crypto-perf.map
  CC test_flow_classify.o
make[5]: warning:  Clock skew detected.  Your build may be incomplete.
  CC test_rwlock.o
  LD dpdk-test-eventdev
  CC test_timer.o
  CC test_timer_perf.o
  CC iofwd.o
--
  CC test_mempool_perf.o
  CC test_mbuf.o
  INSTALL-APP dpdk-test-eventdev
  INSTALL-MAP dpdk-test-eventdev.map
  CC flowgen.o
make[5]: warning:  Clock skew detected.  Your build may be incomplete.
  CC test_logs.o
  CC rxonly.o
  CC txonly.o
  CC test_memcpy.o
  CC csumonly.o
--
  INSTALL-APP testpmd
  INSTALL-MAP testpmd.map
  CC test_func_reentrancy.o
  CC test_service_cores.o
  CC test_bitratestats.o
make[5]: warning:  Clock skew detected.  Your build may be incomplete.
  CC test_cmdline.o
  CC test_latencystats.o
  CC test_cmdline_num.o
  CC test_cmdline_etheraddr.o
  CC test_cmdline_portlist.o
--
  CC test_bpf.o
  CC test_rcu_qsbr.o
  CC test_rcu_qsbr_perf.o
In file included from /tmp/UBT1804_K4.15.0_ICC19.0.0/x86_64-native-linuxapp-icc/6b1bb5ec45cb44ee9745952c5d8836da/dpdk/app/test/test_rcu_qsbr_perf.c(8):
In file included from /tmp/UBT1804_K4.15.0_ICC19.0.0/x86_64-native-linuxapp-icc/6b1bb5ec45cb44ee9745952c5d8836da/dpdk/app/test/test_rcu_qsbr.c(8):
/tmp/UBT1804_K4.15.0_ICC19.0.0/x86_64-native-linuxapp-icc/6b1bb5ec45cb44ee9745952c5d8836da/dpdk/x86_64-native-linuxapp-icc/include/rte_rcu_qsbr.h(227): warning #266: function "rte_smp_mb" declared implicitly
  	rte_smp_mb();
  	^

/tmp/UBT1804_K4.15.0_ICC19.0.0/x86_64-native-linuxapp-icc/6b1bb5ec45cb44ee9745952c5d8836da/dpdk/x86_64-native-linuxapp-icc/include/rte_rcu_qsbr.h(227): warning #266: function "rte_smp_mb" declared implicitly
  	rte_smp_mb();
  	^

In file included from /tmp/UBT1804_K4.15.0_ICC19.0.0/x86_64-native-linuxapp-icc/6b1bb5ec45cb44ee9745952c5d8836da/dpdk/x86_64-native-linuxapp-icc/include/generic/rte_cycles.h(18),
                 from /tmp/UBT1804_K4.15.0_ICC19.0.0/x86_64-native-linuxapp-icc/6b1bb5ec45cb44ee9745952c5d8836da/dpdk/x86_64-native-linuxapp-icc/include/rte_cycles.h(13),
                 from /tmp/UBT1804_K4.15.0_ICC19.0.0/x86_64-native-linuxapp-icc/6b1bb5ec45cb44ee9745952c5d8836da/dpdk/app/test/test_rcu_qsbr_perf.c(12):
/tmp/UBT1804_K4.15.0_ICC19.0.0/x86_64-native-linuxapp-icc/6b1bb5ec45cb44ee9745952c5d8836da/dpdk/x86_64-native-linuxapp-icc/include/rte_atomic.h(67): warning #159: declaration is incompatible with previous "rte_smp_mb" (declared at line 227 of "/tmp/UBT1804_K4.15.0_ICC19.0.0/x86_64-native-linuxapp-icc/6b1bb5ec45cb44ee9745952c5d8836da/dpdk/x86_64-native-linuxapp-icc/include/rte_rcu_qsbr.h")
  rte_smp_mb(void)
  ^

In file included from /tmp/UBT1804_K4.15.0_ICC19.0.0/x86_64-native-linuxapp-icc/6b1bb5ec45cb44ee9745952c5d8836da/dpdk/x86_64-native-linuxapp-icc/include/generic/rte_cycles.h(18),
                 from /tmp/UBT1804_K4.15.0_ICC19.0.0/x86_64-native-linuxapp-icc/6b1bb5ec45cb44ee9745952c5d8836da/dpdk/x86_64-native-linuxapp-icc/include/rte_cycles.h(13),
                 from /tmp/UBT1804_K4.15.0_ICC19.0.0/x86_64-native-linuxapp-icc/6b1bb5ec45cb44ee9745952c5d8836da/dpdk/app/test/test_rcu_qsbr.c(12):
/tmp/UBT1804_K4.15.0_ICC19.0.0/x86_64-native-linuxapp-icc/6b1bb5ec45cb44ee9745952c5d8836da/dpdk/x86_64-native-linuxapp-icc/include/rte_atomic.h(67): warning #159: declaration is incompatible with previous "rte_smp_mb" (declared at line 227 of "/tmp/UBT1804_K4.15.0_ICC19.0.0/x86_64-native-linuxapp-icc/6b1bb5ec45cb44ee9745952c5d8836da/dpdk/x86_64-native-linuxapp-icc/include/rte_rcu_qsbr.h")
  rte_smp_mb(void)
  ^

  CC test_ipsec.o
  MKRES test_resource_c.res.o
--
test_rcu_qsbr.o: In function `test_rcu_qsbr_main':
test_rcu_qsbr.c:(.text+0xfbf): undefined reference to `rte_smp_mb'
test_rcu_qsbr.c:(.text+0x108a): undefined reference to `rte_smp_mb'
test_rcu_qsbr.c:(.text+0x1621): undefined reference to `rte_smp_mb'
test_rcu_qsbr.o:test_rcu_qsbr.c:(.text+0x17af): more undefined references to `rte_smp_mb' follow
/tmp/UBT1804_K4.15.0_ICC19.0.0/x86_64-native-linuxapp-icc/6b1bb5ec45cb44ee9745952c5d8836da/dpdk/mk/rte.app.mk:398: recipe for target 'test' failed
make[5]: *** [test] Error 1
/tmp/UBT1804_K4.15.0_ICC19.0.0/x86_64-native-linuxapp-icc/6b1bb5ec45cb44ee9745952c5d8836da/dpdk/mk/rte.subdir.mk:35: recipe for target 'test' failed
make[4]: *** [test] Error 2
/tmp/UBT1804_K4.15.0_ICC19.0.0/x86_64-native-linuxapp-icc/6b1bb5ec45cb44ee9745952c5d8836da/dpdk/mk/rte.sdkbuild.mk:46: recipe for target 'app' failed
make[3]: *** [app] Error 2
/tmp/UBT1804_K4.15.0_ICC19.0.0/x86_64-native-linuxapp-icc/6b1bb5ec45cb44ee9745952c5d8836da/dpdk/mk/rte.sdkroot.mk:98: recipe for target 'all' failed
make[2]: *** [all] Error 2
/tmp/UBT1804_K4.15.0_ICC19.0.0/x86_64-native-linuxapp-icc/6b1bb5ec45cb44ee9745952c5d8836da/dpdk/mk/rte.sdkinstall.mk:60: recipe for target 'pre_install' failed
make[1]: *** [pre_install] Error 2
/tmp/UBT1804_K4.15.0_ICC19.0.0/x86_64-native-linuxapp-icc/6b1bb5ec45cb44ee9745952c5d8836da/dpdk/mk/rte.sdkroot.mk:77: recipe for target 'install' failed
make: *** [install] Error 2

*Failed Build #6:
OS: UBT1810
Target: x86_64-native-linuxapp-gcc
== Build lib/librte_mempool
  AR librte_rcu.a
  SYMLINK-FILE include/cmdline_cirbuf.h
  INSTALL-LIB librte_rcu.a
  SYMLINK-FILE include/cmdline_parse_portlist.h
make[5]: warning:  Clock skew detected.  Your build may be incomplete.
== Build lib/librte_hash
  CC cmdline.o
  AR librte_meter.a
  CC cmdline_cirbuf.o
  INSTALL-LIB librte_meter.a
--
  CC rte_table_action.o
  AR librte_flow_classify.a
  INSTALL-LIB librte_flow_classify.a
  AR librte_pipeline.a
  INSTALL-LIB librte_pipeline.a
make[4]: warning:  Clock skew detected.  Your build may be incomplete.
== Build buildtools
== Build kernel
== Build kernel/linux
== Build buildtools/pmdinfogen
== Build kernel/linux/igb_uio
--
== Build drivers/crypto/virtio
  CC i40e_ethdev.o
  CC ice_flow.o
  AR librte_pmd_fm10k.a
  INSTALL-LIB librte_pmd_fm10k.a
make[6]: warning:  Clock skew detected.  Your build may be incomplete.
== Build drivers/net/liquidio
  PMDINFO caam_jr.o.pmd.c
  CC caam_jr.o.pmd.o
  LD caam_jr.o
  CC em_rxtx.o
--
  LD dpaa2_cmdif.o
  AR librte_pmd_dpaa2_cmdif.a
  INSTALL-LIB librte_pmd_dpaa2_cmdif.a
  PMDINFO skeleton_rawdev.o.pmd.c
  CC skeleton_rawdev.o.pmd.o
  CC ifpga_fme_error.o
  LD skeleton_rawdev.o
  CC ifpga_port.o
  CC ifpga_port_error.o
  CC opae_hw_api.o
  CC opae_ifpga_hw_api.o
  CC opae_debug.o
  CC ifpga_fme_pr.o
  CC ifpga_rawdev.o
--
  LD dpdk-procinfo
  CC cperf_ops.o
  INSTALL-APP dpdk-pdump
  INSTALL-MAP dpdk-pdump.map
  INSTALL-APP cmdline_test
make[5]: warning:  Clock skew detected.  Your build may be incomplete.
  CC cperf_options_parsing.o
  INSTALL-MAP cmdline_test.map
make[5]: warning:  Clock skew detected.  Your build may be incomplete.
  CC parameters.o
  CC resource.o
  CC comp_perf_options_parse.o
  CC init.o
  CC test_resource.o
  CC test_bbdev_perf.o
  INSTALL-APP dpdk-procinfo
  INSTALL-MAP dpdk-procinfo.map
  INSTALL-APP testacl
make[5]: warning:  Clock skew detected.  Your build may be incomplete.
  INSTALL-MAP testacl.map
== Build app/test-eventdev
make[5]: warning:  Clock skew detected.  Your build may be incomplete.
  CC cperf_test_vectors.o
  CC runtime.o
  CC test_bbdev_vector.o
  CC test_prefetch.o
  CC test_byteorder.o
--
  CC test_bitmap.o
  CC test_reciprocal_division.o
  INSTALL-APP dpdk-test-compress-perf
  INSTALL-MAP dpdk-test-compress-perf.map
  CC test_order_queue.o
make[5]: warning:  Clock skew detected.  Your build may be incomplete.
  CC test_reciprocal_division_perf.o
  CC cperf_test_verify.o
  CC cperf_test_vector_parsing.o
  CC cmdline_mtr.o
  LD testpipeline
--
  CC config.o
  CC test_external_mem.o
  INSTALL-APP testpipeline
  LD testbbdev
  INSTALL-MAP testpipeline.map
make[5]: warning:  Clock skew detected.  Your build may be incomplete.
  CC test_ring.o
  CC test_ring_perf.o
  CC test_perf_queue.o
  CC cperf_test_common.o
  CC iofwd.o
  CC test_perf_atq.o
  CC test_pipeline_common.o
  INSTALL-APP testbbdev
  INSTALL-MAP testbbdev.map
make[5]: warning:  Clock skew detected.  Your build may be incomplete.
  CC test_pipeline_queue.o
  LD dpdk-test-crypto-perf
  CC macfwd.o
  CC macswap.o
  CC flowgen.o
  CC test_pipeline_atq.o
  INSTALL-APP dpdk-test-crypto-perf
  INSTALL-MAP dpdk-test-crypto-perf.map
  CC test_pmd_perf.o
make[5]: warning:  Clock skew detected.  Your build may be incomplete.
  CC test_table.o
  CC rxonly.o
  CC txonly.o
  CC csumonly.o
  LD dpdk-test-eventdev
--
  CC test_table_pipeline.o
  CC test_table_tables.o
  CC bpf_cmd.o
  INSTALL-APP dpdk-test-eventdev
  INSTALL-MAP dpdk-test-eventdev.map
make[5]: warning:  Clock skew detected.  Your build may be incomplete.
  CC util.o
  CC softnicfwd.o
  CC test_table_ports.o
  CC test_table_combined.o
  CC test_table_acl.o
--
  CC test_lpm6_perf.o
  CC test_debug.o
  INSTALL-APP testpmd
  INSTALL-MAP testpmd.map
  CC test_errno.o
make[5]: warning:  Clock skew detected.  Your build may be incomplete.
  CC test_tailq.o
  CC test_string_fns.o
  CC test_cpuflags.o
  CC test_mp_secondary.o
  CC test_eal_flags.o
--
  CC test_kvargs.o
  CC test_bpf.o
  CC test_rcu_qsbr.o
In file included from /tmp/UBT1810_K4.18.0_GCC8.2.0/x86_64-native-linuxapp-gcc/6b1bb5ec45cb44ee9745952c5d8836da/dpdk/app/test/test_rcu_qsbr.c:8:
/tmp/UBT1810_K4.18.0_GCC8.2.0/x86_64-native-linuxapp-gcc/6b1bb5ec45cb44ee9745952c5d8836da/dpdk/x86_64-native-linuxapp-gcc/include/rte_rcu_qsbr.h: In function ‘rte_rcu_qsbr_thread_online’:
/tmp/UBT1810_K4.18.0_GCC8.2.0/x86_64-native-linuxapp-gcc/6b1bb5ec45cb44ee9745952c5d8836da/dpdk/x86_64-native-linuxapp-gcc/include/rte_rcu_qsbr.h:227:2: warning: implicit declaration of function ‘rte_smp_mb’ [-Wimplicit-function-declaration]
  rte_smp_mb();
  ^~~~~~~~~~
/tmp/UBT1810_K4.18.0_GCC8.2.0/x86_64-native-linuxapp-gcc/6b1bb5ec45cb44ee9745952c5d8836da/dpdk/x86_64-native-linuxapp-gcc/include/rte_rcu_qsbr.h:227:2: warning: nested extern declaration of ‘rte_smp_mb’ [-Wnested-externs]
  CC test_rcu_qsbr_perf.o
In file included from /tmp/UBT1810_K4.18.0_GCC8.2.0/x86_64-native-linuxapp-gcc/6b1bb5ec45cb44ee9745952c5d8836da/dpdk/x86_64-native-linuxapp-gcc/include/generic/rte_cycles.h:18,
                 from /tmp/UBT1810_K4.18.0_GCC8.2.0/x86_64-native-linuxapp-gcc/6b1bb5ec45cb44ee9745952c5d8836da/dpdk/x86_64-native-linuxapp-gcc/include/rte_cycles.h:13,
                 from /tmp/UBT1810_K4.18.0_GCC8.2.0/x86_64-native-linuxapp-gcc/6b1bb5ec45cb44ee9745952c5d8836da/dpdk/app/test/test_rcu_qsbr.c:12:
/tmp/UBT1810_K4.18.0_GCC8.2.0/x86_64-native-linuxapp-gcc/6b1bb5ec45cb44ee9745952c5d8836da/dpdk/x86_64-native-linuxapp-gcc/include/rte_atomic.h: At top level:
/tmp/UBT1810_K4.18.0_GCC8.2.0/x86_64-native-linuxapp-gcc/6b1bb5ec45cb44ee9745952c5d8836da/dpdk/x86_64-native-linuxapp-gcc/include/rte_atomic.h:67:1: warning: conflicting types for ‘rte_smp_mb’
 rte_smp_mb(void)
 ^~~~~~~~~~
/tmp/UBT1810_K4.18.0_GCC8.2.0/x86_64-native-linuxapp-gcc/6b1bb5ec45cb44ee9745952c5d8836da/dpdk/x86_64-native-linuxapp-gcc/include/rte_atomic.h:67:1: error: static declaration of ‘rte_smp_mb’ follows non-static declaration
In file included from /tmp/UBT1810_K4.18.0_GCC8.2.0/x86_64-native-linuxapp-gcc/6b1bb5ec45cb44ee9745952c5d8836da/dpdk/app/test/test_rcu_qsbr.c:8:
/tmp/UBT1810_K4.18.0_GCC8.2.0/x86_64-native-linuxapp-gcc/6b1bb5ec45cb44ee9745952c5d8836da/dpdk/x86_64-native-linuxapp-gcc/include/rte_rcu_qsbr.h:227:2: note: previous implicit declaration of ‘rte_smp_mb’ was here
  rte_smp_mb();
  ^~~~~~~~~~
make[5]: *** [/tmp/UBT1810_K4.18.0_GCC8.2.0/x86_64-native-linuxapp-gcc/6b1bb5ec45cb44ee9745952c5d8836da/dpdk/mk/internal/rte.compile-pre.mk:116: test_rcu_qsbr.o] Error 1
make[5]: *** Waiting for unfinished jobs....
In file included from /tmp/UBT1810_K4.18.0_GCC8.2.0/x86_64-native-linuxapp-gcc/6b1bb5ec45cb44ee9745952c5d8836da/dpdk/app/test/test_rcu_qsbr_perf.c:8:
/tmp/UBT1810_K4.18.0_GCC8.2.0/x86_64-native-linuxapp-gcc/6b1bb5ec45cb44ee9745952c5d8836da/dpdk/x86_64-native-linuxapp-gcc/include/rte_rcu_qsbr.h: In function ‘rte_rcu_qsbr_thread_online’:
/tmp/UBT1810_K4.18.0_GCC8.2.0/x86_64-native-linuxapp-gcc/6b1bb5ec45cb44ee9745952c5d8836da/dpdk/x86_64-native-linuxapp-gcc/include/rte_rcu_qsbr.h:227:2: warning: implicit declaration of function ‘rte_smp_mb’ [-Wimplicit-function-declaration]
  rte_smp_mb();
  ^~~~~~~~~~
/tmp/UBT1810_K4.18.0_GCC8.2.0/x86_64-native-linuxapp-gcc/6b1bb5ec45cb44ee9745952c5d8836da/dpdk/x86_64-native-linuxapp-gcc/include/rte_rcu_qsbr.h:227:2: warning: nested extern declaration of ‘rte_smp_mb’ [-Wnested-externs]
In file included from /tmp/UBT1810_K4.18.0_GCC8.2.0/x86_64-native-linuxapp-gcc/6b1bb5ec45cb44ee9745952c5d8836da/dpdk/x86_64-native-linuxapp-gcc/include/generic/rte_cycles.h:18,
                 from /tmp/UBT1810_K4.18.0_GCC8.2.0/x86_64-native-linuxapp-gcc/6b1bb5ec45cb44ee9745952c5d8836da/dpdk/x86_64-native-linuxapp-gcc/include/rte_cycles.h:13,
                 from /tmp/UBT1810_K4.18.0_GCC8.2.0/x86_64-native-linuxapp-gcc/6b1bb5ec45cb44ee9745952c5d8836da/dpdk/app/test/test_rcu_qsbr_perf.c:12:
/tmp/UBT1810_K4.18.0_GCC8.2.0/x86_64-native-linuxapp-gcc/6b1bb5ec45cb44ee9745952c5d8836da/dpdk/x86_64-native-linuxapp-gcc/include/rte_atomic.h: At top level:
/tmp/UBT1810_K4.18.0_GCC8.2.0/x86_64-native-linuxapp-gcc/6b1bb5ec45cb44ee9745952c5d8836da/dpdk/x86_64-native-linuxapp-gcc/include/rte_atomic.h:67:1: warning: conflicting types for ‘rte_smp_mb’
 rte_smp_mb(void)
 ^~~~~~~~~~
/tmp/UBT1810_K4.18.0_GCC8.2.0/x86_64-native-linuxapp-gcc/6b1bb5ec45cb44ee9745952c5d8836da/dpdk/x86_64-native-linuxapp-gcc/include/rte_atomic.h:67:1: error: static declaration of ‘rte_smp_mb’ follows non-static declaration
In file included from /tmp/UBT1810_K4.18.0_GCC8.2.0/x86_64-native-linuxapp-gcc/6b1bb5ec45cb44ee9745952c5d8836da/dpdk/app/test/test_rcu_qsbr_perf.c:8:
/tmp/UBT1810_K4.18.0_GCC8.2.0/x86_64-native-linuxapp-gcc/6b1bb5ec45cb44ee9745952c5d8836da/dpdk/x86_64-native-linuxapp-gcc/include/rte_rcu_qsbr.h:227:2: note: previous implicit declaration of ‘rte_smp_mb’ was here
  rte_smp_mb();
  ^~~~~~~~~~
make[5]: *** [/tmp/UBT1810_K4.18.0_GCC8.2.0/x86_64-native-linuxapp-gcc/6b1bb5ec45cb44ee9745952c5d8836da/dpdk/mk/internal/rte.compile-pre.mk:114: test_rcu_qsbr_perf.o] Error 1

*Failed Build #7:
OS: RHEL75
Target: x86_64-native-linuxapp-gcc
  PMDINFO dpaa2_qdma.o.pmd.c
  CC ifpga_fme_dperf.o
  CC dpaa2_qdma.o.pmd.o
  LD skeleton_rawdev.o
  LD dpaa2_qdma.o
  CC ifpga_fme_error.o
  PMDINFO dpaa2_cmdif.o.pmd.c
  AR librte_pmd_skeleton_rawdev.a
  CC dpaa2_cmdif.o.pmd.o
  CC ifpga_port.o
  CC ifpga_port_error.o
  LD dpaa2_cmdif.o
  CC opae_hw_api.o
  AR librte_pmd_dpaa2_cmdif.a
  CC opae_ifpga_hw_api.o
  CC opae_debug.o
--
  CC test_rcu_qsbr_perf.o
  CC test_ipsec.o
  MKRES test_resource_c.res.o
In file included from /tmp/RHEL75_K3.10.0_GCC4.8.5/x86_64-native-linuxapp-gcc/6b1bb5ec45cb44ee9745952c5d8836da/dpdk/app/test/test_rcu_qsbr_perf.c:8:0:
/tmp/RHEL75_K3.10.0_GCC4.8.5/x86_64-native-linuxapp-gcc/6b1bb5ec45cb44ee9745952c5d8836da/dpdk/x86_64-native-linuxapp-gcc/include/rte_rcu_qsbr.h: In function ‘rte_rcu_qsbr_thread_online’:
/tmp/RHEL75_K3.10.0_GCC4.8.5/x86_64-native-linuxapp-gcc/6b1bb5ec45cb44ee9745952c5d8836da/dpdk/x86_64-native-linuxapp-gcc/include/rte_rcu_qsbr.h:227:2: warning: implicit declaration of function ‘rte_smp_mb’ [-Wimplicit-function-declaration]
  rte_smp_mb();
  ^
/tmp/RHEL75_K3.10.0_GCC4.8.5/x86_64-native-linuxapp-gcc/6b1bb5ec45cb44ee9745952c5d8836da/dpdk/x86_64-native-linuxapp-gcc/include/rte_rcu_qsbr.h:227:2: warning: nested extern declaration of ‘rte_smp_mb’ [-Wnested-externs]
In file included from /tmp/RHEL75_K3.10.0_GCC4.8.5/x86_64-native-linuxapp-gcc/6b1bb5ec45cb44ee9745952c5d8836da/dpdk/x86_64-native-linuxapp-gcc/include/generic/rte_cycles.h:18:0,
                 from /tmp/RHEL75_K3.10.0_GCC4.8.5/x86_64-native-linuxapp-gcc/6b1bb5ec45cb44ee9745952c5d8836da/dpdk/x86_64-native-linuxapp-gcc/include/rte_cycles.h:13,
                 from /tmp/RHEL75_K3.10.0_GCC4.8.5/x86_64-native-linuxapp-gcc/6b1bb5ec45cb44ee9745952c5d8836da/dpdk/app/test/test_rcu_qsbr_perf.c:12:
/tmp/RHEL75_K3.10.0_GCC4.8.5/x86_64-native-linuxapp-gcc/6b1bb5ec45cb44ee9745952c5d8836da/dpdk/x86_64-native-linuxapp-gcc/include/rte_atomic.h: At top level:
/tmp/RHEL75_K3.10.0_GCC4.8.5/x86_64-native-linuxapp-gcc/6b1bb5ec45cb44ee9745952c5d8836da/dpdk/x86_64-native-linuxapp-gcc/include/rte_atomic.h:67:1: warning: conflicting types for ‘rte_smp_mb’ [enabled by default]
 rte_smp_mb(void)
 ^
/tmp/RHEL75_K3.10.0_GCC4.8.5/x86_64-native-linuxapp-gcc/6b1bb5ec45cb44ee9745952c5d8836da/dpdk/x86_64-native-linuxapp-gcc/include/rte_atomic.h:67:1: error: static declaration of ‘rte_smp_mb’ follows non-static declaration
In file included from /tmp/RHEL75_K3.10.0_GCC4.8.5/x86_64-native-linuxapp-gcc/6b1bb5ec45cb44ee9745952c5d8836da/dpdk/app/test/test_rcu_qsbr_perf.c:8:0:
/tmp/RHEL75_K3.10.0_GCC4.8.5/x86_64-native-linuxapp-gcc/6b1bb5ec45cb44ee9745952c5d8836da/dpdk/x86_64-native-linuxapp-gcc/include/rte_rcu_qsbr.h:227:2: note: previous implicit declaration of ‘rte_smp_mb’ was here
  rte_smp_mb();
  ^
make[5]: *** [test_rcu_qsbr_perf.o] Error 1
make[5]: *** Waiting for unfinished jobs....
In file included from /tmp/RHEL75_K3.10.0_GCC4.8.5/x86_64-native-linuxapp-gcc/6b1bb5ec45cb44ee9745952c5d8836da/dpdk/app/test/test_rcu_qsbr.c:8:0:
/tmp/RHEL75_K3.10.0_GCC4.8.5/x86_64-native-linuxapp-gcc/6b1bb5ec45cb44ee9745952c5d8836da/dpdk/x86_64-native-linuxapp-gcc/include/rte_rcu_qsbr.h: In function ‘rte_rcu_qsbr_thread_online’:
/tmp/RHEL75_K3.10.0_GCC4.8.5/x86_64-native-linuxapp-gcc/6b1bb5ec45cb44ee9745952c5d8836da/dpdk/x86_64-native-linuxapp-gcc/include/rte_rcu_qsbr.h:227:2: warning: implicit declaration of function ‘rte_smp_mb’ [-Wimplicit-function-declaration]
  rte_smp_mb();
  ^
/tmp/RHEL75_K3.10.0_GCC4.8.5/x86_64-native-linuxapp-gcc/6b1bb5ec45cb44ee9745952c5d8836da/dpdk/x86_64-native-linuxapp-gcc/include/rte_rcu_qsbr.h:227:2: warning: nested extern declaration of ‘rte_smp_mb’ [-Wnested-externs]
In file included from /tmp/RHEL75_K3.10.0_GCC4.8.5/x86_64-native-linuxapp-gcc/6b1bb5ec45cb44ee9745952c5d8836da/dpdk/x86_64-native-linuxapp-gcc/include/generic/rte_cycles.h:18:0,
                 from /tmp/RHEL75_K3.10.0_GCC4.8.5/x86_64-native-linuxapp-gcc/6b1bb5ec45cb44ee9745952c5d8836da/dpdk/x86_64-native-linuxapp-gcc/include/rte_cycles.h:13,
                 from /tmp/RHEL75_K3.10.0_GCC4.8.5/x86_64-native-linuxapp-gcc/6b1bb5ec45cb44ee9745952c5d8836da/dpdk/app/test/test_rcu_qsbr.c:12:
/tmp/RHEL75_K3.10.0_GCC4.8.5/x86_64-native-linuxapp-gcc/6b1bb5ec45cb44ee9745952c5d8836da/dpdk/x86_64-native-linuxapp-gcc/include/rte_atomic.h: At top level:
/tmp/RHEL75_K3.10.0_GCC4.8.5/x86_64-native-linuxapp-gcc/6b1bb5ec45cb44ee9745952c5d8836da/dpdk/x86_64-native-linuxapp-gcc/include/rte_atomic.h:67:1: warning: conflicting types for ‘rte_smp_mb’ [enabled by default]
 rte_smp_mb(void)
 ^
/tmp/RHEL75_K3.10.0_GCC4.8.5/x86_64-native-linuxapp-gcc/6b1bb5ec45cb44ee9745952c5d8836da/dpdk/x86_64-native-linuxapp-gcc/include/rte_atomic.h:67:1: error: static declaration of ‘rte_smp_mb’ follows non-static declaration
In file included from /tmp/RHEL75_K3.10.0_GCC4.8.5/x86_64-native-linuxapp-gcc/6b1bb5ec45cb44ee9745952c5d8836da/dpdk/app/test/test_rcu_qsbr.c:8:0:
/tmp/RHEL75_K3.10.0_GCC4.8.5/x86_64-native-linuxapp-gcc/6b1bb5ec45cb44ee9745952c5d8836da/dpdk/x86_64-native-linuxapp-gcc/include/rte_rcu_qsbr.h:227:2: note: previous implicit declaration of ‘rte_smp_mb’ was here
  rte_smp_mb();
  ^
make[5]: *** [test_rcu_qsbr.o] Error 1

*Failed Build #8:
OS: FC28
Target: x86_64-native-linuxapp-gcc
  CC dpaa2_cmdif.o
  CC ifpga_fme_iperf.o
  CC ifpga_fme_dperf.o
  CC dpaa2_qdma.o
  PMDINFO dpaa2_cmdif.o.pmd.c
  CC ifpga_fme_error.o
  CC dpaa2_cmdif.o.pmd.o
  LD dpaa2_cmdif.o
  CC ifpga_port.o
  CC ifpga_port_error.o
  AR librte_pmd_dpaa2_cmdif.a
  CC opae_hw_api.o
  INSTALL-LIB librte_pmd_dpaa2_cmdif.a
  CC opae_ifpga_hw_api.o
  CC opae_debug.o
--
  CC test_rcu_qsbr.o
  CC test_rcu_qsbr_perf.o
  CC test_ipsec.o
In file included from /tmp/FC28_K4.16.3_GCC8.0.1/x86_64-native-linuxapp-gcc/6b1bb5ec45cb44ee9745952c5d8836da/dpdk/app/test/test_rcu_qsbr.c:8:
/tmp/FC28_K4.16.3_GCC8.0.1/x86_64-native-linuxapp-gcc/6b1bb5ec45cb44ee9745952c5d8836da/dpdk/x86_64-native-linuxapp-gcc/include/rte_rcu_qsbr.h: In function ‘rte_rcu_qsbr_thread_online’:
/tmp/FC28_K4.16.3_GCC8.0.1/x86_64-native-linuxapp-gcc/6b1bb5ec45cb44ee9745952c5d8836da/dpdk/x86_64-native-linuxapp-gcc/include/rte_rcu_qsbr.h:227:2: warning: implicit declaration of function ‘rte_smp_mb’ [-Wimplicit-function-declaration]
  rte_smp_mb();
  ^~~~~~~~~~
/tmp/FC28_K4.16.3_GCC8.0.1/x86_64-native-linuxapp-gcc/6b1bb5ec45cb44ee9745952c5d8836da/dpdk/x86_64-native-linuxapp-gcc/include/rte_rcu_qsbr.h:227:2: warning: nested extern declaration of ‘rte_smp_mb’ [-Wnested-externs]
In file included from /tmp/FC28_K4.16.3_GCC8.0.1/x86_64-native-linuxapp-gcc/6b1bb5ec45cb44ee9745952c5d8836da/dpdk/x86_64-native-linuxapp-gcc/include/generic/rte_cycles.h:18,
                 from /tmp/FC28_K4.16.3_GCC8.0.1/x86_64-native-linuxapp-gcc/6b1bb5ec45cb44ee9745952c5d8836da/dpdk/x86_64-native-linuxapp-gcc/include/rte_cycles.h:13,
                 from /tmp/FC28_K4.16.3_GCC8.0.1/x86_64-native-linuxapp-gcc/6b1bb5ec45cb44ee9745952c5d8836da/dpdk/app/test/test_rcu_qsbr.c:12:
/tmp/FC28_K4.16.3_GCC8.0.1/x86_64-native-linuxapp-gcc/6b1bb5ec45cb44ee9745952c5d8836da/dpdk/x86_64-native-linuxapp-gcc/include/rte_atomic.h: At top level:
/tmp/FC28_K4.16.3_GCC8.0.1/x86_64-native-linuxapp-gcc/6b1bb5ec45cb44ee9745952c5d8836da/dpdk/x86_64-native-linuxapp-gcc/include/rte_atomic.h:67:1: warning: conflicting types for ‘rte_smp_mb’
 rte_smp_mb(void)
 ^~~~~~~~~~
/tmp/FC28_K4.16.3_GCC8.0.1/x86_64-native-linuxapp-gcc/6b1bb5ec45cb44ee9745952c5d8836da/dpdk/x86_64-native-linuxapp-gcc/include/rte_atomic.h:67:1: error: static declaration of ‘rte_smp_mb’ follows non-static declaration
In file included from /tmp/FC28_K4.16.3_GCC8.0.1/x86_64-native-linuxapp-gcc/6b1bb5ec45cb44ee9745952c5d8836da/dpdk/app/test/test_rcu_qsbr.c:8:
/tmp/FC28_K4.16.3_GCC8.0.1/x86_64-native-linuxapp-gcc/6b1bb5ec45cb44ee9745952c5d8836da/dpdk/x86_64-native-linuxapp-gcc/include/rte_rcu_qsbr.h:227:2: note: previous implicit declaration of ‘rte_smp_mb’ was here
  rte_smp_mb();
  ^~~~~~~~~~
In file included from /tmp/FC28_K4.16.3_GCC8.0.1/x86_64-native-linuxapp-gcc/6b1bb5ec45cb44ee9745952c5d8836da/dpdk/app/test/test_rcu_qsbr_perf.c:8:
/tmp/FC28_K4.16.3_GCC8.0.1/x86_64-native-linuxapp-gcc/6b1bb5ec45cb44ee9745952c5d8836da/dpdk/x86_64-native-linuxapp-gcc/include/rte_rcu_qsbr.h: In function ‘rte_rcu_qsbr_thread_online’:
/tmp/FC28_K4.16.3_GCC8.0.1/x86_64-native-linuxapp-gcc/6b1bb5ec45cb44ee9745952c5d8836da/dpdk/x86_64-native-linuxapp-gcc/include/rte_rcu_qsbr.h:227:2: warning: implicit declaration of function ‘rte_smp_mb’ [-Wimplicit-function-declaration]
  rte_smp_mb();
  ^~~~~~~~~~
/tmp/FC28_K4.16.3_GCC8.0.1/x86_64-native-linuxapp-gcc/6b1bb5ec45cb44ee9745952c5d8836da/dpdk/x86_64-native-linuxapp-gcc/include/rte_rcu_qsbr.h:227:2: warning: nested extern declaration of ‘rte_smp_mb’ [-Wnested-externs]
In file included from /tmp/FC28_K4.16.3_GCC8.0.1/x86_64-native-linuxapp-gcc/6b1bb5ec45cb44ee9745952c5d8836da/dpdk/x86_64-native-linuxapp-gcc/include/generic/rte_cycles.h:18,
                 from /tmp/FC28_K4.16.3_GCC8.0.1/x86_64-native-linuxapp-gcc/6b1bb5ec45cb44ee9745952c5d8836da/dpdk/x86_64-native-linuxapp-gcc/include/rte_cycles.h:13,
                 from /tmp/FC28_K4.16.3_GCC8.0.1/x86_64-native-linuxapp-gcc/6b1bb5ec45cb44ee9745952c5d8836da/dpdk/app/test/test_rcu_qsbr_perf.c:12:
/tmp/FC28_K4.16.3_GCC8.0.1/x86_64-native-linuxapp-gcc/6b1bb5ec45cb44ee9745952c5d8836da/dpdk/x86_64-native-linuxapp-gcc/include/rte_atomic.h: At top level:
/tmp/FC28_K4.16.3_GCC8.0.1/x86_64-native-linuxapp-gcc/6b1bb5ec45cb44ee9745952c5d8836da/dpdk/x86_64-native-linuxapp-gcc/include/rte_atomic.h:67:1: warning: conflicting types for ‘rte_smp_mb’
 rte_smp_mb(void)
 ^~~~~~~~~~
/tmp/FC28_K4.16.3_GCC8.0.1/x86_64-native-linuxapp-gcc/6b1bb5ec45cb44ee9745952c5d8836da/dpdk/x86_64-native-linuxapp-gcc/include/rte_atomic.h:67:1: error: static declaration of ‘rte_smp_mb’ follows non-static declaration
In file included from /tmp/FC28_K4.16.3_GCC8.0.1/x86_64-native-linuxapp-gcc/6b1bb5ec45cb44ee9745952c5d8836da/dpdk/app/test/test_rcu_qsbr_perf.c:8:
/tmp/FC28_K4.16.3_GCC8.0.1/x86_64-native-linuxapp-gcc/6b1bb5ec45cb44ee9745952c5d8836da/dpdk/x86_64-native-linuxapp-gcc/include/rte_rcu_qsbr.h:227:2: note: previous implicit declaration of ‘rte_smp_mb’ was here
  rte_smp_mb();
  ^~~~~~~~~~
make[5]: *** [/tmp/FC28_K4.16.3_GCC8.0.1/x86_64-native-linuxapp-gcc/6b1bb5ec45cb44ee9745952c5d8836da/dpdk/mk/internal/rte.compile-pre.mk:116: test_rcu_qsbr.o] Error 1

*Failed Build #9:
OS: FC28
Target: x86_64-native-linuxapp-clang
  CC ifpga_fme_iperf.o
  CC ifpga_fme_dperf.o
  PMDINFO dpaa2_cmdif.o.pmd.c
  CC dpaa2_cmdif.o.pmd.o
  LD dpaa2_cmdif.o
  CC ifpga_fme_error.o
  CC ifpga_port.o
  CC ifpga_port_error.o
  AR librte_pmd_dpaa2_cmdif.a
  CC opae_hw_api.o
  INSTALL-LIB librte_pmd_dpaa2_cmdif.a
  CC opae_ifpga_hw_api.o
  PMDINFO skeleton_rawdev.o.pmd.c
--
  CC test_kvargs.o
  CC test_bpf.o
  CC test_rcu_qsbr.o
  CC test_rcu_qsbr_perf.o
In file included from /tmp/FC28_K4.16.3_Clang6.0.1/x86_64-native-linuxapp-clang/6b1bb5ec45cb44ee9745952c5d8836da/dpdk/app/test/test_rcu_qsbr.c:8:
/tmp/FC28_K4.16.3_Clang6.0.1/x86_64-native-linuxapp-clang/6b1bb5ec45cb44ee9745952c5d8836da/dpdk/x86_64-native-linuxapp-clang/include/rte_rcu_qsbr.h:227:2: warning: implicit declaration of function 'rte_smp_mb' is invalid in C99 [-Wimplicit-function-declaration]
        rte_smp_mb();
        ^
/tmp/FC28_K4.16.3_Clang6.0.1/x86_64-native-linuxapp-clang/6b1bb5ec45cb44ee9745952c5d8836da/dpdk/x86_64-native-linuxapp-clang/include/rte_rcu_qsbr.h:227:2: warning: this function declaration is not a prototype [-Wstrict-prototypes]
In file included from /tmp/FC28_K4.16.3_Clang6.0.1/x86_64-native-linuxapp-clang/6b1bb5ec45cb44ee9745952c5d8836da/dpdk/app/test/test_rcu_qsbr.c:12:
In file included from /tmp/FC28_K4.16.3_Clang6.0.1/x86_64-native-linuxapp-clang/6b1bb5ec45cb44ee9745952c5d8836da/dpdk/x86_64-native-linuxapp-clang/include/rte_cycles.h:13:
In file included from /tmp/FC28_K4.16.3_Clang6.0.1/x86_64-native-linuxapp-clang/6b1bb5ec45cb44ee9745952c5d8836da/dpdk/x86_64-native-linuxapp-clang/include/generic/rte_cycles.h:18:
/tmp/FC28_K4.16.3_Clang6.0.1/x86_64-native-linuxapp-clang/6b1bb5ec45cb44ee9745952c5d8836da/dpdk/x86_64-native-linuxapp-clang/include/rte_atomic.h:67:1: error: static declaration of 'rte_smp_mb' follows non-static declaration
rte_smp_mb(void)
^
/tmp/FC28_K4.16.3_Clang6.0.1/x86_64-native-linuxapp-clang/6b1bb5ec45cb44ee9745952c5d8836da/dpdk/x86_64-native-linuxapp-clang/include/rte_rcu_qsbr.h:227:2: note: previous implicit declaration is here
        rte_smp_mb();
        ^
2 warnings and 1 error generated.
make[5]: *** [/tmp/FC28_K4.16.3_Clang6.0.1/x86_64-native-linuxapp-clang/6b1bb5ec45cb44ee9745952c5d8836da/dpdk/mk/internal/rte.compile-pre.mk:116: test_rcu_qsbr.o] Error 1
make[5]: *** Waiting for unfinished jobs....
In file included from /tmp/FC28_K4.16.3_Clang6.0.1/x86_64-native-linuxapp-clang/6b1bb5ec45cb44ee9745952c5d8836da/dpdk/app/test/test_rcu_qsbr_perf.c:8:
/tmp/FC28_K4.16.3_Clang6.0.1/x86_64-native-linuxapp-clang/6b1bb5ec45cb44ee9745952c5d8836da/dpdk/x86_64-native-linuxapp-clang/include/rte_rcu_qsbr.h:227:2: warning: implicit declaration of function 'rte_smp_mb' is invalid in C99 [-Wimplicit-function-declaration]
        rte_smp_mb();
        ^
/tmp/FC28_K4.16.3_Clang6.0.1/x86_64-native-linuxapp-clang/6b1bb5ec45cb44ee9745952c5d8836da/dpdk/x86_64-native-linuxapp-clang/include/rte_rcu_qsbr.h:227:2: warning: this function declaration is not a prototype [-Wstrict-prototypes]
In file included from /tmp/FC28_K4.16.3_Clang6.0.1/x86_64-native-linuxapp-clang/6b1bb5ec45cb44ee9745952c5d8836da/dpdk/app/test/test_rcu_qsbr_perf.c:12:
In file included from /tmp/FC28_K4.16.3_Clang6.0.1/x86_64-native-linuxapp-clang/6b1bb5ec45cb44ee9745952c5d8836da/dpdk/x86_64-native-linuxapp-clang/include/rte_cycles.h:13:
In file included from /tmp/FC28_K4.16.3_Clang6.0.1/x86_64-native-linuxapp-clang/6b1bb5ec45cb44ee9745952c5d8836da/dpdk/x86_64-native-linuxapp-clang/include/generic/rte_cycles.h:18:
/tmp/FC28_K4.16.3_Clang6.0.1/x86_64-native-linuxapp-clang/6b1bb5ec45cb44ee9745952c5d8836da/dpdk/x86_64-native-linuxapp-clang/include/rte_atomic.h:67:1: error: static declaration of 'rte_smp_mb' follows non-static declaration
rte_smp_mb(void)
^
/tmp/FC28_K4.16.3_Clang6.0.1/x86_64-native-linuxapp-clang/6b1bb5ec45cb44ee9745952c5d8836da/dpdk/x86_64-native-linuxapp-clang/include/rte_rcu_qsbr.h:227:2: note: previous implicit declaration is here
        rte_smp_mb();
        ^
2 warnings and 1 error generated.
make[5]: *** [/tmp/FC28_K4.16.3_Clang6.0.1/x86_64-native-linuxapp-clang/6b1bb5ec45cb44ee9745952c5d8836da/dpdk/mk/internal/rte.compile-pre.mk:114: test_rcu_qsbr_perf.o] Error 1
make[4]: *** [/tmp/FC28_K4.16.3_Clang6.0.1/x86_64-native-linuxapp-clang/6b1bb5ec45cb44ee9745952c5d8836da/dpdk/mk/rte.subdir.mk:35: test] Error 2
make[3]: *** [/tmp/FC28_K4.16.3_Clang6.0.1/x86_64-native-linuxapp-clang/6b1bb5ec45cb44ee9745952c5d8836da/dpdk/mk/rte.sdkbuild.mk:48: app] Error 2
make[2]: *** [/tmp/FC28_K4.16.3_Clang6.0.1/x86_64-native-linuxapp-clang/6b1bb5ec45cb44ee9745952c5d8836da/dpdk/mk/rte.sdkroot.mk:99: all] Error 2
make[1]: *** [/tmp/FC28_K4.16.3_Clang6.0.1/x86_64-native-linuxapp-clang/6b1bb5ec45cb44ee9745952c5d8836da/dpdk/mk/rte.sdkinstall.mk:61: pre_install] Error 2

*Failed Build #10:
OS: FreeBSD11.2
Target: x86_64-native-bsdapp-gcc
  CC acl_run_sse.o
  AR librte_rcu.a
  INSTALL-LIB librte_rcu.a
  AR librte_jobstats.a
  INSTALL-LIB librte_jobstats.a
gmake[5]: warning:  Clock skew detected.  Your build may be incomplete.
  CC acl_run_avx2.o
  CC cmdline_parse.o
  AR librte_meter.a
  INSTALL-LIB librte_meter.a
  CC cmdline_cirbuf.o
--
  CC rte_table_action.o
  AR librte_flow_classify.a
  INSTALL-LIB librte_flow_classify.a
  AR librte_pipeline.a
  INSTALL-LIB librte_pipeline.a
gmake[4]: warning:  Clock skew detected.  Your build may be incomplete.
== Build buildtools
== Build kernel
== Build kernel/freebsd
== Build buildtools/pmdinfogen
== Build kernel/freebsd/contigmem
--
awk -f /usr/src/sys/tools/makeobjops.awk /usr/src/sys/kern/device_if.m -h
awk -f /usr/src/sys/tools/makeobjops.awk /usr/src/sys/kern/bus_if.m -h
awk -f /usr/src/sys/tools/makeobjops.awk /usr/src/sys/kern/bus_if.m -h
awk -f /usr/src/sys/tools/makeobjops.awk /usr/src/sys/dev/pci/pci_if.m -h
Warning: Object directory not changed from original /tmp/FreeBSD11.2_K11.2_GCC6.4.0/x86_64-native-bsdapp-gcc/6b1bb5ec45cb44ee9745952c5d8836da/dpdk/x86_64-native-bsdapp-gcc/build/kernel/freebsd/contigmem
cc -Winline -Wall -Werror -include /tmp/FreeBSD11.2_K11.2_GCC6.4.0/x86_64-native-bsdapp-gcc/6b1bb5ec45cb44ee9745952c5d8836da/dpdk/x86_64-native-bsdapp-gcc/include/rte_config.h  -Werror -D_KERNEL -DKLD_MODULE -nostdinc  -I/tmp/FreeBSD11.2_K11.2_GCC6.4.0/x86_64-native-bsdapp-gcc/6b1bb5ec45cb44ee9745952c5d8836da/dpdk/kernel/freebsd/contigmem -I/tmp/FreeBSD11.2_K11.2_GCC6.4.0/x86_64-native-bsdapp-gcc/6b1bb5ec45cb44ee9745952c5d8836da/dpdk/x86_64-native-bsdapp-gcc/include -I. -I/usr/src/sys -fno-common  -fno-omit-frame-pointer -mno-omit-leaf-frame-pointer   -MD  -MF.depend.contigmem.o -MTcontigmem.o -mcmodel=kernel -mno-red-zone -mno-mmx -mno-sse -msoft-float  -fno-asynchronous-unwind-tables -ffreestanding -fwrapv -fstack-protector -Wall -Wredundant-decls -Wnested-externs -Wstrict-prototypes -Wmissing-prototypes -Wpointer-arith -Winline -Wcast-qual -Wundef -Wno-pointer-sign -D__printf__=__freebsd_kprintf__ -Wmissing-include-dirs -fdiagnostics-show-option -Wno-unknown-pragmas -Wno-error-tautological-compare -Wno-error-empty-body -Wno-error-parentheses-equality -Wno-error-unused-function -Wno-error-pointer-sign -Wno-error-shift-negative-value -Wno-error-address-of-packed-member  -mno-aes -mno-avx  -std=iso9899:1999 -c contigmem.c -o contigmem.o
Warning: Object directory not changed from original /tmp/FreeBSD11.2_K11.2_GCC6.4.0/x86_64-native-bsdapp-gcc/6b1bb5ec45cb44ee9745952c5d8836da/dpdk/x86_64-native-bsdapp-gcc/build/kernel/freebsd/nic_uio
cc -Winline -Wall -Werror -include /tmp/FreeBSD11.2_K11.2_GCC6.4.0/x86_64-native-bsdapp-gcc/6b1bb5ec45cb44ee9745952c5d8836da/dpdk/x86_64-native-bsdapp-gcc/include/rte_config.h  -Werror -D_KERNEL -DKLD_MODULE -nostdinc  -I/tmp/FreeBSD11.2_K11.2_GCC6.4.0/x86_64-native-bsdapp-gcc/6b1bb5ec45cb44ee9745952c5d8836da/dpdk/kernel/freebsd/nic_uio -I/tmp/FreeBSD11.2_K11.2_GCC6.4.0/x86_64-native-bsdapp-gcc/6b1bb5ec45cb44ee9745952c5d8836da/dpdk/x86_64-native-bsdapp-gcc/include -I. -I/usr/src/sys -fno-common  -fno-omit-frame-pointer -mno-omit-leaf-frame-pointer   -MD  -MF.depend.nic_uio.o -MTnic_uio.o -mcmodel=kernel -mno-red-zone -mno-mmx -mno-sse -msoft-float  -fno-asynchronous-unwind-tables -ffreestanding -fwrapv -fstack-protector -Wall -Wredundant-decls -Wnested-externs -Wstrict-prototypes -Wmissing-prototypes -Wpointer-arith -Winline -Wcast-qual -Wundef -Wno-pointer-sign -D__printf__=__freebsd_kprintf__ -Wmissing-include-dirs -fdiagnostics-show-option -Wno-unknown-pragmas -Wno-error-tautological-compare -Wno-error-empty-body -Wno-error-parentheses-equality -Wno-error-unused-function -Wno-error-pointer-sign -Wno-error-shift-negative-value -Wno-error-address-of-packed-member  -mno-aes -mno-avx  -std=iso9899:1999 -c nic_uio.c -o nic_uio.o
== Build drivers/common
ld -L/tmp/FreeBSD11.2_K11.2_GCC6.4.0/x86_64-native-bsdapp-gcc/6b1bb5ec45cb44ee9745952c5d8836da/dpdk/x86_64-native-bsdapp-gcc/lib -d -warn-common -r -d -o contigmem.ko contigmem.o
:> export_syms
awk -f /usr/src/sys/conf/kmod_syms.awk contigmem.ko  export_syms | xargs -J% objcopy % contigmem.ko
objcopy --strip-debug contigmem.ko
--
  CC lio_rxtx.o
  CC base/vnic_rq.o
  CC ice_switch.o
  AR librte_pmd_fm10k.a
  INSTALL-LIB librte_pmd_fm10k.a
gmake[6]: warning:  Clock skew detected.  Your build may be incomplete.
  CC enic_rxtx_vec_avx2.o
  SYMLINK-FILE include/rte_pmd_bnxt.h
  CC iavf_rxtx_vec_sse.o
  CC bnxt_cpr.o
  CC ixgbe_82599.o
--
  CC ifpga_api.o
  CC ifpga_enumerate.o
  CC ifpga_feature_dev.o
  CC ifpga_fme.o
  CC ifpga_fme_iperf.o
  CC ifpga_fme_error.o
  CC ifpga_fme_dperf.o
  CC ifpga_port.o
  CC ifpga_port_error.o
  PMDINFO skeleton_rawdev.o.pmd.c
  CC opae_hw_api.o
  CC opae_ifpga_hw_api.o
  CC skeleton_rawdev.o.pmd.o
  CC opae_debug.o
--
  LD dpdk-pdump
  LD cmdline_test
  INSTALL-APP testacl
  INSTALL-MAP testacl.map
  CC test.o
gmake[5]: warning:  Clock skew detected.  Your build may be incomplete.
  CC init.o
  CC parameters.o
  CC cperf_ops.o
  INSTALL-APP dpdk-pdump
  CC resource.o
--
  INSTALL-APP cmdline_test
  CC evt_options.o
  INSTALL-MAP dpdk-pdump.map
  CC test_bbdev_perf.o
  INSTALL-MAP cmdline_test.map
gmake[5]: warning:  Clock skew detected.  Your build may be incomplete.
gmake[5]: warning:  Clock skew detected.  Your build may be incomplete.
  CC test_resource.o
  CC comp_perf_test_benchmark.o
  CC runtime.o
  CC cmdline.o
  CC evt_test.o
--
  CC pipeline_lpm_ipv6.o
  INSTALL-MAP dpdk-test-compress-perf.map
  CC config.o
  CC cperf_test_pmd_cyclecount.o
  CC test_malloc.o
gmake[5]: warning:  Clock skew detected.  Your build may be incomplete.
  INSTALL-APP testbbdev
  CC pipeline_acl.o
  CC test_perf_common.o
  INSTALL-MAP testbbdev.map
gmake[5]: warning:  Clock skew detected.  Your build may be incomplete.
  CC test_cycles.o
  CC cperf_test_verify.o
  CC test_perf_queue.o
  CC iofwd.o
  CC cperf_test_vector_parsing.o
--
  CC test_pipeline_queue.o
  CC test_bitmap.o
  INSTALL-APP testpipeline
  INSTALL-MAP testpipeline.map
  CC flowgen.o
gmake[5]: warning:  Clock skew detected.  Your build may be incomplete.
  CC test_pipeline_atq.o
  CC rxonly.o
  LD dpdk-test-crypto-perf
  CC test_reciprocal_division_perf.o
  CC test_reciprocal_division.o
--
  CC test_pmd_perf.o
  CC icmpecho.o
  CC noisy_vnf.o
  INSTALL-MAP dpdk-test-crypto-perf.map
  CC bpf_cmd.o
gmake[5]: warning:  Clock skew detected.  Your build may be incomplete.
  CC test_table.o
  INSTALL-APP dpdk-test-eventdev
  CC test_table_pipeline.o
  INSTALL-MAP dpdk-test-eventdev.map
  CC test_table_tables.o
  CC util.o
gmake[5]: warning:  Clock skew detected.  Your build may be incomplete.
  CC test_table_ports.o
  CC test_table_combined.o
  CC test_flow_classify.o
  CC test_table_acl.o
  CC test_rwlock.o
--
  CC test_memcpy.o
  CC test_logs.o
  INSTALL-MAP testpmd.map
  CC test_memcpy_perf.o
  CC test_member.o
gmake[5]: warning:  Clock skew detected.  Your build may be incomplete.
  CC test_member_perf.o
  CC test_efd.o
  CC test_efd_perf.o
  CC test_thash.o
  CC test_hash.o
--
  CC test_rawdev.o
  CC test_kvargs.o
  CC test_rcu_qsbr.o
In file included from /tmp/FreeBSD11.2_K11.2_GCC6.4.0/x86_64-native-bsdapp-gcc/6b1bb5ec45cb44ee9745952c5d8836da/dpdk/app/test/test_rcu_qsbr.c:8:0:
/tmp/FreeBSD11.2_K11.2_GCC6.4.0/x86_64-native-bsdapp-gcc/6b1bb5ec45cb44ee9745952c5d8836da/dpdk/x86_64-native-bsdapp-gcc/include/rte_rcu_qsbr.h: In function 'rte_rcu_qsbr_thread_online':
/tmp/FreeBSD11.2_K11.2_GCC6.4.0/x86_64-native-bsdapp-gcc/6b1bb5ec45cb44ee9745952c5d8836da/dpdk/x86_64-native-bsdapp-gcc/include/rte_rcu_qsbr.h:227:2: warning: implicit declaration of function 'rte_smp_mb' [-Wimplicit-function-declaration]
  rte_smp_mb();
  ^~~~~~~~~~
/tmp/FreeBSD11.2_K11.2_GCC6.4.0/x86_64-native-bsdapp-gcc/6b1bb5ec45cb44ee9745952c5d8836da/dpdk/x86_64-native-bsdapp-gcc/include/rte_rcu_qsbr.h:227:2: warning: nested extern declaration of 'rte_smp_mb' [-Wnested-externs]
In file included from /tmp/FreeBSD11.2_K11.2_GCC6.4.0/x86_64-native-bsdapp-gcc/6b1bb5ec45cb44ee9745952c5d8836da/dpdk/x86_64-native-bsdapp-gcc/include/generic/rte_cycles.h:18:0,
                 from /tmp/FreeBSD11.2_K11.2_GCC6.4.0/x86_64-native-bsdapp-gcc/6b1bb5ec45cb44ee9745952c5d8836da/dpdk/x86_64-native-bsdapp-gcc/include/rte_cycles.h:13,
                 from /tmp/FreeBSD11.2_K11.2_GCC6.4.0/x86_64-native-bsdapp-gcc/6b1bb5ec45cb44ee9745952c5d8836da/dpdk/app/test/test_rcu_qsbr.c:12:
/tmp/FreeBSD11.2_K11.2_GCC6.4.0/x86_64-native-bsdapp-gcc/6b1bb5ec45cb44ee9745952c5d8836da/dpdk/x86_64-native-bsdapp-gcc/include/rte_atomic.h: At top level:
/tmp/FreeBSD11.2_K11.2_GCC6.4.0/x86_64-native-bsdapp-gcc/6b1bb5ec45cb44ee9745952c5d8836da/dpdk/x86_64-native-bsdapp-gcc/include/rte_atomic.h:67:1: warning: conflicting types for 'rte_smp_mb'
 rte_smp_mb(void)
 ^~~~~~~~~~
/tmp/FreeBSD11.2_K11.2_GCC6.4.0/x86_64-native-bsdapp-gcc/6b1bb5ec45cb44ee9745952c5d8836da/dpdk/x86_64-native-bsdapp-gcc/include/rte_atomic.h:67:1: error: static declaration of 'rte_smp_mb' follows non-static declaration
In file included from /tmp/FreeBSD11.2_K11.2_GCC6.4.0/x86_64-native-bsdapp-gcc/6b1bb5ec45cb44ee9745952c5d8836da/dpdk/app/test/test_rcu_qsbr.c:8:0:
/tmp/FreeBSD11.2_K11.2_GCC6.4.0/x86_64-native-bsdapp-gcc/6b1bb5ec45cb44ee9745952c5d8836da/dpdk/x86_64-native-bsdapp-gcc/include/rte_rcu_qsbr.h:227:2: note: previous implicit declaration of 'rte_smp_mb' was here
  rte_smp_mb();
  ^~~~~~~~~~
  CC test_bpf.o
--
gmake[5]: *** [/tmp/FreeBSD11.2_K11.2_GCC6.4.0/x86_64-native-bsdapp-gcc/6b1bb5ec45cb44ee9745952c5d8836da/dpdk/mk/internal/rte.compile-pre.mk:116: test_rcu_qsbr.o] Error 1
gmake[5]: *** Waiting for unfinished jobs....
  CC test_rcu_qsbr_perf.o
In file included from /tmp/FreeBSD11.2_K11.2_GCC6.4.0/x86_64-native-bsdapp-gcc/6b1bb5ec45cb44ee9745952c5d8836da/dpdk/app/test/test_rcu_qsbr_perf.c:8:0:
/tmp/FreeBSD11.2_K11.2_GCC6.4.0/x86_64-native-bsdapp-gcc/6b1bb5ec45cb44ee9745952c5d8836da/dpdk/x86_64-native-bsdapp-gcc/include/rte_rcu_qsbr.h: In function 'rte_rcu_qsbr_thread_online':
/tmp/FreeBSD11.2_K11.2_GCC6.4.0/x86_64-native-bsdapp-gcc/6b1bb5ec45cb44ee9745952c5d8836da/dpdk/x86_64-native-bsdapp-gcc/include/rte_rcu_qsbr.h:227:2: warning: implicit declaration of function 'rte_smp_mb' [-Wimplicit-function-declaration]
  rte_smp_mb();
  ^~~~~~~~~~
/tmp/FreeBSD11.2_K11.2_GCC6.4.0/x86_64-native-bsdapp-gcc/6b1bb5ec45cb44ee9745952c5d8836da/dpdk/x86_64-native-bsdapp-gcc/include/rte_rcu_qsbr.h:227:2: warning: nested extern declaration of 'rte_smp_mb' [-Wnested-externs]
In file included from /tmp/FreeBSD11.2_K11.2_GCC6.4.0/x86_64-native-bsdapp-gcc/6b1bb5ec45cb44ee9745952c5d8836da/dpdk/x86_64-native-bsdapp-gcc/include/generic/rte_cycles.h:18:0,
                 from /tmp/FreeBSD11.2_K11.2_GCC6.4.0/x86_64-native-bsdapp-gcc/6b1bb5ec45cb44ee9745952c5d8836da/dpdk/x86_64-native-bsdapp-gcc/include/rte_cycles.h:13,
                 from /tmp/FreeBSD11.2_K11.2_GCC6.4.0/x86_64-native-bsdapp-gcc/6b1bb5ec45cb44ee9745952c5d8836da/dpdk/app/test/test_rcu_qsbr_perf.c:12:
/tmp/FreeBSD11.2_K11.2_GCC6.4.0/x86_64-native-bsdapp-gcc/6b1bb5ec45cb44ee9745952c5d8836da/dpdk/x86_64-native-bsdapp-gcc/include/rte_atomic.h: At top level:
/tmp/FreeBSD11.2_K11.2_GCC6.4.0/x86_64-native-bsdapp-gcc/6b1bb5ec45cb44ee9745952c5d8836da/dpdk/x86_64-native-bsdapp-gcc/include/rte_atomic.h:67:1: warning: conflicting types for 'rte_smp_mb'
 rte_smp_mb(void)
 ^~~~~~~~~~
/tmp/FreeBSD11.2_K11.2_GCC6.4.0/x86_64-native-bsdapp-gcc/6b1bb5ec45cb44ee9745952c5d8836da/dpdk/x86_64-native-bsdapp-gcc/include/rte_atomic.h:67:1: error: static declaration of 'rte_smp_mb' follows non-static declaration
In file included from /tmp/FreeBSD11.2_K11.2_GCC6.4.0/x86_64-native-bsdapp-gcc/6b1bb5ec45cb44ee9745952c5d8836da/dpdk/app/test/test_rcu_qsbr_perf.c:8:0:
/tmp/FreeBSD11.2_K11.2_GCC6.4.0/x86_64-native-bsdapp-gcc/6b1bb5ec45cb44ee9745952c5d8836da/dpdk/x86_64-native-bsdapp-gcc/include/rte_rcu_qsbr.h:227:2: note: previous implicit declaration of 'rte_smp_mb' was here
  rte_smp_mb();
  ^~~~~~~~~~
gmake[5]: *** [/tmp/FreeBSD11.2_K11.2_GCC6.4.0/x86_64-native-bsdapp-gcc/6b1bb5ec45cb44ee9745952c5d8836da/dpdk/mk/internal/rte.compile-pre.mk:114: test_rcu_qsbr_perf.o] Error 1

*Failed Build #11:
OS: FreeBSD12.0
Target: x86_64-native-bsdapp-clang
  SYMLINK-FILE include/cmdline_socket.h
  AR librte_rcu.a
  SYMLINK-FILE include/cmdline_cirbuf.h
  SYMLINK-FILE include/cmdline_parse_portlist.h
  INSTALL-LIB librte_rcu.a
gmake[5]: warning:  Clock skew detected.  Your build may be incomplete.
  CC cmdline.o
  SYMLINK-FILE include/rte_hash.h
  CC cmdline_cirbuf.o
  SYMLINK-FILE include/rte_hash_crc.h
  SYMLINK-FILE include/rte_jhash.h
--
  CC rte_table_action.o
  AR librte_flow_classify.a
  INSTALL-LIB librte_flow_classify.a
  AR librte_pipeline.a
  INSTALL-LIB librte_pipeline.a
gmake[4]: warning:  Clock skew detected.  Your build may be incomplete.
== Build buildtools
== Build kernel
== Build kernel/freebsd
== Build buildtools/pmdinfogen
  HOSTCC pmdinfogen.o
--
awk -f /usr/src/sys/tools/makeobjops.awk /usr/src/sys/kern/bus_if.m -h
awk -f /usr/src/sys/tools/makeobjops.awk /usr/src/sys/kern/bus_if.m -h
== Build drivers
awk -f /usr/src/sys/tools/makeobjops.awk /usr/src/sys/dev/pci/pci_if.m -h
Warning: Object directory not changed from original /tmp/FreeBSD12.0_K19.02_Clang6.0.1/x86_64-native-bsdapp-clang/6b1bb5ec45cb44ee9745952c5d8836da/dpdk/x86_64-native-bsdapp-clang/build/kernel/freebsd/contigmem
cc  -Winline -Wall -Werror -include /tmp/FreeBSD12.0_K19.02_Clang6.0.1/x86_64-native-bsdapp-clang/6b1bb5ec45cb44ee9745952c5d8836da/dpdk/x86_64-native-bsdapp-clang/include/rte_config.h  -Werror -D_KERNEL -DKLD_MODULE -nostdinc  -I/tmp/FreeBSD12.0_K19.02_Clang6.0.1/x86_64-native-bsdapp-clang/6b1bb5ec45cb44ee9745952c5d8836da/dpdk/kernel/freebsd/contigmem -I/tmp/FreeBSD12.0_K19.02_Clang6.0.1/x86_64-native-bsdapp-clang/6b1bb5ec45cb44ee9745952c5d8836da/dpdk/x86_64-native-bsdapp-clang/include -I. -I/usr/src/sys -I/usr/src/sys/contrib/ck/include -fno-common  -fno-omit-frame-pointer -mno-omit-leaf-frame-pointer   -MD  -MF.depend.contigmem.o -MTcontigmem.o -mcmodel=kernel -mno-red-zone -mno-mmx -mno-sse -msoft-float  -fno-asynchronous-unwind-tables -ffreestanding -fwrapv -fstack-protector -Wall -Wredundant-decls -Wnested-externs -Wstrict-prototypes -Wmissing-prototypes -Wpointer-arith -Wcast-qual -Wundef -Wno-pointer-sign -D__printf__=__freebsd_kprintf__ -Wmissing-include-dirs -fdiagnostics-show-option -Wno-unknown-pragmas -Wno-error-tautological-compare -Wno-error-empty-body -Wno-error-parentheses-equality -Wno-error-unused-function -Wno-error-pointer-sign -Wno-error-shift-negative-value -Wno-address-of-packed-member  -mno-aes -mno-avx  -std=iso9899:1999 -c contigmem.c -o contigmem.o
Warning: Object directory not changed from original /tmp/FreeBSD12.0_K19.02_Clang6.0.1/x86_64-native-bsdapp-clang/6b1bb5ec45cb44ee9745952c5d8836da/dpdk/x86_64-native-bsdapp-clang/build/kernel/freebsd/nic_uio
cc  -Winline -Wall -Werror -include /tmp/FreeBSD12.0_K19.02_Clang6.0.1/x86_64-native-bsdapp-clang/6b1bb5ec45cb44ee9745952c5d8836da/dpdk/x86_64-native-bsdapp-clang/include/rte_config.h  -Werror -D_KERNEL -DKLD_MODULE -nostdinc  -I/tmp/FreeBSD12.0_K19.02_Clang6.0.1/x86_64-native-bsdapp-clang/6b1bb5ec45cb44ee9745952c5d8836da/dpdk/kernel/freebsd/nic_uio -I/tmp/FreeBSD12.0_K19.02_Clang6.0.1/x86_64-native-bsdapp-clang/6b1bb5ec45cb44ee9745952c5d8836da/dpdk/x86_64-native-bsdapp-clang/include -I. -I/usr/src/sys -I/usr/src/sys/contrib/ck/include -fno-common  -fno-omit-frame-pointer -mno-omit-leaf-frame-pointer   -MD  -MF.depend.nic_uio.o -MTnic_uio.o -mcmodel=kernel -mno-red-zone -mno-mmx -mno-sse -msoft-float  -fno-asynchronous-unwind-tables -ffreestanding -fwrapv -fstack-protector -Wall -Wredundant-decls -Wnested-externs -Wstrict-prototypes -Wmissing-prototypes -Wpointer-arith -Wcast-qual -Wundef -Wno-pointer-sign -D__printf__=__freebsd_kprintf__ -Wmissing-include-dirs -fdiagnostics-show-option -Wno-unknown-pragmas -Wno-error-tautological-compare -Wno-error-empty-body -Wno-error-parentheses-equality -Wno-error-unused-function -Wno-error-pointer-sign -Wno-error-shift-negative-value -Wno-address-of-packed-member  -mno-aes -mno-avx  -std=iso9899:1999 -c nic_uio.c -o nic_uio.o
== Build drivers/common
== Build drivers/common/octeontx
== Build drivers/common/cpt
ld -m elf_x86_64_fbsd -L/tmp/FreeBSD12.0_K19.02_Clang6.0.1/x86_64-native-bsdapp-clang/6b1bb5ec45cb44ee9745952c5d8836da/dpdk/x86_64-native-bsdapp-clang/lib -d -warn-common --build-id=sha1 -r -d -o nic_uio.ko nic_uio.o
:> export_syms
--
  CC enic_rxtx_vec_avx2.o
  CC t4vf_hw.o
  AR librte_pmd_fm10k.a
  CC i40e_hmc.o
  INSTALL-LIB librte_pmd_fm10k.a
gmake[6]: warning:  Clock skew detected.  Your build may be incomplete.
  CC iavf_ethdev.o
  CC iavf_vchnl.o
  CC e1000_nvm.o
  CC failsafe_flow.o
  AR librte_pmd_enic.a
--
  CC ifpga_api.o
  CC ifpga_feature_dev.o
  CC ifpga_fme.o
  CC ifpga_fme_iperf.o
  CC ifpga_fme_dperf.o
  CC ifpga_fme_error.o
  CC ifpga_port.o
  CC ifpga_port_error.o
  CC opae_hw_api.o
  CC opae_ifpga_hw_api.o
  CC opae_debug.o
  CC ifpga_fme_pr.o
  CC ifpga_rawdev.o
--
  CC test_bbdev_perf.o
  INSTALL-APP testacl
  INSTALL-APP cmdline_test
  CC test_prefetch.o
  INSTALL-MAP cmdline_test.map
gmake[5]: warning:  Clock skew detected.  Your build may be incomplete.
  INSTALL-MAP testacl.map
  CC cperf_options_parsing.o
  CC test_byteorder.o
  CC init.o
gmake[5]: warning:  Clock skew detected.  Your build may be incomplete.
  CC test_bbdev_vector.o
  CC evt_test.o
  INSTALL-APP dpdk-pdump
  INSTALL-MAP dpdk-pdump.map
  CC comp_perf_test_verify.o
  CC test_per_lcore.o
  CC cmdline.o
  CC comp_perf_test_benchmark.o
gmake[5]: warning:  Clock skew detected.  Your build may be incomplete.
  CC parser.o
  CC runtime.o
  CC test_atomic.o
  CC cperf_test_vectors.o
  CC test_order_common.o
--
  INSTALL-APP dpdk-test-compress-perf
  CC test_order_queue.o
  INSTALL-MAP dpdk-test-compress-perf.map
  CC pipeline_hash.o
  CC cmdline_mtr.o
gmake[5]: warning:  Clock skew detected.  Your build may be incomplete.
  CC test_cycles.o
  CC cperf_test_latency.o
  LD testbbdev
  CC test_order_atq.o
  CC pipeline_lpm.o
--
  INSTALL-MAP testbbdev.map
  CC cmdline_tm.o
  CC test_memory.o
  CC test_memzone.o
  CC pipeline_acl.o
gmake[5]: warning:  Clock skew detected.  Your build may be incomplete.
  CC test_perf_queue.o
  CC cperf_test_verify.o
  CC config.o
  CC test_perf_atq.o
  CC test_bitmap.o
--
  INSTALL-APP testpipeline
  INSTALL-MAP testpipeline.map
  CC macswap.o
  CC test_pipeline_queue.o
  CC test_pipeline_atq.o
gmake[5]: warning:  Clock skew detected.  Your build may be incomplete.
  CC test_ring.o
  CC test_ring_perf.o
  CC flowgen.o
  CC cperf_test_common.o
  CC rxonly.o
--
  CC test_table_tables.o
  INSTALL-MAP dpdk-test-crypto-perf.map
  CC noisy_vnf.o
  CC test_table_ports.o
  CC test_table_combined.o
gmake[5]: warning:  Clock skew detected.  Your build may be incomplete.
  INSTALL-APP dpdk-test-eventdev
  CC bpf_cmd.o
  CC test_table_acl.o
  CC util.o
  INSTALL-MAP dpdk-test-eventdev.map
gmake[5]: warning:  Clock skew detected.  Your build may be incomplete.
  CC test_flow_classify.o
  CC test_rwlock.o
  CC test_timer.o
  CC test_timer_perf.o
  LD testpmd
--
  INSTALL-MAP testpmd.map
  CC test_efd_perf.o
  CC test_hash.o
  CC test_thash.o
  CC test_hash_perf.o
gmake[5]: warning:  Clock skew detected.  Your build may be incomplete.
  CC test_hash_functions.o
  CC test_hash_readwrite.o
  CC test_hash_multiwriter.o
  CC test_hash_readwrite_lf.o
  CC test_lpm_perf.o
--
  CC test_bpf.o
  CC test_rcu_qsbr_perf.o
  CC test_ipsec.o
  MKRES test_resource_c.res.o
In file included from /tmp/FreeBSD12.0_K19.02_Clang6.0.1/x86_64-native-bsdapp-clang/6b1bb5ec45cb44ee9745952c5d8836da/dpdk/app/test/test_rcu_qsbr.c:8:
/tmp/FreeBSD12.0_K19.02_Clang6.0.1/x86_64-native-bsdapp-clang/6b1bb5ec45cb44ee9745952c5d8836da/dpdk/x86_64-native-bsdapp-clang/include/rte_rcu_qsbr.h:227:2: warning: implicit declaration of function 'rte_smp_mb' is invalid in C99 [-Wimplicit-function-declaration]
        rte_smp_mb();
        ^
/tmp/FreeBSD12.0_K19.02_Clang6.0.1/x86_64-native-bsdapp-clang/6b1bb5ec45cb44ee9745952c5d8836da/dpdk/x86_64-native-bsdapp-clang/include/rte_rcu_qsbr.h:227:2: warning: this function declaration is not a prototype [-Wstrict-prototypes]
In file included from /tmp/FreeBSD12.0_K19.02_Clang6.0.1/x86_64-native-bsdapp-clang/6b1bb5ec45cb44ee9745952c5d8836da/dpdk/app/test/test_rcu_qsbr.c:12:
In file included from /tmp/FreeBSD12.0_K19.02_Clang6.0.1/x86_64-native-bsdapp-clang/6b1bb5ec45cb44ee9745952c5d8836da/dpdk/x86_64-native-bsdapp-clang/include/rte_cycles.h:13:
In file included from /tmp/FreeBSD12.0_K19.02_Clang6.0.1/x86_64-native-bsdapp-clang/6b1bb5ec45cb44ee9745952c5d8836da/dpdk/x86_64-native-bsdapp-clang/include/generic/rte_cycles.h:18:
/tmp/FreeBSD12.0_K19.02_Clang6.0.1/x86_64-native-bsdapp-clang/6b1bb5ec45cb44ee9745952c5d8836da/dpdk/x86_64-native-bsdapp-clang/include/rte_atomic.h:67:1: error: static declaration of 'rte_smp_mb' follows non-static declaration
rte_smp_mb(void)
^
/tmp/FreeBSD12.0_K19.02_Clang6.0.1/x86_64-native-bsdapp-clang/6b1bb5ec45cb44ee9745952c5d8836da/dpdk/x86_64-native-bsdapp-clang/include/rte_rcu_qsbr.h:227:2: note: previous implicit declaration is here
        rte_smp_mb();
        ^
2 warnings and 1 error generated.
gmake[5]: *** [/tmp/FreeBSD12.0_K19.02_Clang6.0.1/x86_64-native-bsdapp-clang/6b1bb5ec45cb44ee9745952c5d8836da/dpdk/mk/internal/rte.compile-pre.mk:114: test_rcu_qsbr.o] Error 1
gmake[5]: *** Waiting for unfinished jobs....
In file included from /tmp/FreeBSD12.0_K19.02_Clang6.0.1/x86_64-native-bsdapp-clang/6b1bb5ec45cb44ee9745952c5d8836da/dpdk/app/test/test_rcu_qsbr_perf.c:8:
/tmp/FreeBSD12.0_K19.02_Clang6.0.1/x86_64-native-bsdapp-clang/6b1bb5ec45cb44ee9745952c5d8836da/dpdk/x86_64-native-bsdapp-clang/include/rte_rcu_qsbr.h:227:2: warning: implicit declaration of function 'rte_smp_mb' is invalid in C99 [-Wimplicit-function-declaration]
        rte_smp_mb();
        ^
/tmp/FreeBSD12.0_K19.02_Clang6.0.1/x86_64-native-bsdapp-clang/6b1bb5ec45cb44ee9745952c5d8836da/dpdk/x86_64-native-bsdapp-clang/include/rte_rcu_qsbr.h:227:2: warning: this function declaration is not a prototype [-Wstrict-prototypes]
In file included from /tmp/FreeBSD12.0_K19.02_Clang6.0.1/x86_64-native-bsdapp-clang/6b1bb5ec45cb44ee9745952c5d8836da/dpdk/app/test/test_rcu_qsbr_perf.c:12:
In file included from /tmp/FreeBSD12.0_K19.02_Clang6.0.1/x86_64-native-bsdapp-clang/6b1bb5ec45cb44ee9745952c5d8836da/dpdk/x86_64-native-bsdapp-clang/include/rte_cycles.h:13:
In file included from /tmp/FreeBSD12.0_K19.02_Clang6.0.1/x86_64-native-bsdapp-clang/6b1bb5ec45cb44ee9745952c5d8836da/dpdk/x86_64-native-bsdapp-clang/include/generic/rte_cycles.h:18:
/tmp/FreeBSD12.0_K19.02_Clang6.0.1/x86_64-native-bsdapp-clang/6b1bb5ec45cb44ee9745952c5d8836da/dpdk/x86_64-native-bsdapp-clang/include/rte_atomic.h:67:1: error: static declaration of 'rte_smp_mb' follows non-static declaration
rte_smp_mb(void)
^
/tmp/FreeBSD12.0_K19.02_Clang6.0.1/x86_64-native-bsdapp-clang/6b1bb5ec45cb44ee9745952c5d8836da/dpdk/x86_64-native-bsdapp-clang/include/rte_rcu_qsbr.h:227:2: note: previous implicit declaration is here
        rte_smp_mb();
        ^
2 warnings and 1 error generated.
gmake[5]: *** [/tmp/FreeBSD12.0_K19.02_Clang6.0.1/x86_64-native-bsdapp-clang/6b1bb5ec45cb44ee9745952c5d8836da/dpdk/mk/internal/rte.compile-pre.mk:114: test_rcu_qsbr_perf.o] Error 1
gmake[4]: *** [/tmp/FreeBSD12.0_K19.02_Clang6.0.1/x86_64-native-bsdapp-clang/6b1bb5ec45cb44ee9745952c5d8836da/dpdk/mk/rte.subdir.mk:35: test] Error 2
gmake[3]: *** [/tmp/FreeBSD12.0_K19.02_Clang6.0.1/x86_64-native-bsdapp-clang/6b1bb5ec45cb44ee9745952c5d8836da/dpdk/mk/rte.sdkbuild.mk:48: app] Error 2
gmake[2]: *** [/tmp/FreeBSD12.0_K19.02_Clang6.0.1/x86_64-native-bsdapp-clang/6b1bb5ec45cb44ee9745952c5d8836da/dpdk/mk/rte.sdkroot.mk:99: all] Error 2
gmake[1]: *** [/tmp/FreeBSD12.0_K19.02_Clang6.0.1/x86_64-native-bsdapp-clang/6b1bb5ec45cb44ee9745952c5d8836da/dpdk/mk/rte.sdkinstall.mk:61: pre_install] Error 2

*Failed Build #12:
OS: FreeBSD11.2
Target: x86_64-native-bsdapp-clang
  CC cmdline.o
  SYMLINK-FILE include/cmdline_parse_portlist.h
  AR librte_rcu.a
  INSTALL-LIB librte_rcu.a
  SYMLINK-FILE include/rte_mempool.h
gmake[5]: warning:  Clock skew detected.  Your build may be incomplete.
  CC cmdline_cirbuf.o
  CC cmdline_parse.o
  CC rte_mempool.o
  CC rte_mempool_ops.o
  CC cmdline_parse_etheraddr.o
--
  CC rte_table_action.o
  AR librte_flow_classify.a
  INSTALL-LIB librte_flow_classify.a
  AR librte_pipeline.a
  INSTALL-LIB librte_pipeline.a
gmake[4]: warning:  Clock skew detected.  Your build may be incomplete.
== Build kernel
== Build buildtools
== Build buildtools/pmdinfogen
== Build kernel/freebsd
  HOSTCC pmdinfogen.o
--
awk -f /usr/src/sys/tools/makeobjops.awk /usr/src/sys/dev/pci/pci_if.m -h
x86 -> /usr/src/sys/x86/include
awk -f /usr/src/sys/tools/makeobjops.awk /usr/src/sys/kern/device_if.m -h
Warning: Object directory not changed from original /tmp/FreeBSD11.2_K11.2_Clang6.0.0/x86_64-native-bsdapp-clang/6b1bb5ec45cb44ee9745952c5d8836da/dpdk/x86_64-native-bsdapp-clang/build/kernel/freebsd/nic_uio
awk -f /usr/src/sys/tools/makeobjops.awk /usr/src/sys/kern/bus_if.m -h
cc -Winline -Wall -Werror -include /tmp/FreeBSD11.2_K11.2_Clang6.0.0/x86_64-native-bsdapp-clang/6b1bb5ec45cb44ee9745952c5d8836da/dpdk/x86_64-native-bsdapp-clang/include/rte_config.h  -Werror -D_KERNEL -DKLD_MODULE -nostdinc  -I/tmp/FreeBSD11.2_K11.2_Clang6.0.0/x86_64-native-bsdapp-clang/6b1bb5ec45cb44ee9745952c5d8836da/dpdk/kernel/freebsd/nic_uio -I/tmp/FreeBSD11.2_K11.2_Clang6.0.0/x86_64-native-bsdapp-clang/6b1bb5ec45cb44ee9745952c5d8836da/dpdk/x86_64-native-bsdapp-clang/include -I. -I/usr/src/sys -fno-common  -fno-omit-frame-pointer -mno-omit-leaf-frame-pointer   -MD  -MF.depend.nic_uio.o -MTnic_uio.o -mcmodel=kernel -mno-red-zone -mno-mmx -mno-sse -msoft-float  -fno-asynchronous-unwind-tables -ffreestanding -fwrapv -fstack-protector -Wall -Wredundant-decls -Wnested-externs -Wstrict-prototypes -Wmissing-prototypes -Wpointer-arith -Winline -Wcast-qual -Wundef -Wno-pointer-sign -D__printf__=__freebsd_kprintf__ -Wmissing-include-dirs -fdiagnostics-show-option -Wno-unknown-pragmas -Wno-error-tautological-compare -Wno-error-empty-body -Wno-error-parentheses-equality -Wno-error-unused-function -Wno-error-pointer-sign -Wno-error-shift-negative-value -Wno-error-address-of-packed-member  -mno-aes -mno-avx  -std=iso9899:1999 -c nic_uio.c -o nic_uio.o
Warning: Object directory not changed from original /tmp/FreeBSD11.2_K11.2_Clang6.0.0/x86_64-native-bsdapp-clang/6b1bb5ec45cb44ee9745952c5d8836da/dpdk/x86_64-native-bsdapp-clang/build/kernel/freebsd/contigmem
cc -Winline -Wall -Werror -include /tmp/FreeBSD11.2_K11.2_Clang6.0.0/x86_64-native-bsdapp-clang/6b1bb5ec45cb44ee9745952c5d8836da/dpdk/x86_64-native-bsdapp-clang/include/rte_config.h  -Werror -D_KERNEL -DKLD_MODULE -nostdinc  -I/tmp/FreeBSD11.2_K11.2_Clang6.0.0/x86_64-native-bsdapp-clang/6b1bb5ec45cb44ee9745952c5d8836da/dpdk/kernel/freebsd/contigmem -I/tmp/FreeBSD11.2_K11.2_Clang6.0.0/x86_64-native-bsdapp-clang/6b1bb5ec45cb44ee9745952c5d8836da/dpdk/x86_64-native-bsdapp-clang/include -I. -I/usr/src/sys -fno-common  -fno-omit-frame-pointer -mno-omit-leaf-frame-pointer   -MD  -MF.depend.contigmem.o -MTcontigmem.o -mcmodel=kernel -mno-red-zone -mno-mmx -mno-sse -msoft-float  -fno-asynchronous-unwind-tables -ffreestanding -fwrapv -fstack-protector -Wall -Wredundant-decls -Wnested-externs -Wstrict-prototypes -Wmissing-prototypes -Wpointer-arith -Winline -Wcast-qual -Wundef -Wno-pointer-sign -D__printf__=__freebsd_kprintf__ -Wmissing-include-dirs -fdiagnostics-show-option -Wno-unknown-pragmas -Wno-error-tautological-compare -Wno-error-empty-body -Wno-error-parentheses-equality -Wno-error-unused-function -Wno-error-pointer-sign -Wno-error-shift-negative-value -Wno-error-address-of-packed-member  -mno-aes -mno-avx  -std=iso9899:1999 -c contigmem.c -o contigmem.o
== Build drivers/common/cpt
== Build drivers/common/octeontx
ld -L/tmp/FreeBSD11.2_K11.2_Clang6.0.0/x86_64-native-bsdapp-clang/6b1bb5ec45cb44ee9745952c5d8836da/dpdk/x86_64-native-bsdapp-clang/lib -d -warn-common -r -d -o nic_uio.ko nic_uio.o
:> export_syms
awk -f /usr/src/sys/conf/kmod_syms.awk nic_uio.ko  export_syms | xargs -J% objcopy % nic_uio.ko
--
  CC igb_flow.o
  CC lio_ethdev.o
  CC ixgbe_api.o
  AR librte_pmd_fm10k.a
  INSTALL-LIB librte_pmd_fm10k.a
gmake[6]: warning:  Clock skew detected.  Your build may be incomplete.
  CC i40e_rxtx.o
  CC ixgbe_vf.o
== Build drivers/net/bnxt
  CC ice_ethdev.o
  CC i40e_rxtx_vec_sse.o
--
  CC ifpga_enumerate.o
  CC ifpga_feature_dev.o
  CC ifpga_fme.o
  CC ifpga_fme_iperf.o
  CC ifpga_fme_dperf.o
  CC ifpga_fme_error.o
  CC ifpga_port.o
  CC ifpga_port_error.o
  CC opae_hw_api.o
  CC opae_ifpga_hw_api.o
  PMDINFO skeleton_rawdev.o.pmd.c
  CC skeleton_rawdev.o.pmd.o
  LD skeleton_rawdev.o
--
  INSTALL-APP testacl
  CC init.o
  CC evt_test.o
  CC test_byteorder.o
  INSTALL-MAP dpdk-pdump.map
gmake[5]: warning:  Clock skew detected.  Your build may be incomplete.
  INSTALL-MAP testacl.map
  CC parser.o
  CC test_bbdev_vector.o
gmake[5]: warning:  Clock skew detected.  Your build may be incomplete.
  CC parameters.o
  CC comp_perf_test_benchmark.o
  CC test_per_lcore.o
gmake[5]: warning:  Clock skew detected.  Your build may be incomplete.
  CC cmdline.o
  CC test_atomic.o
  CC cperf_options_parsing.o
  CC test_order_common.o
  CC runtime.o
--
  INSTALL-MAP dpdk-test-compress-perf.map
  CC test_order_atq.o
  LD testbbdev
  CC test_spinlock.o
  CC pipeline_lpm.o
gmake[5]: warning:  Clock skew detected.  Your build may be incomplete.
  CC cperf_test_latency.o
  CC test_perf_common.o
  CC test_memory.o
  INSTALL-APP testbbdev
  CC pipeline_lpm_ipv6.o
  CC config.o
  INSTALL-MAP testbbdev.map
  CC test_memzone.o
gmake[5]: warning:  Clock skew detected.  Your build may be incomplete.
  CC test_perf_queue.o
  CC cperf_test_pmd_cyclecount.o
  CC pipeline_acl.o
  CC test_perf_atq.o
  CC cperf_test_verify.o
--
  CC macfwd.o
  CC test_reciprocal_division.o
  INSTALL-APP testpipeline
  CC cperf_test_vector_parsing.o
  INSTALL-MAP testpipeline.map
gmake[5]: warning:  Clock skew detected.  Your build may be incomplete.
  CC test_reciprocal_division_perf.o
  CC test_pipeline_atq.o
  CC flowgen.o
  CC test_fbarray.o
  CC cperf_test_common.o
--
  INSTALL-APP dpdk-test-eventdev
  INSTALL-MAP dpdk-test-crypto-perf.map
  CC icmpecho.o
  INSTALL-MAP dpdk-test-eventdev.map
  CC test_table_tables.o
gmake[5]: warning:  Clock skew detected.  Your build may be incomplete.
gmake[5]: warning:  Clock skew detected.  Your build may be incomplete.
  CC noisy_vnf.o
  CC bpf_cmd.o
  CC test_table_combined.o
  CC test_table_ports.o
  CC test_table_acl.o
--
  INSTALL-MAP testpmd.map
  CC test_hash.o
  CC test_thash.o
  INSTALL-APP testpmd
  CC test_hash_perf.o
gmake[5]: warning:  Clock skew detected.  Your build may be incomplete.
  CC test_hash_functions.o
  CC test_hash_multiwriter.o
  CC test_hash_readwrite.o
  CC test_hash_readwrite_lf.o
  CC test_lpm.o
--
  CC test_rcu_qsbr_perf.o
  CC test_rcu_qsbr.o
  CC test_ipsec.o
  MKRES test_resource_c.res.o
In file included from /tmp/FreeBSD11.2_K11.2_Clang6.0.0/x86_64-native-bsdapp-clang/6b1bb5ec45cb44ee9745952c5d8836da/dpdk/app/test/test_rcu_qsbr_perf.c:8:
/tmp/FreeBSD11.2_K11.2_Clang6.0.0/x86_64-native-bsdapp-clang/6b1bb5ec45cb44ee9745952c5d8836da/dpdk/x86_64-native-bsdapp-clang/include/rte_rcu_qsbr.h:227:2: warning: implicit declaration of function 'rte_smp_mb' is invalid in C99 [-Wimplicit-function-declaration]
        rte_smp_mb();
        ^
/tmp/FreeBSD11.2_K11.2_Clang6.0.0/x86_64-native-bsdapp-clang/6b1bb5ec45cb44ee9745952c5d8836da/dpdk/x86_64-native-bsdapp-clang/include/rte_rcu_qsbr.h:227:2: warning: this function declaration is not a prototype [-Wstrict-prototypes]
In file included from In file included from /tmp/FreeBSD11.2_K11.2_Clang6.0.0/x86_64-native-bsdapp-clang/6b1bb5ec45cb44ee9745952c5d8836da/dpdk/app/test/test_rcu_qsbr_perf.c:12:
In file included from /tmp/FreeBSD11.2_K11.2_Clang6.0.0/x86_64-native-bsdapp-clang/6b1bb5ec45cb44ee9745952c5d8836da/dpdk/x86_64-native-bsdapp-clang/include/rte_cycles.h:13:
In file included from /tmp/FreeBSD11.2_K11.2_Clang6.0.0/x86_64-native-bsdapp-clang/6b1bb5ec45cb44ee9745952c5d8836da/dpdk/x86_64-native-bsdapp-clang/include/generic/rte_cycles.h:18:
/tmp/FreeBSD11.2_K11.2_Clang6.0.0/x86_64-native-bsdapp-clang/6b1bb5ec45cb44ee9745952c5d8836da/dpdk/x86_64-native-bsdapp-clang/include/rte_atomic.h:67:1: error: static declaration of 'rte_smp_mb' follows non-static declaration
rte_smp_mb(void)/tmp/FreeBSD11.2_K11.2_Clang6.0.0/x86_64-native-bsdapp-clang/6b1bb5ec45cb44ee9745952c5d8836da/dpdk/app/test/test_rcu_qsbr.c:8:
/tmp/FreeBSD11.2_K11.2_Clang6.0.0/x86_64-native-bsdapp-clang/6b1bb5ec45cb44ee9745952c5d8836da/dpdk/x86_64-native-bsdapp-clang/include/rte_rcu_qsbr.h:227:2: warning: implicit declaration of function 'rte_smp_mb' is invalid in C99 [-Wimplicit-function-declaration]
        rte_smp_mb();
        ^
/tmp/FreeBSD11.2_K11.2_Clang6.0.0/x86_64-native-bsdapp-clang/6b1bb5ec45cb44ee9745952c5d8836da/dpdk/x86_64-native-bsdapp-clang/include/rte_rcu_qsbr.h:227:2: warning: this function declaration is not a prototype [-Wstrict-prototypes]

^
In file included from /tmp/FreeBSD11.2_K11.2_Clang6.0.0/x86_64-native-bsdapp-clang/6b1bb5ec45cb44ee9745952c5d8836da/dpdk/x86_64-native-bsdapp-clang/include/rte_rcu_qsbr.h:227:2: note: previous implicit declaration is here
        rte_smp_mb();
        ^
2 warnings/tmp/FreeBSD11.2_K11.2_Clang6.0.0/x86_64-native-bsdapp-clang/6b1bb5ec45cb44ee9745952c5d8836da/dpdk/app/test/test_rcu_qsbr.c:12:
In file included from /tmp/FreeBSD11.2_K11.2_Clang6.0.0/x86_64-native-bsdapp-clang/6b1bb5ec45cb44ee9745952c5d8836da/dpdk/x86_64-native-bsdapp-clang/include/rte_cycles.h:13:
In file included from /tmp/FreeBSD11.2_K11.2_Clang6.0.0/x86_64-native-bsdapp-clang/6b1bb5ec45cb44ee9745952c5d8836da/dpdk/x86_64-native-bsdapp-clang/include/generic/rte_cycles.h:18:
 and 1 error generated.
/tmp/FreeBSD11.2_K11.2_Clang6.0.0/x86_64-native-bsdapp-clang/6b1bb5ec45cb44ee9745952c5d8836da/dpdk/x86_64-native-bsdapp-clang/include/rte_atomic.h:67:1: error: static declaration of 'rte_smp_mb' follows non-static declaration
rte_smp_mb(void)gmake[5]: *** [/tmp/FreeBSD11.2_K11.2_Clang6.0.0/x86_64-native-bsdapp-clang/6b1bb5ec45cb44ee9745952c5d8836da/dpdk/mk/internal/rte.compile-pre.mk:114: test_rcu_qsbr_perf.o] Error 1
gmake[5]: *** Waiting for unfinished jobs....

^
/tmp/FreeBSD11.2_K11.2_Clang6.0.0/x86_64-native-bsdapp-clang/6b1bb5ec45cb44ee9745952c5d8836da/dpdk/x86_64-native-bsdapp-clang/include/rte_rcu_qsbr.h:227:2: note: previous implicit declaration is here
        rte_smp_mb();
        ^
2 warnings and 1 error generated.
gmake[5]: *** [/tmp/FreeBSD11.2_K11.2_Clang6.0.0/x86_64-native-bsdapp-clang/6b1bb5ec45cb44ee9745952c5d8836da/dpdk/mk/internal/rte.compile-pre.mk:114: test_rcu_qsbr.o] Error 1
gmake[4]: *** [/tmp/FreeBSD11.2_K11.2_Clang6.0.0/x86_64-native-bsdapp-clang/6b1bb5ec45cb44ee9745952c5d8836da/dpdk/mk/rte.subdir.mk:35: test] Error 2
gmake[3]: *** [/tmp/FreeBSD11.2_K11.2_Clang6.0.0/x86_64-native-bsdapp-clang/6b1bb5ec45cb44ee9745952c5d8836da/dpdk/mk/rte.sdkbuild.mk:48: app] Error 2
gmake[2]: *** [/tmp/FreeBSD11.2_K11.2_Clang6.0.0/x86_64-native-bsdapp-clang/6b1bb5ec45cb44ee9745952c5d8836da/dpdk/mk/rte.sdkroot.mk:99: all] Error 2
gmake[1]: *** [/tmp/FreeBSD11.2_K11.2_Clang6.0.0/x86_64-native-bsdapp-clang/6b1bb5ec45cb44ee9745952c5d8836da/dpdk/mk/rte.sdkinstall.mk:61: pre_install] Error 2

*Failed Build #13:
OS: FreeBSD12.0
Target: x86_64-native-bsdapp-gcc
  CC acl_run_scalar.o
  AR librte_meter.a
  INSTALL-LIB librte_meter.a
  AR librte_rcu.a
  INSTALL-LIB librte_rcu.a
gmake[5]: warning:  Clock skew detected.  Your build may be incomplete.
  SYMLINK-FILE include/cmdline_rdline.h
  CC acl_run_sse.o
  CC acl_run_avx2.o
  AR librte_jobstats.a
  INSTALL-LIB librte_jobstats.a
--
  CC rte_table_action.o
  AR librte_flow_classify.a
  INSTALL-LIB librte_flow_classify.a
  AR librte_pipeline.a
  INSTALL-LIB librte_pipeline.a
gmake[4]: warning:  Clock skew detected.  Your build may be incomplete.
== Build buildtools
== Build kernel
== Build kernel/freebsd
== Build buildtools/pmdinfogen
== Build kernel/freebsd/contigmem
--
x86 -> /usr/src/sys/x86/include
awk -f /usr/src/sys/tools/makeobjops.awk /usr/src/sys/kern/device_if.m -h
awk -f /usr/src/sys/tools/makeobjops.awk /usr/src/sys/dev/pci/pci_if.m -h
awk -f /usr/src/sys/tools/makeobjops.awk /usr/src/sys/kern/bus_if.m -h
Warning: Object directory not changed from original /tmp/FreeBSD12.0_K19.02_GCC7.3.0/x86_64-native-bsdapp-gcc/6b1bb5ec45cb44ee9745952c5d8836da/dpdk/x86_64-native-bsdapp-gcc/build/kernel/freebsd/nic_uio
cc  -Winline -Wall -Werror -include /tmp/FreeBSD12.0_K19.02_GCC7.3.0/x86_64-native-bsdapp-gcc/6b1bb5ec45cb44ee9745952c5d8836da/dpdk/x86_64-native-bsdapp-gcc/include/rte_config.h  -Werror -D_KERNEL -DKLD_MODULE -nostdinc  -I/tmp/FreeBSD12.0_K19.02_GCC7.3.0/x86_64-native-bsdapp-gcc/6b1bb5ec45cb44ee9745952c5d8836da/dpdk/kernel/freebsd/nic_uio -I/tmp/FreeBSD12.0_K19.02_GCC7.3.0/x86_64-native-bsdapp-gcc/6b1bb5ec45cb44ee9745952c5d8836da/dpdk/x86_64-native-bsdapp-gcc/include -I. -I/usr/src/sys -I/usr/src/sys/contrib/ck/include -fno-common  -fno-omit-frame-pointer -mno-omit-leaf-frame-pointer   -MD  -MF.depend.nic_uio.o -MTnic_uio.o -mcmodel=kernel -mno-red-zone -mno-mmx -mno-sse -msoft-float  -fno-asynchronous-unwind-tables -ffreestanding -fwrapv -fstack-protector -Wall -Wredundant-decls -Wnested-externs -Wstrict-prototypes -Wmissing-prototypes -Wpointer-arith -Wcast-qual -Wundef -Wno-pointer-sign -D__printf__=__freebsd_kprintf__ -Wmissing-include-dirs -fdiagnostics-show-option -Wno-unknown-pragmas -Wno-error-tautological-compare -Wno-error-empty-body -Wno-error-parentheses-equality -Wno-error-unused-function -Wno-error-pointer-sign -Wno-error-shift-negative-value -Wno-address-of-packed-member  -mno-aes -mno-avx  -std=iso9899:1999 -c nic_uio.c -o nic_uio.o
Warning: Object directory not changed from original /tmp/FreeBSD12.0_K19.02_GCC7.3.0/x86_64-native-bsdapp-gcc/6b1bb5ec45cb44ee9745952c5d8836da/dpdk/x86_64-native-bsdapp-gcc/build/kernel/freebsd/contigmem
cc  -Winline -Wall -Werror -include /tmp/FreeBSD12.0_K19.02_GCC7.3.0/x86_64-native-bsdapp-gcc/6b1bb5ec45cb44ee9745952c5d8836da/dpdk/x86_64-native-bsdapp-gcc/include/rte_config.h  -Werror -D_KERNEL -DKLD_MODULE -nostdinc  -I/tmp/FreeBSD12.0_K19.02_GCC7.3.0/x86_64-native-bsdapp-gcc/6b1bb5ec45cb44ee9745952c5d8836da/dpdk/kernel/freebsd/contigmem -I/tmp/FreeBSD12.0_K19.02_GCC7.3.0/x86_64-native-bsdapp-gcc/6b1bb5ec45cb44ee9745952c5d8836da/dpdk/x86_64-native-bsdapp-gcc/include -I. -I/usr/src/sys -I/usr/src/sys/contrib/ck/include -fno-common  -fno-omit-frame-pointer -mno-omit-leaf-frame-pointer   -MD  -MF.depend.contigmem.o -MTcontigmem.o -mcmodel=kernel -mno-red-zone -mno-mmx -mno-sse -msoft-float  -fno-asynchronous-unwind-tables -ffreestanding -fwrapv -fstack-protector -Wall -Wredundant-decls -Wnested-externs -Wstrict-prototypes -Wmissing-prototypes -Wpointer-arith -Wcast-qual -Wundef -Wno-pointer-sign -D__printf__=__freebsd_kprintf__ -Wmissing-include-dirs -fdiagnostics-show-option -Wno-unknown-pragmas -Wno-error-tautological-compare -Wno-error-empty-body -Wno-error-parentheses-equality -Wno-error-unused-function -Wno-error-pointer-sign -Wno-error-shift-negative-value -Wno-address-of-packed-member  -mno-aes -mno-avx  -std=iso9899:1999 -c contigmem.c -o contigmem.o
== Build drivers/common
ld -m elf_x86_64_fbsd -L/tmp/FreeBSD12.0_K19.02_GCC7.3.0/x86_64-native-bsdapp-gcc/6b1bb5ec45cb44ee9745952c5d8836da/dpdk/x86_64-native-bsdapp-gcc/lib -d -warn-common --build-id=sha1 -r -d -o contigmem.ko contigmem.o
ld -m elf_x86_64_fbsd -L/tmp/FreeBSD12.0_K19.02_GCC7.3.0/x86_64-native-bsdapp-gcc/6b1bb5ec45cb44ee9745952c5d8836da/dpdk/x86_64-native-bsdapp-gcc/lib -d -warn-common --build-id=sha1 -r -d -o nic_uio.ko nic_uio.o
:> export_syms
awk -f /usr/src/sys/conf/kmod_syms.awk contigmem.ko  export_syms | xargs -J% objcopy % contigmem.ko
--
  AR librte_pmd_fm10k.a
  PMDINFO lio_ethdev.o.pmd.c
  CC lio_ethdev.o.pmd.o
  INSTALL-LIB librte_pmd_fm10k.a
  LD lio_ethdev.o
gmake[6]: warning:  Clock skew detected.  Your build may be incomplete.
  CC ixgbe_82598.o
  SYMLINK-FILE include/rte_pmd_bnxt.h
  CC bnxt_cpr.o
  CC lio_rxtx.o
  AR librte_pmd_e1000.a
--
  CC ifpga_feature_dev.o
  CC ifpga_enumerate.o
  CC ifpga_fme.o
  CC ifpga_fme_dperf.o
  CC ifpga_fme_iperf.o
  CC ifpga_fme_error.o
  CC ifpga_port.o
  CC ifpga_port_error.o
  CC opae_hw_api.o
  CC opae_ifpga_hw_api.o
  CC opae_debug.o
  CC ifpga_fme_pr.o
  CC ifpga_rawdev.o
--
  INSTALL-MAP testacl.map
  CC test.o
  CC parser.o
  LD dpdk-pdump
  CC runtime.o
gmake[5]: warning:  Clock skew detected.  Your build may be incomplete.
  CC parameters.o
  INSTALL-MAP cmdline_test.map
  CC cperf_options_parsing.o
gmake[5]: warning:  Clock skew detected.  Your build may be incomplete.
  CC test_order_common.o
  CC resource.o
  INSTALL-APP dpdk-pdump
  CC comp_perf_test_benchmark.o
  CC test_bbdev_vector.o
--
  CC cperf_test_vectors.o
  CC test_resource.o
  CC test_prefetch.o
  CC pipeline_stub.o
  CC test_byteorder.o
gmake[5]: warning:  Clock skew detected.  Your build may be incomplete.
  CC cmdline.o
  CC test_per_lcore.o
  CC test_order_queue.o
  CC cperf_test_throughput.o
  CC pipeline_hash.o
--
  CC cperf_test_pmd_cyclecount.o
  INSTALL-APP dpdk-test-compress-perf
  CC pipeline_lpm_ipv6.o
  INSTALL-MAP dpdk-test-compress-perf.map
  CC test_perf_common.o
gmake[5]: warning:  Clock skew detected.  Your build may be incomplete.
  CC cmdline_mtr.o
  CC cperf_test_verify.o
  CC cmdline_flow.o
  INSTALL-APP testbbdev
  CC pipeline_acl.o
  INSTALL-MAP testbbdev.map
  CC test_barrier.o
  CC test_malloc.o
gmake[5]: warning:  Clock skew detected.  Your build may be incomplete.
  CC cmdline_tm.o
  CC cperf_test_vector_parsing.o
  LD testpipeline
  CC test_cycles.o
  CC test_perf_queue.o
--
  INSTALL-APP testpipeline
  CC iofwd.o
  INSTALL-MAP testpipeline.map
  CC test_pipeline_common.o
  CC test_memzone.o
gmake[5]: warning:  Clock skew detected.  Your build may be incomplete.
  LD dpdk-test-crypto-perf
  CC test_pipeline_queue.o
  CC test_reciprocal_division.o
  CC test_reciprocal_division_perf.o
  CC test_bitmap.o
--
  INSTALL-APP dpdk-test-crypto-perf
  INSTALL-MAP dpdk-test-crypto-perf.map
  CC test_ring.o
  CC rxonly.o
  CC txonly.o
gmake[5]: warning:  Clock skew detected.  Your build may be incomplete.
  CC test_pmd_perf.o
  CC csumonly.o
  CC test_ring_perf.o
  CC icmpecho.o
  CC test_table.o
--
  CC noisy_vnf.o
  INSTALL-APP dpdk-test-eventdev
  CC bpf_cmd.o
  INSTALL-MAP dpdk-test-eventdev.map
  CC test_table_ports.o
gmake[5]: warning:  Clock skew detected.  Your build may be incomplete.
  CC util.o
  CC test_table_acl.o
  CC test_table_combined.o
  CC test_flow_classify.o
  CC test_rwlock.o
--
  INSTALL-MAP testpmd.map
  CC test_efd.o
  CC test_efd_perf.o
  CC test_hash.o
  CC test_thash.o
gmake[5]: warning:  Clock skew detected.  Your build may be incomplete.
  CC test_hash_perf.o
  CC test_hash_multiwriter.o
  CC test_hash_functions.o
  CC test_hash_readwrite.o
  CC test_hash_readwrite_lf.o
--
  CC test_kvargs.o
  CC test_bpf.o
  CC test_rcu_qsbr.o
In file included from /tmp/FreeBSD12.0_K19.02_GCC7.3.0/x86_64-native-bsdapp-gcc/6b1bb5ec45cb44ee9745952c5d8836da/dpdk/app/test/test_rcu_qsbr.c:8:0:
/tmp/FreeBSD12.0_K19.02_GCC7.3.0/x86_64-native-bsdapp-gcc/6b1bb5ec45cb44ee9745952c5d8836da/dpdk/x86_64-native-bsdapp-gcc/include/rte_rcu_qsbr.h: In function 'rte_rcu_qsbr_thread_online':
/tmp/FreeBSD12.0_K19.02_GCC7.3.0/x86_64-native-bsdapp-gcc/6b1bb5ec45cb44ee9745952c5d8836da/dpdk/x86_64-native-bsdapp-gcc/include/rte_rcu_qsbr.h:227:2: warning: implicit declaration of function 'rte_smp_mb' [-Wimplicit-function-declaration]
  rte_smp_mb();
  ^~~~~~~~~~
/tmp/FreeBSD12.0_K19.02_GCC7.3.0/x86_64-native-bsdapp-gcc/6b1bb5ec45cb44ee9745952c5d8836da/dpdk/x86_64-native-bsdapp-gcc/include/rte_rcu_qsbr.h:227:2: warning: nested extern declaration of 'rte_smp_mb' [-Wnested-externs]
In file included from /tmp/FreeBSD12.0_K19.02_GCC7.3.0/x86_64-native-bsdapp-gcc/6b1bb5ec45cb44ee9745952c5d8836da/dpdk/x86_64-native-bsdapp-gcc/include/generic/rte_cycles.h:18:0,
                 from /tmp/FreeBSD12.0_K19.02_GCC7.3.0/x86_64-native-bsdapp-gcc/6b1bb5ec45cb44ee9745952c5d8836da/dpdk/x86_64-native-bsdapp-gcc/include/rte_cycles.h:13,
                 from /tmp/FreeBSD12.0_K19.02_GCC7.3.0/x86_64-native-bsdapp-gcc/6b1bb5ec45cb44ee9745952c5d8836da/dpdk/app/test/test_rcu_qsbr.c:12:
/tmp/FreeBSD12.0_K19.02_GCC7.3.0/x86_64-native-bsdapp-gcc/6b1bb5ec45cb44ee9745952c5d8836da/dpdk/x86_64-native-bsdapp-gcc/include/rte_atomic.h: At top level:
/tmp/FreeBSD12.0_K19.02_GCC7.3.0/x86_64-native-bsdapp-gcc/6b1bb5ec45cb44ee9745952c5d8836da/dpdk/x86_64-native-bsdapp-gcc/include/rte_atomic.h:67:1: warning: conflicting types for 'rte_smp_mb'
 rte_smp_mb(void)
 ^~~~~~~~~~
/tmp/FreeBSD12.0_K19.02_GCC7.3.0/x86_64-native-bsdapp-gcc/6b1bb5ec45cb44ee9745952c5d8836da/dpdk/x86_64-native-bsdapp-gcc/include/rte_atomic.h:67:1: error: static declaration of 'rte_smp_mb' follows non-static declaration
In file included from /tmp/FreeBSD12.0_K19.02_GCC7.3.0/x86_64-native-bsdapp-gcc/6b1bb5ec45cb44ee9745952c5d8836da/dpdk/app/test/test_rcu_qsbr.c:8:0:
/tmp/FreeBSD12.0_K19.02_GCC7.3.0/x86_64-native-bsdapp-gcc/6b1bb5ec45cb44ee9745952c5d8836da/dpdk/x86_64-native-bsdapp-gcc/include/rte_rcu_qsbr.h:227:2: note: previous implicit declaration of 'rte_smp_mb' was here
  rte_smp_mb();
  ^~~~~~~~~~
gmake[5]: *** [/tmp/FreeBSD12.0_K19.02_GCC7.3.0/x86_64-native-bsdapp-gcc/6b1bb5ec45cb44ee9745952c5d8836da/dpdk/mk/internal/rte.compile-pre.mk:116: test_rcu_qsbr.o] Error 1
gmake[5]: *** Waiting for unfinished jobs....
  CC test_ipsec.o
  CC test_rcu_qsbr_perf.o
In file included from /tmp/FreeBSD12.0_K19.02_GCC7.3.0/x86_64-native-bsdapp-gcc/6b1bb5ec45cb44ee9745952c5d8836da/dpdk/app/test/test_rcu_qsbr_perf.c:8:0:
/tmp/FreeBSD12.0_K19.02_GCC7.3.0/x86_64-native-bsdapp-gcc/6b1bb5ec45cb44ee9745952c5d8836da/dpdk/x86_64-native-bsdapp-gcc/include/rte_rcu_qsbr.h: In function 'rte_rcu_qsbr_thread_online':
/tmp/FreeBSD12.0_K19.02_GCC7.3.0/x86_64-native-bsdapp-gcc/6b1bb5ec45cb44ee9745952c5d8836da/dpdk/x86_64-native-bsdapp-gcc/include/rte_rcu_qsbr.h:227:2: warning: implicit declaration of function 'rte_smp_mb' [-Wimplicit-function-declaration]
  rte_smp_mb();
  ^~~~~~~~~~
/tmp/FreeBSD12.0_K19.02_GCC7.3.0/x86_64-native-bsdapp-gcc/6b1bb5ec45cb44ee9745952c5d8836da/dpdk/x86_64-native-bsdapp-gcc/include/rte_rcu_qsbr.h:227:2: warning: nested extern declaration of 'rte_smp_mb' [-Wnested-externs]
In file included from /tmp/FreeBSD12.0_K19.02_GCC7.3.0/x86_64-native-bsdapp-gcc/6b1bb5ec45cb44ee9745952c5d8836da/dpdk/x86_64-native-bsdapp-gcc/include/generic/rte_cycles.h:18:0,
                 from /tmp/FreeBSD12.0_K19.02_GCC7.3.0/x86_64-native-bsdapp-gcc/6b1bb5ec45cb44ee9745952c5d8836da/dpdk/x86_64-native-bsdapp-gcc/include/rte_cycles.h:13,
                 from /tmp/FreeBSD12.0_K19.02_GCC7.3.0/x86_64-native-bsdapp-gcc/6b1bb5ec45cb44ee9745952c5d8836da/dpdk/app/test/test_rcu_qsbr_perf.c:12:
/tmp/FreeBSD12.0_K19.02_GCC7.3.0/x86_64-native-bsdapp-gcc/6b1bb5ec45cb44ee9745952c5d8836da/dpdk/x86_64-native-bsdapp-gcc/include/rte_atomic.h: At top level:
/tmp/FreeBSD12.0_K19.02_GCC7.3.0/x86_64-native-bsdapp-gcc/6b1bb5ec45cb44ee9745952c5d8836da/dpdk/x86_64-native-bsdapp-gcc/include/rte_atomic.h:67:1: warning: conflicting types for 'rte_smp_mb'
 rte_smp_mb(void)
 ^~~~~~~~~~
/tmp/FreeBSD12.0_K19.02_GCC7.3.0/x86_64-native-bsdapp-gcc/6b1bb5ec45cb44ee9745952c5d8836da/dpdk/x86_64-native-bsdapp-gcc/include/rte_atomic.h:67:1: error: static declaration of 'rte_smp_mb' follows non-static declaration
In file included from /tmp/FreeBSD12.0_K19.02_GCC7.3.0/x86_64-native-bsdapp-gcc/6b1bb5ec45cb44ee9745952c5d8836da/dpdk/app/test/test_rcu_qsbr_perf.c:8:0:
/tmp/FreeBSD12.0_K19.02_GCC7.3.0/x86_64-native-bsdapp-gcc/6b1bb5ec45cb44ee9745952c5d8836da/dpdk/x86_64-native-bsdapp-gcc/include/rte_rcu_qsbr.h:227:2: note: previous implicit declaration of 'rte_smp_mb' was here
  rte_smp_mb();
  ^~~~~~~~~~
gmake[5]: *** [/tmp/FreeBSD12.0_K19.02_GCC7.3.0/x86_64-native-bsdapp-gcc/6b1bb5ec45cb44ee9745952c5d8836da/dpdk/mk/internal/rte.compile-pre.mk:114: test_rcu_qsbr_perf.o] Error 1

*Failed Build #14:
OS: SUSE15
Target: x86_64-native-linuxapp-gcc
  SYMLINK-FILE include/cmdline_parse_string.h
  INSTALL-LIB librte_rcu.a
  SYMLINK-FILE include/cmdline_rdline.h
  AR librte_timer.a
  INSTALL-LIB librte_timer.a
make[5]: warning:  Clock skew detected.  Your build may be incomplete.
  CC acl_run_avx2.o
== Build lib/librte_power
  SYMLINK-FILE include/cmdline_vt100.h
  SYMLINK-FILE include/cmdline_socket.h
  SYMLINK-FILE include/cmdline_cirbuf.h
--
  CC rte_table_action.o
  AR librte_flow_classify.a
  INSTALL-LIB librte_flow_classify.a
  AR librte_pipeline.a
  INSTALL-LIB librte_pipeline.a
make[4]: warning:  Clock skew detected.  Your build may be incomplete.
== Build buildtools
== Build kernel
== Build buildtools/pmdinfogen
== Build kernel/linux
  HOSTCC pmdinfogen.o
--
  CC base/vnic_cq.o
  CC i40e_nvm.o
  CC i40e_dcb.o
  AR librte_pmd_fm10k.a
  INSTALL-LIB librte_pmd_fm10k.a
make[6]: warning:  Clock skew detected.  Your build may be incomplete.
== Build drivers/net/netvsc
  AR librte_pmd_iavf.a
  INSTALL-LIB librte_pmd_iavf.a
== Build drivers/net/nfp
  CC base/vnic_wq.o
--
  CC ifpga_fme.o
  CC ifpga_fme_iperf.o
  LD dpaa2_cmdif.o
  CC ifpga_fme_dperf.o
  AR librte_pmd_dpaa2_cmdif.a
  CC ifpga_fme_error.o
  INSTALL-LIB librte_pmd_dpaa2_cmdif.a
  PMDINFO dpaa2_qdma.o.pmd.c
  PMDINFO skeleton_rawdev.o.pmd.c
  CC dpaa2_qdma.o.pmd.o
  CC skeleton_rawdev.o.pmd.o
  CC ifpga_port.o
  CC ifpga_port_error.o
  LD dpaa2_qdma.o
  LD skeleton_rawdev.o
  CC opae_hw_api.o
  AR librte_pmd_skeleton_rawdev.a
  INSTALL-LIB librte_pmd_skeleton_rawdev.a
--
  LD dpdk-pdump
  INSTALL-APP cmdline_test
  INSTALL-APP dpdk-procinfo
  INSTALL-MAP cmdline_test.map
  INSTALL-MAP dpdk-procinfo.map
make[5]: warning:  Clock skew detected.  Your build may be incomplete.
== Build app/test-eventdev
make[5]: warning:  Clock skew detected.  Your build may be incomplete.
  CC comp_perf_test_verify.o
  CC init.o
  CC cperf_ops.o
  CC test.o
  INSTALL-APP testacl
  INSTALL-MAP testacl.map
  CC test_bbdev_perf.o
make[5]: warning:  Clock skew detected.  Your build may be incomplete.
  CC test_bbdev_vector.o
  CC runtime.o
  INSTALL-APP dpdk-pdump
  INSTALL-MAP dpdk-pdump.map
make[5]: warning:  Clock skew detected.  Your build may be incomplete.
  CC cperf_options_parsing.o
  CC resource.o
  CC parameters.o
  CC test_resource.o
  CC pipeline_stub.o
--
  CC cperf_test_common.o
  INSTALL-APP dpdk-test-compress-perf
  LD testpipeline
  INSTALL-MAP dpdk-test-compress-perf.map
  LD testbbdev
make[5]: warning:  Clock skew detected.  Your build may be incomplete.
  CC test_malloc.o
  CC test_cycles.o
  CC evt_options.o
  CC evt_test.o
  CC parser.o
--
  INSTALL-APP testbbdev
  INSTALL-MAP testbbdev.map
  CC test_memory.o
  CC test_order_queue.o
  CC test_order_atq.o
make[5]: warning:  Clock skew detected.  Your build may be incomplete.
  CC test_perf_common.o
  CC test_memzone.o
  CC test_perf_queue.o
  INSTALL-APP testpipeline
  INSTALL-MAP testpipeline.map
  CC test_bitmap.o
make[5]: warning:  Clock skew detected.  Your build may be incomplete.
  CC test_reciprocal_division.o
  CC test_perf_atq.o
  CC test_reciprocal_division_perf.o
  CC test_fbarray.o
  CC test_external_mem.o
  INSTALL-APP dpdk-test-crypto-perf
  INSTALL-MAP dpdk-test-crypto-perf.map
  CC test_pipeline_common.o
  CC test_ring.o
make[5]: warning:  Clock skew detected.  Your build may be incomplete.
  CC test_ring_perf.o
  CC test_pipeline_queue.o
  CC test_pipeline_atq.o
  CC test_pmd_perf.o
  CC test_table.o
--
  LD dpdk-test-eventdev
  CC test_flow_classify.o
  CC test_rwlock.o
  INSTALL-APP dpdk-test-eventdev
  INSTALL-MAP dpdk-test-eventdev.map
make[5]: warning:  Clock skew detected.  Your build may be incomplete.
  CC test_timer.o
  CC cmdline_mtr.o
  CC cmdline_tm.o
  CC test_timer_perf.o
  CC test_timer_racecond.o
--
  CC test_cmdline_portlist.o
  CC test_cmdline_ipaddr.o
  INSTALL-APP testpmd
  INSTALL-MAP testpmd.map
  CC test_cmdline_cirbuf.o
make[5]: warning:  Clock skew detected.  Your build may be incomplete.
  CC test_cmdline_string.o
  CC test_cmdline_lib.o
  CC test_crc.o
  CC test_red.o
  CC test_sched.o
--
  CC test_rcu_qsbr.o
  CC test_rcu_qsbr_perf.o
  CC test_ipsec.o
In file included from /tmp/SUSE15_K4.12.14_GCC7.3.1/x86_64-native-linuxapp-gcc/6b1bb5ec45cb44ee9745952c5d8836da/dpdk/app/test/test_rcu_qsbr.c:8:0:
/tmp/SUSE15_K4.12.14_GCC7.3.1/x86_64-native-linuxapp-gcc/6b1bb5ec45cb44ee9745952c5d8836da/dpdk/x86_64-native-linuxapp-gcc/include/rte_rcu_qsbr.h: In function ‘rte_rcu_qsbr_thread_online’:
/tmp/SUSE15_K4.12.14_GCC7.3.1/x86_64-native-linuxapp-gcc/6b1bb5ec45cb44ee9745952c5d8836da/dpdk/x86_64-native-linuxapp-gcc/include/rte_rcu_qsbr.h:227:2: warning: implicit declaration of function ‘rte_smp_mb’ [-Wimplicit-function-declaration]
  rte_smp_mb();
  ^~~~~~~~~~
/tmp/SUSE15_K4.12.14_GCC7.3.1/x86_64-native-linuxapp-gcc/6b1bb5ec45cb44ee9745952c5d8836da/dpdk/x86_64-native-linuxapp-gcc/include/rte_rcu_qsbr.h:227:2: warning: nested extern declaration of ‘rte_smp_mb’ [-Wnested-externs]
In file included from /tmp/SUSE15_K4.12.14_GCC7.3.1/x86_64-native-linuxapp-gcc/6b1bb5ec45cb44ee9745952c5d8836da/dpdk/x86_64-native-linuxapp-gcc/include/generic/rte_cycles.h:18:0,
                 from /tmp/SUSE15_K4.12.14_GCC7.3.1/x86_64-native-linuxapp-gcc/6b1bb5ec45cb44ee9745952c5d8836da/dpdk/x86_64-native-linuxapp-gcc/include/rte_cycles.h:13,
                 from /tmp/SUSE15_K4.12.14_GCC7.3.1/x86_64-native-linuxapp-gcc/6b1bb5ec45cb44ee9745952c5d8836da/dpdk/app/test/test_rcu_qsbr.c:12:
/tmp/SUSE15_K4.12.14_GCC7.3.1/x86_64-native-linuxapp-gcc/6b1bb5ec45cb44ee9745952c5d8836da/dpdk/x86_64-native-linuxapp-gcc/include/rte_atomic.h: At top level:
/tmp/SUSE15_K4.12.14_GCC7.3.1/x86_64-native-linuxapp-gcc/6b1bb5ec45cb44ee9745952c5d8836da/dpdk/x86_64-native-linuxapp-gcc/include/rte_atomic.h:67:1: warning: conflicting types for ‘rte_smp_mb’
 rte_smp_mb(void)
 ^~~~~~~~~~
/tmp/SUSE15_K4.12.14_GCC7.3.1/x86_64-native-linuxapp-gcc/6b1bb5ec45cb44ee9745952c5d8836da/dpdk/x86_64-native-linuxapp-gcc/include/rte_atomic.h:67:1: error: static declaration of ‘rte_smp_mb’ follows non-static declaration
In file included from /tmp/SUSE15_K4.12.14_GCC7.3.1/x86_64-native-linuxapp-gcc/6b1bb5ec45cb44ee9745952c5d8836da/dpdk/app/test/test_rcu_qsbr.c:8:0:
/tmp/SUSE15_K4.12.14_GCC7.3.1/x86_64-native-linuxapp-gcc/6b1bb5ec45cb44ee9745952c5d8836da/dpdk/x86_64-native-linuxapp-gcc/include/rte_rcu_qsbr.h:227:2: note: previous implicit declaration of ‘rte_smp_mb’ was here
  rte_smp_mb();
  ^~~~~~~~~~
make[5]: *** [/tmp/SUSE15_K4.12.14_GCC7.3.1/x86_64-native-linuxapp-gcc/6b1bb5ec45cb44ee9745952c5d8836da/dpdk/mk/internal/rte.compile-pre.mk:116: test_rcu_qsbr.o] Error 1
make[5]: *** Waiting for unfinished jobs....
In file included from /tmp/SUSE15_K4.12.14_GCC7.3.1/x86_64-native-linuxapp-gcc/6b1bb5ec45cb44ee9745952c5d8836da/dpdk/app/test/test_rcu_qsbr_perf.c:8:0:
/tmp/SUSE15_K4.12.14_GCC7.3.1/x86_64-native-linuxapp-gcc/6b1bb5ec45cb44ee9745952c5d8836da/dpdk/x86_64-native-linuxapp-gcc/include/rte_rcu_qsbr.h: In function ‘rte_rcu_qsbr_thread_online’:
/tmp/SUSE15_K4.12.14_GCC7.3.1/x86_64-native-linuxapp-gcc/6b1bb5ec45cb44ee9745952c5d8836da/dpdk/x86_64-native-linuxapp-gcc/include/rte_rcu_qsbr.h:227:2: warning: implicit declaration of function ‘rte_smp_mb’ [-Wimplicit-function-declaration]
  rte_smp_mb();
  ^~~~~~~~~~
/tmp/SUSE15_K4.12.14_GCC7.3.1/x86_64-native-linuxapp-gcc/6b1bb5ec45cb44ee9745952c5d8836da/dpdk/x86_64-native-linuxapp-gcc/include/rte_rcu_qsbr.h:227:2: warning: nested extern declaration of ‘rte_smp_mb’ [-Wnested-externs]
In file included from /tmp/SUSE15_K4.12.14_GCC7.3.1/x86_64-native-linuxapp-gcc/6b1bb5ec45cb44ee9745952c5d8836da/dpdk/x86_64-native-linuxapp-gcc/include/generic/rte_cycles.h:18:0,
                 from /tmp/SUSE15_K4.12.14_GCC7.3.1/x86_64-native-linuxapp-gcc/6b1bb5ec45cb44ee9745952c5d8836da/dpdk/x86_64-native-linuxapp-gcc/include/rte_cycles.h:13,
                 from /tmp/SUSE15_K4.12.14_GCC7.3.1/x86_64-native-linuxapp-gcc/6b1bb5ec45cb44ee9745952c5d8836da/dpdk/app/test/test_rcu_qsbr_perf.c:12:
/tmp/SUSE15_K4.12.14_GCC7.3.1/x86_64-native-linuxapp-gcc/6b1bb5ec45cb44ee9745952c5d8836da/dpdk/x86_64-native-linuxapp-gcc/include/rte_atomic.h: At top level:
/tmp/SUSE15_K4.12.14_GCC7.3.1/x86_64-native-linuxapp-gcc/6b1bb5ec45cb44ee9745952c5d8836da/dpdk/x86_64-native-linuxapp-gcc/include/rte_atomic.h:67:1: warning: conflicting types for ‘rte_smp_mb’
 rte_smp_mb(void)
 ^~~~~~~~~~
/tmp/SUSE15_K4.12.14_GCC7.3.1/x86_64-native-linuxapp-gcc/6b1bb5ec45cb44ee9745952c5d8836da/dpdk/x86_64-native-linuxapp-gcc/include/rte_atomic.h:67:1: error: static declaration of ‘rte_smp_mb’ follows non-static declaration
In file included from /tmp/SUSE15_K4.12.14_GCC7.3.1/x86_64-native-linuxapp-gcc/6b1bb5ec45cb44ee9745952c5d8836da/dpdk/app/test/test_rcu_qsbr_perf.c:8:0:
/tmp/SUSE15_K4.12.14_GCC7.3.1/x86_64-native-linuxapp-gcc/6b1bb5ec45cb44ee9745952c5d8836da/dpdk/x86_64-native-linuxapp-gcc/include/rte_rcu_qsbr.h:227:2: note: previous implicit declaration of ‘rte_smp_mb’ was here
  rte_smp_mb();
  ^~~~~~~~~~
make[5]: *** [/tmp/SUSE15_K4.12.14_GCC7.3.1/x86_64-native-linuxapp-gcc/6b1bb5ec45cb44ee9745952c5d8836da/dpdk/mk/internal/rte.compile-pre.mk:114: test_rcu_qsbr_perf.o] Error 1

*Failed Build #15:
OS: RHEL76
Target: x86_64-native-linuxapp-gcc
  CC ifpga_fme_iperf.o
  PMDINFO dpaa2_cmdif.o.pmd.c
  CC ifpga_fme_dperf.o
  CC dpaa2_cmdif.o.pmd.o
  LD dpaa2_cmdif.o
  CC ifpga_fme_error.o
  AR librte_pmd_dpaa2_cmdif.a
  CC ifpga_port.o
  CC ifpga_port_error.o
  INSTALL-LIB librte_pmd_dpaa2_cmdif.a
  CC opae_hw_api.o
  PMDINFO skeleton_rawdev.o.pmd.c
  CC skeleton_rawdev.o.pmd.o
  CC opae_ifpga_hw_api.o
--
  CC test_kvargs.o
  CC test_bpf.o
  CC test_rcu_qsbr.o
In file included from /tmp/RHEL76_K3.10.0_GCC4.8.5/x86_64-native-linuxapp-gcc/6b1bb5ec45cb44ee9745952c5d8836da/dpdk/app/test/test_rcu_qsbr.c:8:0:
/tmp/RHEL76_K3.10.0_GCC4.8.5/x86_64-native-linuxapp-gcc/6b1bb5ec45cb44ee9745952c5d8836da/dpdk/x86_64-native-linuxapp-gcc/include/rte_rcu_qsbr.h: In function ‘rte_rcu_qsbr_thread_online’:
/tmp/RHEL76_K3.10.0_GCC4.8.5/x86_64-native-linuxapp-gcc/6b1bb5ec45cb44ee9745952c5d8836da/dpdk/x86_64-native-linuxapp-gcc/include/rte_rcu_qsbr.h:227:2: warning: implicit declaration of function ‘rte_smp_mb’ [-Wimplicit-function-declaration]
  rte_smp_mb();
  ^
/tmp/RHEL76_K3.10.0_GCC4.8.5/x86_64-native-linuxapp-gcc/6b1bb5ec45cb44ee9745952c5d8836da/dpdk/x86_64-native-linuxapp-gcc/include/rte_rcu_qsbr.h:227:2: warning: nested extern declaration of ‘rte_smp_mb’ [-Wnested-externs]
In file included from /tmp/RHEL76_K3.10.0_GCC4.8.5/x86_64-native-linuxapp-gcc/6b1bb5ec45cb44ee9745952c5d8836da/dpdk/x86_64-native-linuxapp-gcc/include/generic/rte_cycles.h:18:0,
                 from /tmp/RHEL76_K3.10.0_GCC4.8.5/x86_64-native-linuxapp-gcc/6b1bb5ec45cb44ee9745952c5d8836da/dpdk/x86_64-native-linuxapp-gcc/include/rte_cycles.h:13,
                 from /tmp/RHEL76_K3.10.0_GCC4.8.5/x86_64-native-linuxapp-gcc/6b1bb5ec45cb44ee9745952c5d8836da/dpdk/app/test/test_rcu_qsbr.c:12:
/tmp/RHEL76_K3.10.0_GCC4.8.5/x86_64-native-linuxapp-gcc/6b1bb5ec45cb44ee9745952c5d8836da/dpdk/x86_64-native-linuxapp-gcc/include/rte_atomic.h: At top level:
/tmp/RHEL76_K3.10.0_GCC4.8.5/x86_64-native-linuxapp-gcc/6b1bb5ec45cb44ee9745952c5d8836da/dpdk/x86_64-native-linuxapp-gcc/include/rte_atomic.h:67:1: warning: conflicting types for ‘rte_smp_mb’ [enabled by default]
 rte_smp_mb(void)
 ^
/tmp/RHEL76_K3.10.0_GCC4.8.5/x86_64-native-linuxapp-gcc/6b1bb5ec45cb44ee9745952c5d8836da/dpdk/x86_64-native-linuxapp-gcc/include/rte_atomic.h:67:1: error: static declaration of ‘rte_smp_mb’ follows non-static declaration
In file included from /tmp/RHEL76_K3.10.0_GCC4.8.5/x86_64-native-linuxapp-gcc/6b1bb5ec45cb44ee9745952c5d8836da/dpdk/app/test/test_rcu_qsbr.c:8:0:
/tmp/RHEL76_K3.10.0_GCC4.8.5/x86_64-native-linuxapp-gcc/6b1bb5ec45cb44ee9745952c5d8836da/dpdk/x86_64-native-linuxapp-gcc/include/rte_rcu_qsbr.h:227:2: note: previous implicit declaration of ‘rte_smp_mb’ was here
  rte_smp_mb();
  ^
make[5]: *** [test_rcu_qsbr.o] Error 1

*Failed Build #16:
OS: FC29
Target: x86_64-native-linuxapp-gcc
  CC ifpga_fme.o
  CC ifpga_feature_dev.o
  CC dpaa2_qdma.o
  CC ifpga_fme_iperf.o
  CC ifpga_fme_dperf.o
  CC ifpga_fme_error.o
  CC ifpga_port.o
  PMDINFO dpaa2_cmdif.o.pmd.c
  CC dpaa2_cmdif.o.pmd.o
  LD dpaa2_cmdif.o
  CC ifpga_port_error.o
  CC opae_hw_api.o
  AR librte_pmd_dpaa2_cmdif.a
  INSTALL-LIB librte_pmd_dpaa2_cmdif.a
  CC opae_ifpga_hw_api.o
  CC opae_debug.o
--
  CC test_kvargs.o
  CC test_bpf.o
  CC test_rcu_qsbr.o
In file included from /tmp/FC29_K4.20_GCC8.0.1/x86_64-native-linuxapp-gcc/6b1bb5ec45cb44ee9745952c5d8836da/dpdk/app/test/test_rcu_qsbr.c:8:
/tmp/FC29_K4.20_GCC8.0.1/x86_64-native-linuxapp-gcc/6b1bb5ec45cb44ee9745952c5d8836da/dpdk/x86_64-native-linuxapp-gcc/include/rte_rcu_qsbr.h: In function ‘rte_rcu_qsbr_thread_online’:
/tmp/FC29_K4.20_GCC8.0.1/x86_64-native-linuxapp-gcc/6b1bb5ec45cb44ee9745952c5d8836da/dpdk/x86_64-native-linuxapp-gcc/include/rte_rcu_qsbr.h:227:2: warning: implicit declaration of function ‘rte_smp_mb’ [-Wimplicit-function-declaration]
  rte_smp_mb();
  ^~~~~~~~~~
/tmp/FC29_K4.20_GCC8.0.1/x86_64-native-linuxapp-gcc/6b1bb5ec45cb44ee9745952c5d8836da/dpdk/x86_64-native-linuxapp-gcc/include/rte_rcu_qsbr.h:227:2: warning: nested extern declaration of ‘rte_smp_mb’ [-Wnested-externs]
In file included from /tmp/FC29_K4.20_GCC8.0.1/x86_64-native-linuxapp-gcc/6b1bb5ec45cb44ee9745952c5d8836da/dpdk/x86_64-native-linuxapp-gcc/include/generic/rte_cycles.h:18,
                 from /tmp/FC29_K4.20_GCC8.0.1/x86_64-native-linuxapp-gcc/6b1bb5ec45cb44ee9745952c5d8836da/dpdk/x86_64-native-linuxapp-gcc/include/rte_cycles.h:13,
                 from /tmp/FC29_K4.20_GCC8.0.1/x86_64-native-linuxapp-gcc/6b1bb5ec45cb44ee9745952c5d8836da/dpdk/app/test/test_rcu_qsbr.c:12:
/tmp/FC29_K4.20_GCC8.0.1/x86_64-native-linuxapp-gcc/6b1bb5ec45cb44ee9745952c5d8836da/dpdk/x86_64-native-linuxapp-gcc/include/rte_atomic.h: At top level:
/tmp/FC29_K4.20_GCC8.0.1/x86_64-native-linuxapp-gcc/6b1bb5ec45cb44ee9745952c5d8836da/dpdk/x86_64-native-linuxapp-gcc/include/rte_atomic.h:67:1: warning: conflicting types for ‘rte_smp_mb’
 rte_smp_mb(void)
 ^~~~~~~~~~
/tmp/FC29_K4.20_GCC8.0.1/x86_64-native-linuxapp-gcc/6b1bb5ec45cb44ee9745952c5d8836da/dpdk/x86_64-native-linuxapp-gcc/include/rte_atomic.h:67:1: error: static declaration of ‘rte_smp_mb’ follows non-static declaration
In file included from /tmp/FC29_K4.20_GCC8.0.1/x86_64-native-linuxapp-gcc/6b1bb5ec45cb44ee9745952c5d8836da/dpdk/app/test/test_rcu_qsbr.c:8:
/tmp/FC29_K4.20_GCC8.0.1/x86_64-native-linuxapp-gcc/6b1bb5ec45cb44ee9745952c5d8836da/dpdk/x86_64-native-linuxapp-gcc/include/rte_rcu_qsbr.h:227:2: note: previous implicit declaration of ‘rte_smp_mb’ was here
  rte_smp_mb();
  ^~~~~~~~~~
make[5]: *** [/tmp/FC29_K4.20_GCC8.0.1/x86_64-native-linuxapp-gcc/6b1bb5ec45cb44ee9745952c5d8836da/dpdk/mk/internal/rte.compile-pre.mk:116: test_rcu_qsbr.o] Error 1

*Failed Build #17:
OS: FC29
Target: x86_64-native-linuxapp-clang
  CC ifpga_fme.o
  CC ifpga_fme_iperf.o
  CC ifpga_fme_dperf.o
  PMDINFO dpaa2_cmdif.o.pmd.c
  CC dpaa2_cmdif.o.pmd.o
  CC ifpga_fme_error.o
  CC ifpga_port.o
  CC ifpga_port_error.o
  LD dpaa2_cmdif.o
  CC opae_hw_api.o
  AR librte_pmd_dpaa2_cmdif.a
  CC opae_ifpga_hw_api.o
  INSTALL-LIB librte_pmd_dpaa2_cmdif.a
--
  CC test_rcu_qsbr.o
  CC test_rcu_qsbr_perf.o
  CC test_ipsec.o
  MKRES test_resource_c.res.o
In file included from /tmp/FC29_K4.20_Clang6.0.1/x86_64-native-linuxapp-clang/6b1bb5ec45cb44ee9745952c5d8836da/dpdk/app/test/test_rcu_qsbr.c:8:
/tmp/FC29_K4.20_Clang6.0.1/x86_64-native-linuxapp-clang/6b1bb5ec45cb44ee9745952c5d8836da/dpdk/x86_64-native-linuxapp-clang/include/rte_rcu_qsbr.h:227:2: warning: implicit declaration of function 'rte_smp_mb' is invalid in C99 [-Wimplicit-function-declaration]
        rte_smp_mb();
        ^
/tmp/FC29_K4.20_Clang6.0.1/x86_64-native-linuxapp-clang/6b1bb5ec45cb44ee9745952c5d8836da/dpdk/x86_64-native-linuxapp-clang/include/rte_rcu_qsbr.h:227:2: warning: this function declaration is not a prototype [-Wstrict-prototypes]
In file included from /tmp/FC29_K4.20_Clang6.0.1/x86_64-native-linuxapp-clang/6b1bb5ec45cb44ee9745952c5d8836da/dpdk/app/test/test_rcu_qsbr_perf.c:8:
/tmp/FC29_K4.20_Clang6.0.1/x86_64-native-linuxapp-clang/6b1bb5ec45cb44ee9745952c5d8836da/dpdk/x86_64-native-linuxapp-clang/include/rte_rcu_qsbr.h:227:2: warning: implicit declaration of function 'rte_smp_mb' is invalid in C99 [-Wimplicit-function-declaration]
        rte_smp_mb();
        ^
/tmp/FC29_K4.20_Clang6.0.1/x86_64-native-linuxapp-clang/6b1bb5ec45cb44ee9745952c5d8836da/dpdk/x86_64-native-linuxapp-clang/include/rte_rcu_qsbr.h:227:2: warning: this function declaration is not a prototype [-Wstrict-prototypes]
In file included from /tmp/FC29_K4.20_Clang6.0.1/x86_64-native-linuxapp-clang/6b1bb5ec45cb44ee9745952c5d8836da/dpdk/app/test/test_rcu_qsbr.c:12:
In file included from /tmp/FC29_K4.20_Clang6.0.1/x86_64-native-linuxapp-clang/6b1bb5ec45cb44ee9745952c5d8836da/dpdk/x86_64-native-linuxapp-clang/include/rte_cycles.h:13:
In file included from /tmp/FC29_K4.20_Clang6.0.1/x86_64-native-linuxapp-clang/6b1bb5ec45cb44ee9745952c5d8836da/dpdk/x86_64-native-linuxapp-clang/include/generic/rte_cycles.h:18:
/tmp/FC29_K4.20_Clang6.0.1/x86_64-native-linuxapp-clang/6b1bb5ec45cb44ee9745952c5d8836da/dpdk/x86_64-native-linuxapp-clang/include/rte_atomic.h:67:1: error: static declaration of 'rte_smp_mb' follows non-static declaration
rte_smp_mb(void)
^
/tmp/FC29_K4.20_Clang6.0.1/x86_64-native-linuxapp-clang/6b1bb5ec45cb44ee9745952c5d8836da/dpdk/x86_64-native-linuxapp-clang/include/rte_rcu_qsbr.h:227:2: note: previous implicit declaration is here
        rte_smp_mb();
        ^
In file included from /tmp/FC29_K4.20_Clang6.0.1/x86_64-native-linuxapp-clang/6b1bb5ec45cb44ee9745952c5d8836da/dpdk/app/test/test_rcu_qsbr_perf.c:12:
In file included from /tmp/FC29_K4.20_Clang6.0.1/x86_64-native-linuxapp-clang/6b1bb5ec45cb44ee9745952c5d8836da/dpdk/x86_64-native-linuxapp-clang/include/rte_cycles.h:13:
In file included from /tmp/FC29_K4.20_Clang6.0.1/x86_64-native-linuxapp-clang/6b1bb5ec45cb44ee9745952c5d8836da/dpdk/x86_64-native-linuxapp-clang/include/generic/rte_cycles.h:18:
/tmp/FC29_K4.20_Clang6.0.1/x86_64-native-linuxapp-clang/6b1bb5ec45cb44ee9745952c5d8836da/dpdk/x86_64-native-linuxapp-clang/include/rte_atomic.h:67:1: error: static declaration of 'rte_smp_mb' follows non-static declaration
rte_smp_mb(void)
^
/tmp/FC29_K4.20_Clang6.0.1/x86_64-native-linuxapp-clang/6b1bb5ec45cb44ee9745952c5d8836da/dpdk/x86_64-native-linuxapp-clang/include/rte_rcu_qsbr.h:227:2: note: previous implicit declaration is here
        rte_smp_mb();
        ^
2 warnings and 1 error generated.
make[5]: *** [/tmp/FC29_K4.20_Clang6.0.1/x86_64-native-linuxapp-clang/6b1bb5ec45cb44ee9745952c5d8836da/dpdk/mk/internal/rte.compile-pre.mk:114: test_rcu_qsbr_perf.o] Error 1
make[5]: *** Waiting for unfinished jobs....
2 warnings and 1 error generated.
make[5]: *** [/tmp/FC29_K4.20_Clang6.0.1/x86_64-native-linuxapp-clang/6b1bb5ec45cb44ee9745952c5d8836da/dpdk/mk/internal/rte.compile-pre.mk:114: test_rcu_qsbr.o] Error 1
make[4]: *** [/tmp/FC29_K4.20_Clang6.0.1/x86_64-native-linuxapp-clang/6b1bb5ec45cb44ee9745952c5d8836da/dpdk/mk/rte.subdir.mk:35: test] Error 2
make[3]: *** [/tmp/FC29_K4.20_Clang6.0.1/x86_64-native-linuxapp-clang/6b1bb5ec45cb44ee9745952c5d8836da/dpdk/mk/rte.sdkbuild.mk:48: app] Error 2
make[2]: *** [/tmp/FC29_K4.20_Clang6.0.1/x86_64-native-linuxapp-clang/6b1bb5ec45cb44ee9745952c5d8836da/dpdk/mk/rte.sdkroot.mk:99: all] Error 2
make[1]: *** [/tmp/FC29_K4.20_Clang6.0.1/x86_64-native-linuxapp-clang/6b1bb5ec45cb44ee9745952c5d8836da/dpdk/mk/rte.sdkinstall.mk:61: pre_install] Error 2

*Failed Build #18:
OS: FC29
Target: x86_64-native-linuxapp-icc
  CC ifpga_fme_iperf.o
  CC ifpga_fme.o
  CC ifpga_fme_dperf.o
  PMDINFO dpaa2_cmdif.o.pmd.c
  CC dpaa2_cmdif.o.pmd.o
  CC ifpga_fme_error.o
  LD dpaa2_cmdif.o
  PMDINFO dpaa2_qdma.o.pmd.c
  CC dpaa2_qdma.o.pmd.o
  CC ifpga_port.o
  AR librte_pmd_dpaa2_cmdif.a
  INSTALL-LIB librte_pmd_dpaa2_cmdif.a
  CC ifpga_port_error.o
  CC opae_hw_api.o
  PMDINFO skeleton_rawdev.o.pmd.c
  CC opae_debug.o
  CC opae_ifpga_hw_api.o
  CC skeleton_rawdev.o.pmd.o
--
  CC test_rcu_qsbr.o
  CC test_rcu_qsbr_perf.o
  CC test_ipsec.o
  MKRES test_resource_c.res.o
In file included from /tmp/FC29_K4.20_ICC19.0.0/x86_64-native-linuxapp-icc/6b1bb5ec45cb44ee9745952c5d8836da/dpdk/app/test/test_rcu_qsbr.c(8):
/tmp/FC29_K4.20_ICC19.0.0/x86_64-native-linuxapp-icc/6b1bb5ec45cb44ee9745952c5d8836da/dpdk/x86_64-native-linuxapp-icc/include/rte_rcu_qsbr.h(227): warning #266: function "rte_smp_mb" declared implicitly
  	rte_smp_mb();
  	^

In file included from /tmp/FC29_K4.20_ICC19.0.0/x86_64-native-linuxapp-icc/6b1bb5ec45cb44ee9745952c5d8836da/dpdk/x86_64-native-linuxapp-icc/include/generic/rte_cycles.h(18),
                 from /tmp/FC29_K4.20_ICC19.0.0/x86_64-native-linuxapp-icc/6b1bb5ec45cb44ee9745952c5d8836da/dpdk/x86_64-native-linuxapp-icc/include/rte_cycles.h(13),
                 from /tmp/FC29_K4.20_ICC19.0.0/x86_64-native-linuxapp-icc/6b1bb5ec45cb44ee9745952c5d8836da/dpdk/app/test/test_rcu_qsbr.c(12):
/tmp/FC29_K4.20_ICC19.0.0/x86_64-native-linuxapp-icc/6b1bb5ec45cb44ee9745952c5d8836da/dpdk/x86_64-native-linuxapp-icc/include/rte_atomic.h(67): warning #159: declaration is incompatible with previous "rte_smp_mb" (declared at line 227 of "/tmp/FC29_K4.20_ICC19.0.0/x86_64-native-linuxapp-icc/6b1bb5ec45cb44ee9745952c5d8836da/dpdk/x86_64-native-linuxapp-icc/include/rte_rcu_qsbr.h")
  rte_smp_mb(void)
  ^

In file included from /tmp/FC29_K4.20_ICC19.0.0/x86_64-native-linuxapp-icc/6b1bb5ec45cb44ee9745952c5d8836da/dpdk/app/test/test_rcu_qsbr_perf.c(8):
/tmp/FC29_K4.20_ICC19.0.0/x86_64-native-linuxapp-icc/6b1bb5ec45cb44ee9745952c5d8836da/dpdk/x86_64-native-linuxapp-icc/include/rte_rcu_qsbr.h(227): warning #266: function "rte_smp_mb" declared implicitly
  	rte_smp_mb();
  	^

In file included from /tmp/FC29_K4.20_ICC19.0.0/x86_64-native-linuxapp-icc/6b1bb5ec45cb44ee9745952c5d8836da/dpdk/x86_64-native-linuxapp-icc/include/generic/rte_cycles.h(18),
                 from /tmp/FC29_K4.20_ICC19.0.0/x86_64-native-linuxapp-icc/6b1bb5ec45cb44ee9745952c5d8836da/dpdk/x86_64-native-linuxapp-icc/include/rte_cycles.h(13),
                 from /tmp/FC29_K4.20_ICC19.0.0/x86_64-native-linuxapp-icc/6b1bb5ec45cb44ee9745952c5d8836da/dpdk/app/test/test_rcu_qsbr_perf.c(12):
/tmp/FC29_K4.20_ICC19.0.0/x86_64-native-linuxapp-icc/6b1bb5ec45cb44ee9745952c5d8836da/dpdk/x86_64-native-linuxapp-icc/include/rte_atomic.h(67): warning #159: declaration is incompatible with previous "rte_smp_mb" (declared at line 227 of "/tmp/FC29_K4.20_ICC19.0.0/x86_64-native-linuxapp-icc/6b1bb5ec45cb44ee9745952c5d8836da/dpdk/x86_64-native-linuxapp-icc/include/rte_rcu_qsbr.h")
  rte_smp_mb(void)
  ^

  LD test
ld: test_rcu_qsbr.o: in function `test_rcu_qsbr_synchronize_reader':

*Failed Build #19:
OS: RHEL74
Target: x86_64-native-linuxapp-gcc
  CC ifpga_fme_iperf.o
  CC ifpga_fme_dperf.o
  PMDINFO dpaa2_cmdif.o.pmd.c
  CC dpaa2_cmdif.o.pmd.o
  LD dpaa2_cmdif.o
  CC ifpga_fme_error.o
  CC ifpga_port.o
  AR librte_pmd_dpaa2_cmdif.a
  CC ifpga_port_error.o
  INSTALL-LIB librte_pmd_dpaa2_cmdif.a
  CC opae_hw_api.o
  PMDINFO skeleton_rawdev.o.pmd.c
  CC skeleton_rawdev.o.pmd.o
  PMDINFO dpaa2_qdma.o.pmd.c
--
  CC test_bpf.o
  CC test_rcu_qsbr.o
  CC test_rcu_qsbr_perf.o
In file included from /tmp/RHEL74_K3.10.0_GCC4.8.5/x86_64-native-linuxapp-gcc/6b1bb5ec45cb44ee9745952c5d8836da/dpdk/app/test/test_rcu_qsbr_perf.c:8:0:
/tmp/RHEL74_K3.10.0_GCC4.8.5/x86_64-native-linuxapp-gcc/6b1bb5ec45cb44ee9745952c5d8836da/dpdk/x86_64-native-linuxapp-gcc/include/rte_rcu_qsbr.h: In function ‘rte_rcu_qsbr_thread_online’:
/tmp/RHEL74_K3.10.0_GCC4.8.5/x86_64-native-linuxapp-gcc/6b1bb5ec45cb44ee9745952c5d8836da/dpdk/x86_64-native-linuxapp-gcc/include/rte_rcu_qsbr.h:227:2: warning: implicit declaration of function ‘rte_smp_mb’ [-Wimplicit-function-declaration]
  rte_smp_mb();
  ^
/tmp/RHEL74_K3.10.0_GCC4.8.5/x86_64-native-linuxapp-gcc/6b1bb5ec45cb44ee9745952c5d8836da/dpdk/x86_64-native-linuxapp-gcc/include/rte_rcu_qsbr.h:227:2: warning: nested extern declaration of ‘rte_smp_mb’ [-Wnested-externs]
In file included from /tmp/RHEL74_K3.10.0_GCC4.8.5/x86_64-native-linuxapp-gcc/6b1bb5ec45cb44ee9745952c5d8836da/dpdk/x86_64-native-linuxapp-gcc/include/generic/rte_cycles.h:18:0,
                 from /tmp/RHEL74_K3.10.0_GCC4.8.5/x86_64-native-linuxapp-gcc/6b1bb5ec45cb44ee9745952c5d8836da/dpdk/x86_64-native-linuxapp-gcc/include/rte_cycles.h:13,
                 from /tmp/RHEL74_K3.10.0_GCC4.8.5/x86_64-native-linuxapp-gcc/6b1bb5ec45cb44ee9745952c5d8836da/dpdk/app/test/test_rcu_qsbr_perf.c:12:
/tmp/RHEL74_K3.10.0_GCC4.8.5/x86_64-native-linuxapp-gcc/6b1bb5ec45cb44ee9745952c5d8836da/dpdk/x86_64-native-linuxapp-gcc/include/rte_atomic.h: At top level:
/tmp/RHEL74_K3.10.0_GCC4.8.5/x86_64-native-linuxapp-gcc/6b1bb5ec45cb44ee9745952c5d8836da/dpdk/x86_64-native-linuxapp-gcc/include/rte_atomic.h:67:1: warning: conflicting types for ‘rte_smp_mb’ [enabled by default]
 rte_smp_mb(void)
 ^
/tmp/RHEL74_K3.10.0_GCC4.8.5/x86_64-native-linuxapp-gcc/6b1bb5ec45cb44ee9745952c5d8836da/dpdk/x86_64-native-linuxapp-gcc/include/rte_atomic.h:67:1: error: static declaration of ‘rte_smp_mb’ follows non-static declaration
In file included from /tmp/RHEL74_K3.10.0_GCC4.8.5/x86_64-native-linuxapp-gcc/6b1bb5ec45cb44ee9745952c5d8836da/dpdk/app/test/test_rcu_qsbr_perf.c:8:0:
/tmp/RHEL74_K3.10.0_GCC4.8.5/x86_64-native-linuxapp-gcc/6b1bb5ec45cb44ee9745952c5d8836da/dpdk/x86_64-native-linuxapp-gcc/include/rte_rcu_qsbr.h:227:2: note: previous implicit declaration of ‘rte_smp_mb’ was here
  rte_smp_mb();
  ^
In file included from /tmp/RHEL74_K3.10.0_GCC4.8.5/x86_64-native-linuxapp-gcc/6b1bb5ec45cb44ee9745952c5d8836da/dpdk/app/test/test_rcu_qsbr.c:8:0:
/tmp/RHEL74_K3.10.0_GCC4.8.5/x86_64-native-linuxapp-gcc/6b1bb5ec45cb44ee9745952c5d8836da/dpdk/x86_64-native-linuxapp-gcc/include/rte_rcu_qsbr.h: In function ‘rte_rcu_qsbr_thread_online’:
/tmp/RHEL74_K3.10.0_GCC4.8.5/x86_64-native-linuxapp-gcc/6b1bb5ec45cb44ee9745952c5d8836da/dpdk/x86_64-native-linuxapp-gcc/include/rte_rcu_qsbr.h:227:2: warning: implicit declaration of function ‘rte_smp_mb’ [-Wimplicit-function-declaration]
  rte_smp_mb();
  ^
/tmp/RHEL74_K3.10.0_GCC4.8.5/x86_64-native-linuxapp-gcc/6b1bb5ec45cb44ee9745952c5d8836da/dpdk/x86_64-native-linuxapp-gcc/include/rte_rcu_qsbr.h:227:2: warning: nested extern declaration of ‘rte_smp_mb’ [-Wnested-externs]
In file included from /tmp/RHEL74_K3.10.0_GCC4.8.5/x86_64-native-linuxapp-gcc/6b1bb5ec45cb44ee9745952c5d8836da/dpdk/x86_64-native-linuxapp-gcc/include/generic/rte_cycles.h:18:0,
                 from /tmp/RHEL74_K3.10.0_GCC4.8.5/x86_64-native-linuxapp-gcc/6b1bb5ec45cb44ee9745952c5d8836da/dpdk/x86_64-native-linuxapp-gcc/include/rte_cycles.h:13,
                 from /tmp/RHEL74_K3.10.0_GCC4.8.5/x86_64-native-linuxapp-gcc/6b1bb5ec45cb44ee9745952c5d8836da/dpdk/app/test/test_rcu_qsbr.c:12:
/tmp/RHEL74_K3.10.0_GCC4.8.5/x86_64-native-linuxapp-gcc/6b1bb5ec45cb44ee9745952c5d8836da/dpdk/x86_64-native-linuxapp-gcc/include/rte_atomic.h: At top level:
/tmp/RHEL74_K3.10.0_GCC4.8.5/x86_64-native-linuxapp-gcc/6b1bb5ec45cb44ee9745952c5d8836da/dpdk/x86_64-native-linuxapp-gcc/include/rte_atomic.h:67:1: warning: conflicting types for ‘rte_smp_mb’ [enabled by default]
 rte_smp_mb(void)
 ^
/tmp/RHEL74_K3.10.0_GCC4.8.5/x86_64-native-linuxapp-gcc/6b1bb5ec45cb44ee9745952c5d8836da/dpdk/x86_64-native-linuxapp-gcc/include/rte_atomic.h:67:1: error: static declaration of ‘rte_smp_mb’ follows non-static declaration
In file included from /tmp/RHEL74_K3.10.0_GCC4.8.5/x86_64-native-linuxapp-gcc/6b1bb5ec45cb44ee9745952c5d8836da/dpdk/app/test/test_rcu_qsbr.c:8:0:
/tmp/RHEL74_K3.10.0_GCC4.8.5/x86_64-native-linuxapp-gcc/6b1bb5ec45cb44ee9745952c5d8836da/dpdk/x86_64-native-linuxapp-gcc/include/rte_rcu_qsbr.h:227:2: note: previous implicit declaration of ‘rte_smp_mb’ was here
  rte_smp_mb();
  ^
make[5]: *** [test_rcu_qsbr_perf.o] Error 1

*Failed Build #20:
OS: CENTOS74
Target: x86_64-native-linuxapp-gcc
  CC ifpga_fme.o
  CC ifpga_fme_iperf.o
  CC ifpga_fme_dperf.o
  PMDINFO dpaa2_cmdif.o.pmd.c
  CC dpaa2_cmdif.o.pmd.o
  CC ifpga_fme_error.o
  LD dpaa2_cmdif.o
  CC ifpga_port.o
  CC ifpga_port_error.o
  AR librte_pmd_dpaa2_cmdif.a
  CC opae_hw_api.o
  INSTALL-LIB librte_pmd_dpaa2_cmdif.a
  CC opae_ifpga_hw_api.o
  PMDINFO skeleton_rawdev.o.pmd.c
--
  CC test_kvargs.o
  CC test_bpf.o
  CC test_rcu_qsbr.o
In file included from /tmp/CENTOS74_K3.10.0_GCC4.8.5/x86_64-native-linuxapp-gcc/6b1bb5ec45cb44ee9745952c5d8836da/dpdk/app/test/test_rcu_qsbr.c:8:0:
/tmp/CENTOS74_K3.10.0_GCC4.8.5/x86_64-native-linuxapp-gcc/6b1bb5ec45cb44ee9745952c5d8836da/dpdk/x86_64-native-linuxapp-gcc/include/rte_rcu_qsbr.h: In function ‘rte_rcu_qsbr_thread_online’:
/tmp/CENTOS74_K3.10.0_GCC4.8.5/x86_64-native-linuxapp-gcc/6b1bb5ec45cb44ee9745952c5d8836da/dpdk/x86_64-native-linuxapp-gcc/include/rte_rcu_qsbr.h:227:2: warning: implicit declaration of function ‘rte_smp_mb’ [-Wimplicit-function-declaration]
  rte_smp_mb();
  ^
/tmp/CENTOS74_K3.10.0_GCC4.8.5/x86_64-native-linuxapp-gcc/6b1bb5ec45cb44ee9745952c5d8836da/dpdk/x86_64-native-linuxapp-gcc/include/rte_rcu_qsbr.h:227:2: warning: nested extern declaration of ‘rte_smp_mb’ [-Wnested-externs]
In file included from /tmp/CENTOS74_K3.10.0_GCC4.8.5/x86_64-native-linuxapp-gcc/6b1bb5ec45cb44ee9745952c5d8836da/dpdk/x86_64-native-linuxapp-gcc/include/generic/rte_cycles.h:18:0,
                 from /tmp/CENTOS74_K3.10.0_GCC4.8.5/x86_64-native-linuxapp-gcc/6b1bb5ec45cb44ee9745952c5d8836da/dpdk/x86_64-native-linuxapp-gcc/include/rte_cycles.h:13,
                 from /tmp/CENTOS74_K3.10.0_GCC4.8.5/x86_64-native-linuxapp-gcc/6b1bb5ec45cb44ee9745952c5d8836da/dpdk/app/test/test_rcu_qsbr.c:12:
/tmp/CENTOS74_K3.10.0_GCC4.8.5/x86_64-native-linuxapp-gcc/6b1bb5ec45cb44ee9745952c5d8836da/dpdk/x86_64-native-linuxapp-gcc/include/rte_atomic.h: At top level:
/tmp/CENTOS74_K3.10.0_GCC4.8.5/x86_64-native-linuxapp-gcc/6b1bb5ec45cb44ee9745952c5d8836da/dpdk/x86_64-native-linuxapp-gcc/include/rte_atomic.h:67:1: warning: conflicting types for ‘rte_smp_mb’ [enabled by default]
 rte_smp_mb(void)
 ^
/tmp/CENTOS74_K3.10.0_GCC4.8.5/x86_64-native-linuxapp-gcc/6b1bb5ec45cb44ee9745952c5d8836da/dpdk/x86_64-native-linuxapp-gcc/include/rte_atomic.h:67:1: error: static declaration of ‘rte_smp_mb’ follows non-static declaration
In file included from /tmp/CENTOS74_K3.10.0_GCC4.8.5/x86_64-native-linuxapp-gcc/6b1bb5ec45cb44ee9745952c5d8836da/dpdk/app/test/test_rcu_qsbr.c:8:0:
/tmp/CENTOS74_K3.10.0_GCC4.8.5/x86_64-native-linuxapp-gcc/6b1bb5ec45cb44ee9745952c5d8836da/dpdk/x86_64-native-linuxapp-gcc/include/rte_rcu_qsbr.h:227:2: note: previous implicit declaration of ‘rte_smp_mb’ was here
  rte_smp_mb();
  ^
make[5]: *** [test_rcu_qsbr.o] Error 1

*Failed Build #21:
OS: CENTOS75
Target: x86_64-native-linuxapp-gcc
  CC ifpga_fme_iperf.o
  PMDINFO dpaa2_cmdif.o.pmd.c
  CC ifpga_fme_dperf.o
  CC dpaa2_cmdif.o.pmd.o
  LD dpaa2_cmdif.o
  CC ifpga_fme_error.o
  CC ifpga_port.o
  CC ifpga_port_error.o
  AR librte_pmd_dpaa2_cmdif.a
  CC opae_hw_api.o
  CC opae_ifpga_hw_api.o
  CC opae_debug.o
  INSTALL-LIB librte_pmd_dpaa2_cmdif.a
--
  CC test_kvargs.o
  CC test_bpf.o
  CC test_rcu_qsbr.o
In file included from /tmp/CENTOS75_K3.10.0_GCC4.8.5/x86_64-native-linuxapp-gcc/6b1bb5ec45cb44ee9745952c5d8836da/dpdk/app/test/test_rcu_qsbr.c:8:0:
/tmp/CENTOS75_K3.10.0_GCC4.8.5/x86_64-native-linuxapp-gcc/6b1bb5ec45cb44ee9745952c5d8836da/dpdk/x86_64-native-linuxapp-gcc/include/rte_rcu_qsbr.h: In function ‘rte_rcu_qsbr_thread_online’:
/tmp/CENTOS75_K3.10.0_GCC4.8.5/x86_64-native-linuxapp-gcc/6b1bb5ec45cb44ee9745952c5d8836da/dpdk/x86_64-native-linuxapp-gcc/include/rte_rcu_qsbr.h:227:2: warning: implicit declaration of function ‘rte_smp_mb’ [-Wimplicit-function-declaration]
  rte_smp_mb();
  ^
/tmp/CENTOS75_K3.10.0_GCC4.8.5/x86_64-native-linuxapp-gcc/6b1bb5ec45cb44ee9745952c5d8836da/dpdk/x86_64-native-linuxapp-gcc/include/rte_rcu_qsbr.h:227:2: warning: nested extern declaration of ‘rte_smp_mb’ [-Wnested-externs]
In file included from /tmp/CENTOS75_K3.10.0_GCC4.8.5/x86_64-native-linuxapp-gcc/6b1bb5ec45cb44ee9745952c5d8836da/dpdk/x86_64-native-linuxapp-gcc/include/generic/rte_cycles.h:18:0,
                 from /tmp/CENTOS75_K3.10.0_GCC4.8.5/x86_64-native-linuxapp-gcc/6b1bb5ec45cb44ee9745952c5d8836da/dpdk/x86_64-native-linuxapp-gcc/include/rte_cycles.h:13,
                 from /tmp/CENTOS75_K3.10.0_GCC4.8.5/x86_64-native-linuxapp-gcc/6b1bb5ec45cb44ee9745952c5d8836da/dpdk/app/test/test_rcu_qsbr.c:12:
/tmp/CENTOS75_K3.10.0_GCC4.8.5/x86_64-native-linuxapp-gcc/6b1bb5ec45cb44ee9745952c5d8836da/dpdk/x86_64-native-linuxapp-gcc/include/rte_atomic.h: At top level:
/tmp/CENTOS75_K3.10.0_GCC4.8.5/x86_64-native-linuxapp-gcc/6b1bb5ec45cb44ee9745952c5d8836da/dpdk/x86_64-native-linuxapp-gcc/include/rte_atomic.h:67:1: warning: conflicting types for ‘rte_smp_mb’ [enabled by default]
 rte_smp_mb(void)
 ^
/tmp/CENTOS75_K3.10.0_GCC4.8.5/x86_64-native-linuxapp-gcc/6b1bb5ec45cb44ee9745952c5d8836da/dpdk/x86_64-native-linuxapp-gcc/include/rte_atomic.h:67:1: error: static declaration of ‘rte_smp_mb’ follows non-static declaration
In file included from /tmp/CENTOS75_K3.10.0_GCC4.8.5/x86_64-native-linuxapp-gcc/6b1bb5ec45cb44ee9745952c5d8836da/dpdk/app/test/test_rcu_qsbr.c:8:0:
/tmp/CENTOS75_K3.10.0_GCC4.8.5/x86_64-native-linuxapp-gcc/6b1bb5ec45cb44ee9745952c5d8836da/dpdk/x86_64-native-linuxapp-gcc/include/rte_rcu_qsbr.h:227:2: note: previous implicit declaration of ‘rte_smp_mb’ was here
  rte_smp_mb();
  ^
make[5]: *** [test_rcu_qsbr.o] Error 1

*Failed Build #22:
OS: FC28
Target: x86_64-native-linuxapp-icc
== Build drivers/bus/ifpga
== Build drivers/bus/pci
== Build drivers/bus/vdev
== Build drivers/bus/vmbus
  Building modules, stage 2.
/tmp/FC28_K4.16.3_ICC19.0.0/x86_64-native-linuxapp-icc/6b1bb5ec45cb44ee9745952c5d8836da/dpdk/x86_64-native-linuxapp-icc/build/kernel/linux/kni/kni_misc.o: warning: objtool: kni_ioctl_release()+0x60: sibling call from callable instruction with modified stack frame
/tmp/FC28_K4.16.3_ICC19.0.0/x86_64-native-linuxapp-icc/6b1bb5ec45cb44ee9745952c5d8836da/dpdk/x86_64-native-linuxapp-icc/build/kernel/linux/kni/kni_misc.o: warning: objtool: kni_ioctl()+0x2d: sibling call from callable instruction with modified stack frame
/tmp/FC28_K4.16.3_ICC19.0.0/x86_64-native-linuxapp-icc/6b1bb5ec45cb44ee9745952c5d8836da/dpdk/x86_64-native-linuxapp-icc/build/kernel/linux/kni/kni_misc.o: warning: objtool: kni_ioctl.cold.6()+0xc: sibling call from callable instruction with modified stack frame
/tmp/FC28_K4.16.3_ICC19.0.0/x86_64-native-linuxapp-icc/6b1bb5ec45cb44ee9745952c5d8836da/dpdk/x86_64-native-linuxapp-icc/build/kernel/linux/kni/kni_net.o: warning: objtool: kni_fifo_trans_pa2va()+0x167: sibling call from callable instruction with modified stack frame
/tmp/FC28_K4.16.3_ICC19.0.0/x86_64-native-linuxapp-icc/6b1bb5ec45cb44ee9745952c5d8836da/dpdk/x86_64-native-linuxapp-icc/build/kernel/linux/kni/kni_net.o: warning: objtool: kni_net_rx_lo_fifo_skb()+0x326: sibling call from callable instruction with modified stack frame
/tmp/FC28_K4.16.3_ICC19.0.0/x86_64-native-linuxapp-icc/6b1bb5ec45cb44ee9745952c5d8836da/dpdk/x86_64-native-linuxapp-icc/build/kernel/linux/kni/kni_net.o: warning: objtool: kni_net_process_request()+0x2d: sibling call from callable instruction with modified stack frame
/tmp/FC28_K4.16.3_ICC19.0.0/x86_64-native-linuxapp-icc/6b1bb5ec45cb44ee9745952c5d8836da/dpdk/x86_64-native-linuxapp-icc/build/kernel/linux/kni/kni_net.o: warning: objtool: kni_net_set_mac()+0x1a6: sibling call from callable instruction with modified stack frame
/tmp/FC28_K4.16.3_ICC19.0.0/x86_64-native-linuxapp-icc/6b1bb5ec45cb44ee9745952c5d8836da/dpdk/x86_64-native-linuxapp-icc/build/kernel/linux/kni/kni_net.o: warning: objtool: kni_net_rx_lo_fifo()+0x31c: sibling call from callable instruction with modified stack frame
/tmp/FC28_K4.16.3_ICC19.0.0/x86_64-native-linuxapp-icc/6b1bb5ec45cb44ee9745952c5d8836da/dpdk/x86_64-native-linuxapp-icc/build/kernel/linux/kni/kni_net.o: warning: objtool: kni_net_rx_normal()+0x2f9: sibling call from callable instruction with modified stack frame
/tmp/FC28_K4.16.3_ICC19.0.0/x86_64-native-linuxapp-icc/6b1bb5ec45cb44ee9745952c5d8836da/dpdk/x86_64-native-linuxapp-icc/build/kernel/linux/kni/kni_net.o: warning: objtool: kni_fifo_trans_pa2va.cold.6()+0x1d: sibling call from callable instruction with modified stack frame
/tmp/FC28_K4.16.3_ICC19.0.0/x86_64-native-linuxapp-icc/6b1bb5ec45cb44ee9745952c5d8836da/dpdk/x86_64-native-linuxapp-icc/build/kernel/linux/kni/kni_net.o: warning: objtool: kni_net_rx_lo_fifo_skb.cold.7()+0x25: sibling call from callable instruction with modified stack frame
/tmp/FC28_K4.16.3_ICC19.0.0/x86_64-native-linuxapp-icc/6b1bb5ec45cb44ee9745952c5d8836da/dpdk/x86_64-native-linuxapp-icc/build/kernel/linux/kni/kni_net.o: warning: objtool: kni_net_rx_normal.cold.11()+0x25: sibling call from callable instruction with modified stack frame
  LD [M]  /tmp/FC28_K4.16.3_ICC19.0.0/x86_64-native-linuxapp-icc/6b1bb5ec45cb44ee9745952c5d8836da/dpdk/x86_64-native-linuxapp-icc/build/kernel/linux/kni/rte_kni.o
  Building modules, stage 2.
  MODPOST 1 modules
  CC      /tmp/FC28_K4.16.3_ICC19.0.0/x86_64-native-linuxapp-icc/6b1bb5ec45cb44ee9745952c5d8836da/dpdk/x86_64-native-linuxapp-icc/build/kernel/linux/igb_uio/igb_uio.mod.o
  CC qbman/qbman_debug.o
--
  CC ifpga_fme.o
  CC ifpga_fme_dperf.o
  CC ifpga_fme_iperf.o
  PMDINFO dpaa2_cmdif.o.pmd.c
  CC dpaa2_cmdif.o.pmd.o
  CC ifpga_fme_error.o
  LD dpaa2_cmdif.o
  CC ifpga_port.o
  PMDINFO dpaa2_qdma.o.pmd.c
  CC dpaa2_qdma.o.pmd.o
  AR librte_pmd_dpaa2_cmdif.a
  PMDINFO skeleton_rawdev.o.pmd.c
  INSTALL-LIB librte_pmd_dpaa2_cmdif.a
  CC skeleton_rawdev.o.pmd.o
  CC ifpga_port_error.o
  CC opae_hw_api.o
  CC opae_ifpga_hw_api.o
  CC opae_debug.o
  CC ifpga_fme_pr.o
  LD dpaa2_qdma.o
--
  CC test_rcu_qsbr.o
  CC test_rcu_qsbr_perf.o
  CC test_ipsec.o
  MKRES test_resource_c.res.o
In file included from /tmp/FC28_K4.16.3_ICC19.0.0/x86_64-native-linuxapp-icc/6b1bb5ec45cb44ee9745952c5d8836da/dpdk/app/test/test_rcu_qsbr.c(8):
/tmp/FC28_K4.16.3_ICC19.0.0/x86_64-native-linuxapp-icc/6b1bb5ec45cb44ee9745952c5d8836da/dpdk/x86_64-native-linuxapp-icc/include/rte_rcu_qsbr.h(227): warning #266: function "rte_smp_mb" declared implicitly
  	rte_smp_mb();
  	^

In file included from /tmp/FC28_K4.16.3_ICC19.0.0/x86_64-native-linuxapp-icc/6b1bb5ec45cb44ee9745952c5d8836da/dpdk/x86_64-native-linuxapp-icc/include/generic/rte_cycles.h(18),
                 from /tmp/FC28_K4.16.3_ICC19.0.0/x86_64-native-linuxapp-icc/6b1bb5ec45cb44ee9745952c5d8836da/dpdk/x86_64-native-linuxapp-icc/include/rte_cycles.h(13),
                 from /tmp/FC28_K4.16.3_ICC19.0.0/x86_64-native-linuxapp-icc/6b1bb5ec45cb44ee9745952c5d8836da/dpdk/app/test/test_rcu_qsbr.c(12):
/tmp/FC28_K4.16.3_ICC19.0.0/x86_64-native-linuxapp-icc/6b1bb5ec45cb44ee9745952c5d8836da/dpdk/x86_64-native-linuxapp-icc/include/rte_atomic.h(67): warning #159: declaration is incompatible with previous "rte_smp_mb" (declared at line 227 of "/tmp/FC28_K4.16.3_ICC19.0.0/x86_64-native-linuxapp-icc/6b1bb5ec45cb44ee9745952c5d8836da/dpdk/x86_64-native-linuxapp-icc/include/rte_rcu_qsbr.h")
  rte_smp_mb(void)
  ^

In file included from /tmp/FC28_K4.16.3_ICC19.0.0/x86_64-native-linuxapp-icc/6b1bb5ec45cb44ee9745952c5d8836da/dpdk/app/test/test_rcu_qsbr_perf.c(8):
/tmp/FC28_K4.16.3_ICC19.0.0/x86_64-native-linuxapp-icc/6b1bb5ec45cb44ee9745952c5d8836da/dpdk/x86_64-native-linuxapp-icc/include/rte_rcu_qsbr.h(227): warning #266: function "rte_smp_mb" declared implicitly
  	rte_smp_mb();
  	^

In file included from /tmp/FC28_K4.16.3_ICC19.0.0/x86_64-native-linuxapp-icc/6b1bb5ec45cb44ee9745952c5d8836da/dpdk/x86_64-native-linuxapp-icc/include/generic/rte_cycles.h(18),
                 from /tmp/FC28_K4.16.3_ICC19.0.0/x86_64-native-linuxapp-icc/6b1bb5ec45cb44ee9745952c5d8836da/dpdk/x86_64-native-linuxapp-icc/include/rte_cycles.h(13),
                 from /tmp/FC28_K4.16.3_ICC19.0.0/x86_64-native-linuxapp-icc/6b1bb5ec45cb44ee9745952c5d8836da/dpdk/app/test/test_rcu_qsbr_perf.c(12):
/tmp/FC28_K4.16.3_ICC19.0.0/x86_64-native-linuxapp-icc/6b1bb5ec45cb44ee9745952c5d8836da/dpdk/x86_64-native-linuxapp-icc/include/rte_atomic.h(67): warning #159: declaration is incompatible with previous "rte_smp_mb" (declared at line 227 of "/tmp/FC28_K4.16.3_ICC19.0.0/x86_64-native-linuxapp-icc/6b1bb5ec45cb44ee9745952c5d8836da/dpdk/x86_64-native-linuxapp-icc/include/rte_rcu_qsbr.h")
  rte_smp_mb(void)
  ^

  LD test
test_rcu_qsbr.o: In function `test_rcu_qsbr_synchronize_reader':

*Failed Build #23:
OS: SUSE12
Target: x86_64-native-linuxapp-gcc
  CC ifpga_fme_iperf.o
  CC ifpga_feature_dev.o
  CC skeleton_rawdev.o
  CC ifpga_fme_dperf.o
  CC skeleton_rawdev_test.o
  CC ifpga_fme_error.o
  PMDINFO dpaa2_cmdif.o.pmd.c
  CC dpaa2_cmdif.o.pmd.o
  CC ifpga_port.o
  CC ifpga_port_error.o
  LD dpaa2_cmdif.o
  CC opae_hw_api.o
  CC opae_ifpga_hw_api.o
  AR librte_pmd_dpaa2_cmdif.a
  INSTALL-LIB librte_pmd_dpaa2_cmdif.a
--
  CC test_kvargs.o
  CC test_bpf.o
  CC test_rcu_qsbr.o
In file included from /tmp/SUSE12_K3.7.10_GCC4.7.2/x86_64-native-linuxapp-gcc/6b1bb5ec45cb44ee9745952c5d8836da/dpdk/app/test/test_rcu_qsbr.c:8:0:
/tmp/SUSE12_K3.7.10_GCC4.7.2/x86_64-native-linuxapp-gcc/6b1bb5ec45cb44ee9745952c5d8836da/dpdk/x86_64-native-linuxapp-gcc/include/rte_rcu_qsbr.h: In function ‘rte_rcu_qsbr_thread_online’:
/tmp/SUSE12_K3.7.10_GCC4.7.2/x86_64-native-linuxapp-gcc/6b1bb5ec45cb44ee9745952c5d8836da/dpdk/x86_64-native-linuxapp-gcc/include/rte_rcu_qsbr.h:227:2: warning: implicit declaration of function ‘rte_smp_mb’ [-Wimplicit-function-declaration]
  rte_smp_mb();
  ^~~~~~~~~~
/tmp/SUSE12_K3.7.10_GCC4.7.2/x86_64-native-linuxapp-gcc/6b1bb5ec45cb44ee9745952c5d8836da/dpdk/x86_64-native-linuxapp-gcc/include/rte_rcu_qsbr.h:227:2: warning: nested extern declaration of ‘rte_smp_mb’ [-Wnested-externs]
  CC test_rcu_qsbr_perf.o
In file included from /tmp/SUSE12_K3.7.10_GCC4.7.2/x86_64-native-linuxapp-gcc/6b1bb5ec45cb44ee9745952c5d8836da/dpdk/x86_64-native-linuxapp-gcc/include/generic/rte_cycles.h:18:0,
                 from /tmp/SUSE12_K3.7.10_GCC4.7.2/x86_64-native-linuxapp-gcc/6b1bb5ec45cb44ee9745952c5d8836da/dpdk/x86_64-native-linuxapp-gcc/include/rte_cycles.h:13,
                 from /tmp/SUSE12_K3.7.10_GCC4.7.2/x86_64-native-linuxapp-gcc/6b1bb5ec45cb44ee9745952c5d8836da/dpdk/app/test/test_rcu_qsbr.c:12:
/tmp/SUSE12_K3.7.10_GCC4.7.2/x86_64-native-linuxapp-gcc/6b1bb5ec45cb44ee9745952c5d8836da/dpdk/x86_64-native-linuxapp-gcc/include/rte_atomic.h: At top level:
/tmp/SUSE12_K3.7.10_GCC4.7.2/x86_64-native-linuxapp-gcc/6b1bb5ec45cb44ee9745952c5d8836da/dpdk/x86_64-native-linuxapp-gcc/include/rte_atomic.h:67:1: warning: conflicting types for ‘rte_smp_mb’
 rte_smp_mb(void)
 ^~~~~~~~~~
/tmp/SUSE12_K3.7.10_GCC4.7.2/x86_64-native-linuxapp-gcc/6b1bb5ec45cb44ee9745952c5d8836da/dpdk/x86_64-native-linuxapp-gcc/include/rte_atomic.h:67:1: error: static declaration of ‘rte_smp_mb’ follows non-static declaration
In file included from /tmp/SUSE12_K3.7.10_GCC4.7.2/x86_64-native-linuxapp-gcc/6b1bb5ec45cb44ee9745952c5d8836da/dpdk/app/test/test_rcu_qsbr.c:8:0:
/tmp/SUSE12_K3.7.10_GCC4.7.2/x86_64-native-linuxapp-gcc/6b1bb5ec45cb44ee9745952c5d8836da/dpdk/x86_64-native-linuxapp-gcc/include/rte_rcu_qsbr.h:227:2: note: previous implicit declaration of ‘rte_smp_mb’ was here
  rte_smp_mb();
  ^~~~~~~~~~
/tmp/SUSE12_K3.7.10_GCC4.7.2/x86_64-native-linuxapp-gcc/6b1bb5ec45cb44ee9745952c5d8836da/dpdk/mk/internal/rte.compile-pre.mk:114: recipe for target 'test_rcu_qsbr.o' failed
make[5]: *** [test_rcu_qsbr.o] Error 1
make[5]: *** Waiting for unfinished jobs....
In file included from /tmp/SUSE12_K3.7.10_GCC4.7.2/x86_64-native-linuxapp-gcc/6b1bb5ec45cb44ee9745952c5d8836da/dpdk/app/test/test_rcu_qsbr_perf.c:8:0:
/tmp/SUSE12_K3.7.10_GCC4.7.2/x86_64-native-linuxapp-gcc/6b1bb5ec45cb44ee9745952c5d8836da/dpdk/x86_64-native-linuxapp-gcc/include/rte_rcu_qsbr.h: In function ‘rte_rcu_qsbr_thread_online’:
/tmp/SUSE12_K3.7.10_GCC4.7.2/x86_64-native-linuxapp-gcc/6b1bb5ec45cb44ee9745952c5d8836da/dpdk/x86_64-native-linuxapp-gcc/include/rte_rcu_qsbr.h:227:2: warning: implicit declaration of function ‘rte_smp_mb’ [-Wimplicit-function-declaration]
  rte_smp_mb();
  ^~~~~~~~~~
/tmp/SUSE12_K3.7.10_GCC4.7.2/x86_64-native-linuxapp-gcc/6b1bb5ec45cb44ee9745952c5d8836da/dpdk/x86_64-native-linuxapp-gcc/include/rte_rcu_qsbr.h:227:2: warning: nested extern declaration of ‘rte_smp_mb’ [-Wnested-externs]
In file included from /tmp/SUSE12_K3.7.10_GCC4.7.2/x86_64-native-linuxapp-gcc/6b1bb5ec45cb44ee9745952c5d8836da/dpdk/x86_64-native-linuxapp-gcc/include/generic/rte_cycles.h:18:0,
                 from /tmp/SUSE12_K3.7.10_GCC4.7.2/x86_64-native-linuxapp-gcc/6b1bb5ec45cb44ee9745952c5d8836da/dpdk/x86_64-native-linuxapp-gcc/include/rte_cycles.h:13,
                 from /tmp/SUSE12_K3.7.10_GCC4.7.2/x86_64-native-linuxapp-gcc/6b1bb5ec45cb44ee9745952c5d8836da/dpdk/app/test/test_rcu_qsbr_perf.c:12:
/tmp/SUSE12_K3.7.10_GCC4.7.2/x86_64-native-linuxapp-gcc/6b1bb5ec45cb44ee9745952c5d8836da/dpdk/x86_64-native-linuxapp-gcc/include/rte_atomic.h: At top level:
/tmp/SUSE12_K3.7.10_GCC4.7.2/x86_64-native-linuxapp-gcc/6b1bb5ec45cb44ee9745952c5d8836da/dpdk/x86_64-native-linuxapp-gcc/include/rte_atomic.h:67:1: warning: conflicting types for ‘rte_smp_mb’
 rte_smp_mb(void)
 ^~~~~~~~~~
/tmp/SUSE12_K3.7.10_GCC4.7.2/x86_64-native-linuxapp-gcc/6b1bb5ec45cb44ee9745952c5d8836da/dpdk/x86_64-native-linuxapp-gcc/include/rte_atomic.h:67:1: error: static declaration of ‘rte_smp_mb’ follows non-static declaration
In file included from /tmp/SUSE12_K3.7.10_GCC4.7.2/x86_64-native-linuxapp-gcc/6b1bb5ec45cb44ee9745952c5d8836da/dpdk/app/test/test_rcu_qsbr_perf.c:8:0:
/tmp/SUSE12_K3.7.10_GCC4.7.2/x86_64-native-linuxapp-gcc/6b1bb5ec45cb44ee9745952c5d8836da/dpdk/x86_64-native-linuxapp-gcc/include/rte_rcu_qsbr.h:227:2: note: previous implicit declaration of ‘rte_smp_mb’ was here
  rte_smp_mb();
  ^~~~~~~~~~
/tmp/SUSE12_K3.7.10_GCC4.7.2/x86_64-native-linuxapp-gcc/6b1bb5ec45cb44ee9745952c5d8836da/dpdk/mk/internal/rte.compile-pre.mk:114: recipe for target 'test_rcu_qsbr_perf.o' failed
make[5]: *** [test_rcu_qsbr_perf.o] Error 1
/tmp/SUSE12_K3.7.10_GCC4.7.2/x86_64-native-linuxapp-gcc/6b1bb5ec45cb44ee9745952c5d8836da/dpdk/mk/rte.subdir.mk:35: recipe for target 'test' failed
make[4]: *** [test] Error 2
/tmp/SUSE12_K3.7.10_GCC4.7.2/x86_64-native-linuxapp-gcc/6b1bb5ec45cb44ee9745952c5d8836da/dpdk/mk/rte.sdkbuild.mk:46: recipe for target 'app' failed
make[3]: *** [app] Error 2
/tmp/SUSE12_K3.7.10_GCC4.7.2/x86_64-native-linuxapp-gcc/6b1bb5ec45cb44ee9745952c5d8836da/dpdk/mk/rte.sdkroot.mk:98: recipe for target 'all' failed
make[2]: *** [all] Error 2
/tmp/SUSE12_K3.7.10_GCC4.7.2/x86_64-native-linuxapp-gcc/6b1bb5ec45cb44ee9745952c5d8836da/dpdk/mk/rte.sdkinstall.mk:60: recipe for target 'pre_install' failed
make[1]: *** [pre_install] Error 2
/tmp/SUSE12_K3.7.10_GCC4.7.2/x86_64-native-linuxapp-gcc/6b1bb5ec45cb44ee9745952c5d8836da/dpdk/mk/rte.sdkroot.mk:77: recipe for target 'install' failed
make: *** [install] Error 2

*Failed Build #24:
OS: CENTOS76
Target: x86_64-native-linuxapp-gcc
  CC ifpga_fme.o
  CC ifpga_fme_iperf.o
  CC ifpga_fme_dperf.o
  PMDINFO dpaa2_cmdif.o.pmd.c
  CC dpaa2_cmdif.o.pmd.o
  CC ifpga_fme_error.o
  LD dpaa2_cmdif.o
  AR librte_pmd_dpaa2_cmdif.a
  INSTALL-LIB librte_pmd_dpaa2_cmdif.a
  CC ifpga_port.o
  PMDINFO skeleton_rawdev.o.pmd.c
  CC skeleton_rawdev.o.pmd.o
  CC ifpga_port_error.o
  CC opae_hw_api.o
  CC opae_ifpga_hw_api.o
  CC opae_debug.o
  LD skeleton_rawdev.o
  CC ifpga_fme_pr.o
--
  CC test_kvargs.o
  CC test_bpf.o
  CC test_rcu_qsbr.o
In file included from /tmp/CENTOS76_K3.10.0_GCC4.8.5/x86_64-native-linuxapp-gcc/6b1bb5ec45cb44ee9745952c5d8836da/dpdk/app/test/test_rcu_qsbr.c:8:0:
/tmp/CENTOS76_K3.10.0_GCC4.8.5/x86_64-native-linuxapp-gcc/6b1bb5ec45cb44ee9745952c5d8836da/dpdk/x86_64-native-linuxapp-gcc/include/rte_rcu_qsbr.h: In function ‘rte_rcu_qsbr_thread_online’:
/tmp/CENTOS76_K3.10.0_GCC4.8.5/x86_64-native-linuxapp-gcc/6b1bb5ec45cb44ee9745952c5d8836da/dpdk/x86_64-native-linuxapp-gcc/include/rte_rcu_qsbr.h:227:2: warning: implicit declaration of function ‘rte_smp_mb’ [-Wimplicit-function-declaration]
  rte_smp_mb();
  ^
/tmp/CENTOS76_K3.10.0_GCC4.8.5/x86_64-native-linuxapp-gcc/6b1bb5ec45cb44ee9745952c5d8836da/dpdk/x86_64-native-linuxapp-gcc/include/rte_rcu_qsbr.h:227:2: warning: nested extern declaration of ‘rte_smp_mb’ [-Wnested-externs]
In file included from /tmp/CENTOS76_K3.10.0_GCC4.8.5/x86_64-native-linuxapp-gcc/6b1bb5ec45cb44ee9745952c5d8836da/dpdk/x86_64-native-linuxapp-gcc/include/generic/rte_cycles.h:18:0,
                 from /tmp/CENTOS76_K3.10.0_GCC4.8.5/x86_64-native-linuxapp-gcc/6b1bb5ec45cb44ee9745952c5d8836da/dpdk/x86_64-native-linuxapp-gcc/include/rte_cycles.h:13,
                 from /tmp/CENTOS76_K3.10.0_GCC4.8.5/x86_64-native-linuxapp-gcc/6b1bb5ec45cb44ee9745952c5d8836da/dpdk/app/test/test_rcu_qsbr.c:12:
/tmp/CENTOS76_K3.10.0_GCC4.8.5/x86_64-native-linuxapp-gcc/6b1bb5ec45cb44ee9745952c5d8836da/dpdk/x86_64-native-linuxapp-gcc/include/rte_atomic.h: At top level:
/tmp/CENTOS76_K3.10.0_GCC4.8.5/x86_64-native-linuxapp-gcc/6b1bb5ec45cb44ee9745952c5d8836da/dpdk/x86_64-native-linuxapp-gcc/include/rte_atomic.h:67:1: warning: conflicting types for ‘rte_smp_mb’ [enabled by default]
 rte_smp_mb(void)
 ^
/tmp/CENTOS76_K3.10.0_GCC4.8.5/x86_64-native-linuxapp-gcc/6b1bb5ec45cb44ee9745952c5d8836da/dpdk/x86_64-native-linuxapp-gcc/include/rte_atomic.h:67:1: error: static declaration of ‘rte_smp_mb’ follows non-static declaration
In file included from /tmp/CENTOS76_K3.10.0_GCC4.8.5/x86_64-native-linuxapp-gcc/6b1bb5ec45cb44ee9745952c5d8836da/dpdk/app/test/test_rcu_qsbr.c:8:0:
/tmp/CENTOS76_K3.10.0_GCC4.8.5/x86_64-native-linuxapp-gcc/6b1bb5ec45cb44ee9745952c5d8836da/dpdk/x86_64-native-linuxapp-gcc/include/rte_rcu_qsbr.h:227:2: note: previous implicit declaration of ‘rte_smp_mb’ was here
  rte_smp_mb();
  ^
make[5]: *** [test_rcu_qsbr.o] Error 1

DPDK STV team


More information about the test-report mailing list