[dpdk-test-report] |FAILURE| pw51826-51831 [PATCH] [v6, 1/8] eal: eal stub to add windows support

dpdklab at iol.unh.edu dpdklab at iol.unh.edu
Thu Mar 28 03:44:02 CET 2019

Test-Label: Performance-Testing
Test-Status: FAILURE

_build patch failure_

Submitter: Anand Rawat <anand.rawat at intel.com>
Date: Thursday, March 28 2019 02:21:08 
Applied on: CommitID:7abe4a24cc3f0ff011599e2783590564fdff59eb
Apply patch set 51826-51831 failed:

Configuration done using x86_64-native-linuxapp-gcc
== Build lib
== Build lib/librte_kvargs
  CC rte_kvargs.o
In file included from /var/lib/jenkins/workspace/Apply-Custom-Patch-Set/dpdk/lib/librte_eal/common/include/rte_string_fns.h:21:0,
                 from /var/lib/jenkins/workspace/Apply-Custom-Patch-Set/dpdk/lib/librte_kvargs/rte_kvargs.c:9:
/var/lib/jenkins/workspace/Apply-Custom-Patch-Set/dpdk/lib/librte_eal/common/include/rte_common.h:28:20: fatal error: rte_os.h: No such file or directory
 #include <rte_os.h>
compilation terminated.
make[5]: *** [rte_kvargs.o] Error 1
make[4]: *** [librte_kvargs] Error 2
make[3]: *** [lib] Error 2
make[2]: *** [all] Error 2
make[1]: *** [pre_install] Error 2
make: *** [install] Error 2


UNH-IOL DPDK Performance Test Lab

More information about the test-report mailing list